##TITLE=$$ Begin of the data block
##JCAMP-DX=5.00 $$ ACD/SpecManager v 10.08
##SPECTROMETER/DATA SYSTEM=Alpha
##DATE=23 Oct 2014 09:00:34
##DATA TYPE=INFRARED SPECTRUM
##DATA CLASS=XYDATA
##ORIGIN=
##OWNER=
##NPOINTS=1667
##FIRSTX=599.57470703
##LASTX=3997.16503906
##MAXX=3997.16503906
##MINX=599.57470703
##MAXY=0.98115563
##MINY=0.26007053
##XFACTOR=1.0000000000
##YFACTOR=1.000000000000000e-9
##FIRSTY=0.54419470
##DELTAX=2.03937006
##XUNITS=1/CM
##YUNITS=ARBITRARY UNITS
##XYDATA=(X++(Y..Y))
599.6E44194698r789347j2822688j3529897j0489583l693491M960656J1008531J0789216
$$ 544194698 534405351 521582663 508052766 497563183 493869692 498830348 509838879 520628095
615.9E20628095O189108J534581j508355l680706n519987p289052r061396r931385
$$ 520628095 526817203 528351784 526843429 523162723 517642736 510353684 501292288 491360903
632.2D91360903p875860m009664k937317n092382o880224o832957n699337m055411
$$ 491360903 483485043 479475379 476538062 471445680 464565456 457732499 452033162 447977751
648.5D47977751j807093P23630L112197M983544O125301O890536P335156O942183Q799016
$$ 447977751 446170658 446894288 450006485 454990029 461115330 468005866 475341022 482283205 491082221
666.9D91082221J3502389J2017012J1071086J2935460J3651490J3410628J2820363
$$ 491082221 504584610 516601622 527672708 540608168 554259658 567670286 580490649
681.1E80490649J2019932J0941923R607494Q363306P610381P042110O121635M528940
$$ 580490649 592510581 603452504 613059998 621423304 629033685 636075795 642197430 646726370
697.5F46726370K616167M32134j649261j322508K128661M989386N772769O086945N092383
$$ 646726370 649342537 649774671 648125410 646802902 648931563 653920949 659693718 665780663 670873046
715.8F70873046K814054O74129j104772k698600l895820m429996m528284n100548o273746
$$ 670873046 673687100 674361229 673256457 670557857 666662037 662232041 657703757 652603209 646329463
734.2F46329463p309676q835196j1262596j3321280j4050544j3852357j1975885n396128
$$ 646329463 639019787 630184591 618921995 605600715 591550171 577697814 565721929 560325801
750.5E60325801N771876J4732480J5901267R776831j863897j6097605k8271854l3906937
$$ 560325801 566097677 580830157 596731424 606508255 604644358 588546753 560274899 526367962
766.8E26367962k7354806l200949K8040082L8866341K3681462Q680284J3604343L3128500
$$ 526367962 499013156 495812207 523852289 562718630 586400092 595080376 608684719 641813219
783.1F41813219M6648264M1536927K6431620J3957500O308019J11223o765962j3209700
$$ 641813219 688461483 729998410 756430030 770387530 776695549 776806772 770040810 756831110
799.4G56831110j6441226j6738475j7282903j9450545k4144471l1856000l4714103
$$ 756831110 740389884 723651409 706368506 686917961 662773490 630917490 596203387
813.7E96203387j7344415J6992509M0830016M1724742L2050907K1975458J3592243
$$ 596203387 578858972 595851481 636681497 678406239 710457146 732432604 746024847
828G46024847P681429M032433J459420o74844k557635n370557r274602j2548685j3090730
$$ 746024847 753706276 757738709 759198129 758523285 755965650 750595093 741320491 728771806 715681076
846.3G15681076p910013K935350J2606740J5747130J3734162Q991360L465176K4617
$$ 715681076 707771063 710706413 723313153 739060283 752794445 761785805 765250981 765275598
862.7G65275598P48276O309390J4503062J9182265J7199635J2665868R560466P178247
$$ 765275598 766023874 772333264 786836326 806018591 823218226 835884094 845444560 852622807
879H52622807M542410K453328J163542L92198j33156p79152j594842k531528l565789
$$ 852622807 857165217 859618545 860782087 861174285 861041129 860261977 858667135 856135607 852569818
897.3H52569818m645764n964697p872343j0269761j2617826j4374853j4854609j3029159
$$ 852569818 847924054 841959357 834087014 823817253 811199427 796824574 781969965 768940806
913.6G68940806q470535k426386K864301N745531N187153J116217m184008p616580
$$ 768940806 760470271 758043885 760908186 766653717 771840870 772957087 768773079 761156499
930G61156499q130192p446051q009315j0018408j0608017p133007k272427l23832n53728
$$ 761156499 753026307 745580256 737570941 727552533 716944516 709811509 707539082 707215250 706661522
948.3G06661522q94427j183152j453519j815200k172172j686692L74377K964079M077613
$$ 706661522 705767095 704583943 703130424 701315224 699143052 697456360 697830737 700794816 704872429
966.7G04872429L518761K535641J681208Q10385j82390j390040k632976l024935r64344
$$ 704872429 708391190 710926831 712608039 713418424 713236034 711845994 709213018 706188083 705223739
985G05223739L686905P076979N546152Q12531l425777n990327p502973q592903r789586
$$ 705223739 708910644 715987623 721533775 722346306 718920529 712930202 705427229 696834326 687044740
1003.4F87044740j1733413j4919877j9635618k6329934l4345568l7571907k5854945
$$ 687044740 675311327 660391450 640755832 614425898 580080330 542508423 516653478
1017.6E16653478J769364K7023613K8754533Q853257j3198913k4583459k6263475k3677945
$$ 516653478 518422842 545446455 574200988 583054245 569855332 545271873 519008398 495330453
1034D95330453j9380540j3100266n367995q63850l673881j0628730j6161621j8753856
$$ 495330453 475949913 462849647 457481652 456617802 452943921 442315191 426153570 407399714
1050.3D07399714j9331306j8627972j6642779j3103813q594274m173190o75410J104445
$$ 407399714 388068408 369440436 352797657 339693844 331099570 326926380 326250970 327355415
1066.6C27355415Q93622m15742j257241m78476K183646N859554Q973956J2103140K2385418
$$ 327355415 328249037 327833295 326576054 326097578 328281224 334140778 343114734 355217874 377603292
1084.9C77603292M7526330P5842887Q2088232O3413084L9062321K0102680N156279
$$ 377603292 425129622 500972509 583060741 646473825 685536146 705638826 710795105
1099.2G10795105q206904j8884480k2502304j7553985j0140717n371451l215253n808771
$$ 710795105 702588201 683703721 661201417 643647432 633506715 628135264 624920011 619111240
1115.5F19111240j4329434k4083793l0051648l1479895l0526132k8979033k6921421
$$ 619111240 604781806 580698013 550646365 519166470 488640338 459661305 432739884
1129.8D32739884k3601443j8726706j2609303n988062J61797N017161P978767Q590132
$$ 432739884 409138441 390411735 377802432 371814370 371976167 376993328 384972095 393562227
1146.1C93562227O676764K428710l343463r303838j4034986j6334862j5847265j3085962
$$ 393562227 400238991 402667701 399324238 390020400 375985414 359650552 343803287 330717325
1162.4C30717325r074509m741758q54433K068460M070402N181193N259454M979879
$$ 330717325 321642816 316901058 316046625 318115085 322185487 327366680 332626134 337606013
1178.8C37606013N958259P844955Q005917N646139K384067n48065k897471n281687
$$ 337606013 343564272 351409227 359415144 365061283 367445350 366897285 363999814 358718127
1195.1C58718127q545995j1568904j1803358q598119m177005j840889m106283r997010
$$ 358718127 350172132 338603228 326799870 318201751 314024746 312183857 308077574 298080564
1211.4B98080564j4587313j3805956q299232j317530M703193Q685381J0450691J0337621
$$ 298080564 283493251 269687295 261388063 260070533 264773726 273459107 283909798 294247419
1227.7B94247419R078085P464498O714911Q979439J6996891L0451625M0823519L7749321
$$ 294247419 303325504 310790002 317504913 326484352 343481243 373932868 414756387 452505708
1244D52505708K1978974L843725q391410j1223048k804846J5373290L3777565M0481746
$$ 452505708 474484682 478328407 469936997 458713949 455909103 471282393 505059958 545541704
1260.3E45541704L4056484K3135007J4575839R744048Q740604J0857046J2994587J2333691
$$ 545541704 579598188 602733195 617309034 627053082 635793686 646650732 659645319 671979010
1276.7F71979010R190619N435467K333224L51071n51403r08494j850485m445374r354890
$$ 671979010 681169629 686605096 688938320 689289391 688737988 687829494 685979009 681533635 672178745
1295F72178745j6561806k4017453k8232515k8108120k5343776j8639147m286289J4241040
$$ 672178745 655616939 631599486 603366971 575258851 549915075 531275928 526989639 541230679
1311.3E41230679K5478601K3659587J8419385K1478891L1058550L6055029L1606495
$$ 541230679 566709280 590368867 608788252 630267143 661325693 697380722 728987217
1325.6G28987217K4016082J8747926J3547838P097482J836062j143575k605915l219902
$$ 728987217 753003299 771751225 785299063 792396545 794232607 793089032 790483117 787263215
1341.9G87263215l640414m409909n235791n469740m924714l870011k270400j9491K361596
$$ 787263215 783622801 779212892 773977101 768507361 763582647 759712636 757442236 757422745 759784341
1360.3G59784341M576802N807459N749107N479157N030513M155278K771795P55727
$$ 759784341 764361143 770168602 775917709 781396866 786427379 790582657 793354452 794110179
1376.6G94110179j483202l924966o812036j0036528j3667107j3620793o820143J594067
$$ 794110179 792626977 788702011 781889975 771853447 758186340 744565547 737745404 739339471
1392.9G39339471O968915O644547L385425j550257j0826707k8222263m9517989o3525856
$$ 739339471 746308386 752952933 756338358 754788101 743961394 715739131 666221142 602695286
1409.2F02695286n6408584j9185126K6187361O1531663Q1855058O2209964L2865942
$$ 602695286 546286702 527101576 553288937 614820600 696675658 758885622 791751564
1423.5G91751564J7000615N412877l132403q080363q909166q644522o594181j563966
$$ 791751564 808752179 814165056 811032653 802952290 794043124 785398602 778804421 777240455
1439.8G77240455J929820K484977K37703k757668m351974m323840l505885j612783
$$ 777240455 779170275 781655252 781892955 779135287 774783313 770459473 766953588 765340805
1456.1G65340805L79801R28879J634836L761589N944908N350649L442288M02093n554438
$$ 765340805 765720606 766649485 768284321 772045910 777990818 783341467 786783755 787185848 781631410
1474.5G81631410j1000275k243698K0829260L4306228K5913954J2769461L792941l276109
$$ 781631410 770631135 768387437 789216697 823522925 849436879 862206340 865999281 862723172
1490.8H62723172o753326j0172844j6609490k2320866k3878396k4465382l4597516
$$ 862723172 855969846 845797002 829187512 806866646 782988250 758522868 723925352
1505.1G23925352o5322697o6009462m6848834l7770450k9177576k6925236l0234337
$$ 723925352 658602655 592593193 545744359 507973909 478796333 451871097 421636760
1519.3D21636760l8942188l5855800k1512448j1969209k665699Q716226K7322680L9212376
$$ 421636760 382694572 346838772 325326324 313357115 310691416 319407642 346730322 385942698
1535.7C85942698M5628428P2414577Q1515014N6472659M5599640L9908170L8028598
$$ 385942698 431571126 503985703 585500717 641973376 687573016 727481186 765509784
1549.9G65509784L4318567K8011381K2070944K1732808K2394001J0936201O030678
$$ 765509784 799828351 827839732 849910676 871643484 894037485 904973686 911004364
1564.2I11004364M968763L302991J830519K01404j547218m311800o504178q663416
$$ 911004364 915973127 919276118 921106637 921308041 919760823 915449023 908944845 900281429
1580.5I00281429j4346242k3331403l5109342m7803580n4540396m6528459k4169564
$$ 900281429 885935187 862603784 827494442 779690862 725150466 678622007 654452443
1594.8F54452443L319562K4581790L3804237L1804443K3010611J2395680L101528j751482
$$ 654452443 657772005 682353795 716158032 747962475 770973086 783368766 786470294 784718812
1611.1G84718812R2268R340107K3691237K5767326K0233095J7369747J1589050N927146
$$ 784718812 784811080 794151187 817842424 843609750 863842845 881212592 892801642 898728788
1627.4H98728788K906203R43363o56426k637804k695262l45230J059532J167893N06819
$$ 898728788 901634991 902578354 901921928 899284124 896588862 896243632 897303164 898471057 898977876
1645.8H98977876n16296q23319k107143n055845m955292m936218o899118r410441j0389030
$$ 898977876 898461580 897638261 895531118 890475273 885519981 880583763 873684645 864274204 853885174
1664.1H53885174r480119j1685789j6602456j7002165k1135152k9287159l2182634
$$ 853885174 844405055 832719266 816116810 799114645 777979493 748692334 716509700
1678.4G16509700l4923852m6664536p4100911p1627081n7336867n7932972m7767312
$$ 716509700 681585848 634921312 560820401 489193320 431856453 373923481 326156169
1692.7C26156169l6220848k4090112l851711J5221268K1619528K7162641L2457501
$$ 326156169 289935321 265845209 261993498 277214766 298834294 325996935 358454436
1707C58454436K5805086J5904933P986248J358300n983621j1111200j1890113j1995345
$$ 358454436 384259522 400164455 408150703 409509003 403525382 392414182 380524069 368528724
1723.3C68528724r743154k562464O113410J5150041L0616224M2695820L9815277M7379911
$$ 368528724 358785570 356223106 362336516 377486557 408102781 450798601 490613878 537993789
1739.6E37993789N6025386N4451465N2594364M9997210M7874928M1028678K8587461
$$ 537993789 594019175 648470640 701065004 751062214 798937142 839965820 868553281
1753.9H68553281K0823955J6738296J2115002R287595O856382M604101L785849L088892
$$ 868553281 889377236 906115532 918230534 927518129 934374511 938978612 942764461 945853353
1770.2I45853353K646565K047777J478791J172543R68933P24256O69003Q67486R53138
$$ 945853353 948499918 950547695 952026486 953199029 954167962 954892218 955561221 956428707 957381845
1788.5I57381845R87410J019180R74595Q52168Q83877Q32141Q37981Q53658Q30829
$$ 957381845 958369255 959388435 960363030 961215198 962099075 962931216 963769197 964622855 965453684
1806.9I65453684Q11398P32899P03931O49571O77109O96242O56545O04451P21752P11978
$$ 965453684 966265082 966997981 967701912 968351483 969028592 969724834 970381379 970985830 971707582 972419560
1827.3I72419560O35624P59303P67231O50287N04553M21048L36647L00109L06726L61144
$$ 972419560 973055184 973814487 974581718 975232005 975736558 976157606 976494253 976794362 977101088 977462232
1847.7I77462232L23415K46823K55584K23220J43945Q9467L7551k7717q5055j83285
$$ 977462232 977785647 978032470 978288054 978511274 978655219 978744686 978782237 978754520 978669465 978486180
1868.1I78486180j38819j27971k13087k58028k46108j30772q107J6749o1750j76847
$$ 978486180 978347361 978219390 978006303 977748275 977502167 977371395 977363288 977380037 977318287 977141440
1888.5I77141440l34978n50151q40664j047969j128197r48488l00706N20051R59277
$$ 977141440 976806462 976256311 975415647 974367678 973239481 972290993 971990287 972510338 973469615
1906.8I73469615R78291R59158Q77678O68466M71354M20392M21404M08829L59892K11001
$$ 973469615 974447906 975407064 976284742 976953208 977424562 977844954 978266358 978675187 979035079 979246080
1927.2I79246080Q8334P6771J57118J99914R1850m172R477O6936K11120K29239L2902
$$ 979246080 979334414 979411185 979568303 979768217 979860067 979855895 979865372 979932308 980143428 980372667 980405569
1949.7I80405569j02222l4690J1265n7578l4213n781l2604L3796J35064J19030L5227
$$ 980405569 980303347 980268657 980279922 980222344 980188131 980182350 980149746 980183542 980318606 980437636 980472863
1972.1I80472863n5969j28210j75833j71960j02699l0219J1027l7730j10686p9334
$$ 980472863 980416894 980288684 980112851 979940891 979838192 979807973 979819000 979781270 979670584 979591250
1992.5I79591250j132K1160N1498L7730l2127o6340q5890p5639o3538p7188n2274l0994
$$ 979591250 979590118 979611278 979662776 979700506 979668379 979602039 979516149 979440510 979376972 979299784 979247510 979216516
2017I79216516m7028n96q345j02818j52707j26004n6326k4081k7418l1650p2837j60515
$$ 979216516 979169488 979168892 979160547 979057729 978905022 978779018 978722692 978698611 978671193 978639543 978566706 978406191
2041.4I78406191j64807m7624Q3625J22905J39415J65701J78337K30670K26975J45912
$$ 978406191 978241384 978193760 978277385 978400290 978539705 978705406 978883743 979114413 979341388 979487300
2061.8I79487300O3360K1755M1366R1076P0810J8716L0994K3187j252N5194P4267k1696
$$ 979487300 979550660 979572415 979613781 979704857 979775667 979794383 979825377 979848564 979847312 979902506 979976773 979955077
2086.3I79955077p9751j10030j30177p1823r179M053K1636J4842l994J2100J4305N5552
$$ 979955077 979875326 979765296 979635119 979563296 979554117 979558170 979579806 979594648 979590654 979602754 979617059 979672611
2110.8I79672611J12056J29402J05560M947o2644L8802J76728J85311J37567J13547
$$ 979672611 979784667 979914069 980019629 980024576 979961932 980000734 980177462 980362773 980500340 980613887
2131.2I80613887R8408O1869L7372L9101L7253O7949R3758J2338l5107N6267P2539
$$ 980613887 980712295 980774164 980811536 980850637 980887890 980955839 981049597 981061935 981026828 981083095 981155634
2153.6I81155634m1485r8824r1017j04785j13070j24275j39058q7738m2617m7624m9055
$$ 981155634 981114149 981015325 980924308 980819523 980706453 980582178 980443120 980355382 980312765 980265141 980216086
2176I80216086j07050j27316o7591p7725j66714k43544j76251r8706j75893j51634
$$ 980216086 980109036 979981720 979914129 979836404 979669690 979426146 979249895 979151189 978975296 978823662
2196.4I78823662K8372O3419J6987N3644J05083J34290R3639M6014L3141Q881p570
$$ 978823662 978852034 978915453 978932440 978986084 979091167 979225457 979319096 979365110 979398251 979407132 979399562
2218.9I79399562l9160j7763R2328J22428J01387R3222J4484j5736M2379P7188J02699
$$ 979399562 979360402 979342639 979434967 979557395 979658782 979752004 979766488 979750752 979793131 979870319 979973018
2241.3I79973018P5102o4552j13964n0068j24216k77638k81513j05441M232r9778j49429
$$ 979973018 980048120 979983568 979869604 979819536 979695320 979417682 979136169 979030728 979034960 978935182 978785753
2263.7I78785753n8949o6936r8109j4603k7001j40548j47164j12891r1016m2200m1783
$$ 978785753 978726804 978659868 978561759 978547156 978520155 978379607 978232443 978119552 978028536 977986336 977944553
2286.2I77944553j15693j08719N2989J13666J2100Q404J52349K17319J20938Q0168
$$ 977944553 977828860 977720141 977773130 977886796 977898896 977907300 978059649 978276968 978397906 978478074
2306.5I78478074J90854K83420K05636J11044J71303J97590J42991J85609K22445J20699
$$ 978478074 978668928 978952348 979157984 979269028 979440331 979637921 979780912 979966521 980188966 980309665
2326.9I80309665r0480j66177M1365R9659j02341k33352k08378r0361o7234r9659R9063
$$ 980309665 980219185 980053008 980094373 980194032 980091691 979858339 979649961 979559600 979492366 979392707 979491770
2349.4I79491770M40061N90086L55363M2022j90259k93850j12951K2650m3989j94013
$$ 979491770 979931831 980521917 980877280 980919302 980729043 980435193 980322242 980344892 980300903 980106890
2369.8I80106890k66254k01642k06352k26378r9242Q9705J65344R8943M1724O6459
$$ 980106890 979840636 979638994 979432642 979206264 979107022 979196727 979362071 979461014 979502738 979569197
2390.2I79569197J48177J83165O9916L0220J36673J76132P9036m2439K1219J17898
$$ 979569197 979717374 979900539 979970455 980000675 980137348 980313480 980392516 980350077 980371296 980489194
2410.6I80489194L7611j2577M7624M7505J1862K6524%l2187K6107M4108o7771j70171
$$ 980489194 980526805 980514228 980561852 980609357 980621219 980647743 980647743 980615556 980641663 980685771 980618000 980447829
2435I80447829j32144k2173O2824Q5115L4154K265l3439j40309k07305j09851N6326
$$ 980447829 980315685 980293512 980356336 980441451 980475605 980477870 980444431 980304122 980096817 979986966 980043292
2457.5I80043292N9545o3777j52528j73629j42633j22309j47581j14084J4842N9009
$$ 980043292 980102837 980039060 979886532 979712903 979570270 979447961 979300380 979186296 979201138 979260147
2477.9I79260147l1412q5354m8041K7716P6532r834o3539M590j8657n5134k5034j9133
$$ 979260147 979228735 979143381 979095340 979123056 979199588 979189754 979126215 979130805 979112148 979057014 979031980 979012847
2502.3I79012847M113J9848j2994K9683J34230R5904p0870j23382j9073Q6427J12831
$$ 979012847 979016960 979036808 979023814 979053497 979187727 979283631 979212761 979089379 979070306 979156733 979269564
2524.8I79269564N7280p927k1696n9843p2360Q523N2989l3021j64569j24275k2650
$$ 979269564 979326844 979318917 979297221 979237378 979165018 979173541 979226530 979193509 979028940 978904665 978882015
2547.2I78882015o5446j19090j50681j48356o3240K801j7166j6808M1306O5743L8684
$$ 978882015 978816569 978697479 978546798 978398442 978335202 978338003 978320837 978304029 978345335 978411078 978449762
2569.6I78449762n365M7088J33216R0600n901q9169j75953k36690j83523n4240K4915
$$ 978449762 978444397 978491485 978624701 978715301 978709400 978620231 978444278 978207588 978024065 977969825 977994740
2592.1I77994740N4657J4723n4181J3352J36137J26004M4584m2796q7500j8894N1260
$$ 977994740 978049397 978064120 978009939 978023291 978159428 978285432 978330016 978287220 978199720 978180826 978232086
2614.5I78232086N2690K6167o5565k09868k11895p2002k7836p7128j19448j35481j16170
$$ 978232086 978284776 978310943 978245378 978035510 977823615 977751613 977723777 977646649 977527201 977391720 977275550
2636.9I77275550j17123r0182L219L0994k026J0133M2438L0995j6630l2187M828j0371
$$ 977275550 977158427 977068245 977071464 977102458 977100432 977110565 977153003 977183998 977167368 977135181 977140009 977129638
2661.4I77129638n5790m9591p0453m0352P7725R5009l2246k19702l27409k46107j14501
$$ 977129638 977073848 977024257 976953804 976913452 976991177 977086186 977053940 976834238 976506829 976260722 976146221
2683.8I76146221j13249j88946k02775j22309j3650O915j00077j45793o0618L160k2829
$$ 976146221 976032972 975844026 975641251 975518942 975505292 975512207 975412130 975266337 975205719 975208879 975186050
2706.3I75186050r0420j09494j48773k14219k46406l08871l46303l12030k60056k19583
$$ 975186050 975095630 974986136 974837363 974623144 974376738 974067867 973721564 973409534 973149478 972929895
2726.6I72929895j79589j56581l05712n16475m35173k74360l28064l67165l15666l16501
$$ 972929895 972750306 972593725 972288013 971771538 971336365 971062005 970733941 970366776 970051110 969734609
2747I69734609l08812k59876k28047k08318j90497q4221K8908j2398r1076m0412J37151
$$ 969734609 969425797 969165921 968937874 968729556 968539059 968454838 968483746 968471348 968380272 968339860 968477011
2769.5I68477011K26974J90735K31385L01302K58684J31011L9101R0181J80662J13964
$$ 968477011 968703985 968894720 969126105 969427407 969686091 969817102 969856203 969946384 970127046 970241010
2789.9I70241010m7266o3241N2869M7565r9182k35140k67208k62320l76761m54962
$$ 970241010 970193744 970130503 970183372 970230937 970131755 969896615 969629407 969367087 968990326 968535364
2810.3I68535364m45009o04868q36432q98122r13859j054764j218020j361728j530647
$$ 968535364 968090355 967485487 966649055 965750933 964837074 963782310 962564290 961202562 959671915
2828.6I59671915j717925k014697k285123k260208j989067j934349k756238m496575
$$ 959671915 957953990 955939293 953654170 951393962 949404895 947470546 944714308 940217733
2844.9I40217733o001114n387784k597987m00424l00110j035690j603424k003074k373338
$$ 940217733 934216619 928828835 926230848 925830424 925530314 924494624 922891200 920888126 918514788
2863.3I18514788k769887l109992l228664k828777j658380J52349K036751L080010
$$ 918514788 915744901 912634909 909406245 906577468 904919088 905071437 907108188 910188198
2879.6I10188198K509117N58615j815975m068494o015658p116318o639898m631757
$$ 910188198 912697315 913255930 911439955 907371461 901355803 894239485 887599587 882967830
2895.9H82967830k247155p60794m11331o15597j160622k362191m386485o559193p062018
$$ 882967830 880720675 879959881 879548550 878932953 877772331 875410140 871023655 864464462 857402444
2914.3H57402444m893780j619577O04510J305461J061499K41220q86679j923740k780914
$$ 857402444 852508664 850889087 851493597 852799058 853860557 854101777 853215098 851291358 848510444
2932.6H48510444l486514l670931l082037k259135k037227k314866k534866k810478
$$ 848510444 845023930 841352999 838270962 836011827 833974600 831659734 829124868 826314390
2948.9H26314390l242791l717244m038095l503204j478195K152384P026970J1660099
$$ 826314390 823071599 819354355 815316260 811813056 810334861 812487245 819514215 831174314
2965.2H31174314J4063835J3978958J2689591J1132478R648622Q407414P390797O568431
$$ 831174314 845238149 859217107 871906698 883039176 892687798 901095212 908486009 915054440
2981.6I15054440N952120N390406M842401M301786L674507L056824K570093K254188
$$ 915054440 921006560 926396966 931239367 935541153 939215660 942272484 944842577 947096765
2997.9I47096765J977921J635789J405895J281798J008391P06971O59347P43031P05540
$$ 947096765 949074686 950710475 952116370 953398168 954406559 955113530 955772877 956515908 957221448
3016.2I57221448M50015N2810l71814q24868j174987j321435j442909j408398j136243
$$ 957221448 957671463 957724273 957352459 956527591 955352604 954031169 952588260 951179862 950043619
3034.6I50043619j116395j296640j038313j79648Q65102J517296J636803J582384J398086
$$ 950043619 948927224 947630584 946592271 946412623 947277725 948795021 950431824 952014208 953412294
3052.9I53412294R71318O88791P68006Q74340Q86381R29415J018226J108170J077950
$$ 953412294 954383612 955072403 955840409 956714749 957601130 958530545 959548771 960656941 961734891
3071.3I61734891R30071P09295N29349N37753N36799M78626M33624K58743L8803m5121
$$ 961734891 962664962 963374257 963903606 964441359 964978158 965456784 965890408 966149151 966187954 966142833
3091.7I66142833q4221j85907l24428m66049n53310o40511q27194r56296r39250r97007
$$ 966142833 966058612 965872705 965548277 965082228 964528918 963888407 963061213 962104917 961165667 960168660
3112.1I60168660j032114p69616m94956l15607k205L11434N43952Q01682J083970J194775
$$ 960168660 959136546 958366930 957871974 957556367 957554162 957865596 958409548 959211230 960295200 961489975
3132.5I61489975J055897R47118R95874R72152P61151N67853L73126J12831R3937K82407
$$ 961489975 962545872 963492990 964488864 965461016 966222167 966790020 967163146 967275977 967369914 967652321
3152.9I67652321K10225r5307k40446k55286l01004k86460k32100m18484o84619p02977
$$ 967652321 967862546 967767239 967526793 967271507 966970503 966684043 966451943 966033459 965348840 964645863
3173.3I64645863p18534r09388j092971j109063r53377o98566m85003l37959k14338
$$ 964645863 963927329 963017941 961924970 960815907 959862530 959163964 958678961 958341002 958126664
3191.6I58126664n5432J77383L11017L96848M88818M07576J47820r2149j63376k31326
$$ 958126664 958071232 958248615 958559632 958956480 959445298 959852874 960000694 959908545 959745169 959513843
3212I59513843n05328p66695p08639n87166o72459o73890n95987q00789j103103j119792
$$ 959513843 959008515 958241820 957533181 956946015 956273556 955599666 955003679 954202890 953099787 951979995
3232.4I51979995r00507p89821r34959j091599j110673j094103j126647j231968j373172
$$ 951979995 951079488 950289667 949354708 948263109 947152436 946058333 944931686 943699718 942326546
3250.7I42326546j408160j419604j550078j662612j726806j941145k308786k427578
$$ 942326546 940918386 939498782 937948704 936286092 934559286 932618141 930309355 927881777
3267.1I27881777k325952k480328k904475l358960l716945l993452m291713m635513
$$ 927881777 925555825 923075497 920171022 916812062 913095117 909101665 904809952 900174439
3283.4I00174439m979909n399584n966842o544114o839811o800950o794929o843389
$$ 900174439 895194530 889794946 883828104 877283990 870444179 863643229 856848300 850004911
3299.7H50004911o878435p340551q276045r079277q917392p327974m815638k295017
$$ 850004911 843126476 835785925 827509880 818430603 809513211 802185237 797369599 795074582
3316G95074582o97911m00126n32269J86920K491295O049753R536028J1535406J1625409
$$ 795074582 794376671 793976545 793444276 793631196 796122491 802172244 811708272 823243678 834869087
3334.4H34869087J0531306R126723P894158O970167O238461N595326N169988M991829
$$ 834869087 845400393 854527116 862421274 869391441 875629902 881225228 886395216 891387045
3350.7H91387045M854024M686057M479230M178405L912806L812790L773451L622949
$$ 891387045 896241069 900927126 905406356 909584761 913497567 917310357 921083808 924706757
3367I24706757L340066L232538L232897K893388K409160K169549K132714J988709J575530
$$ 924706757 928046823 931279361 934512258 937405646 939814806 941984355 944117069 946105778 947681308
3385.3I47681308J194954J119315J322627J507879J258909P10309N81741J033247J251399
$$ 947681308 948876262 949995577 951318204 952826083 954084992 954795301 955377042 956410289 957661688
3403.7I57661688Q88467M79639M10437N65410O07848N50270M73440K76148J57416J43588
$$ 957661688 958550155 959029794 959440231 960005641 960613489 961163759 961637199 961913347 962070763 962214351
3424.1I62214351J4186q2314m3691k2888n2392o6638N2750L15904M55261L10659J64449
$$ 962214351 962228537 962146223 962102532 962079644 962027252 961960614 962013364 962329268 962784529 963095188 963259637
3446.5I63259637J83881K09987K19107K07483J86622K12729K71857K11418j40309l68357
$$ 963259637 963443518 963653505 963872612 964080095 964266717 964479446 964751303 964962721 964822412 964454055
3466.9I64454055N841M06504K75671N9188j9491m1664O2704J37568J0192j40965p0750
$$ 964454055 964459896 964866400 965142071 965201259 965181768 965140104 965202808 965340376 965350568 965209603 965138853
3489.3I65138853m1008k32220k88427q1420L2365p5519j29759o7770K563l5346j68502
$$ 965138853 965097845 964865625 964577198 964495778 964528143 964452624 964322865 964255095 964257658 964222312 964053810
3511.8I64053810j59204l5286Q3625O8724j64091k90871j49787K2114J07705N7876
$$ 964053810 963894606 963859320 963942945 964011669 963847578 963556707 963406920 963429034 963536739 963594615
3532.2I63594615l3974M2081J88052J63317L8862k3961N5790K49922K52068J10746
$$ 963594615 963560641 963602722 963790774 963954091 963992953 963968992 964024782 964274704 964526772 964637518
3552.6I64637518J47402K41459J75655L5703k027j3053J7166K46227M49180N43475
$$ 964637518 964784920 965026379 965202034 965237737 965235710 965222657 965239823 965486050 965935230 966478705
3573I66478705N69463M10736J36256O2883M9472k84314l72827K86102N74708J82092
$$ 966478705 967048168 967458904 967595160 967658043 967707515 967423201 967050374 967336476 967911184 968093276
3593.4I68093276j09434J0431J08957J11163K27809K34186K2412j2935J51098J49608
$$ 968093276 967983842 967994273 968103230 968214393 968442202 968676388 968698800 968685865 968836963 968986571
3613.7I68986571O3717j3590J15097M04477M59671L48985J51992J25825K64526K87294
$$ 968986571 969050288 969036698 969151795 969556272 970015943 970364928 970516920 970642745 970907271 971194565
3634.1I71194565K95818L16262K75851K47001L38972L14534P9453J74462M34876K97069
$$ 971194565 971490383 971806645 972082496 972329497 972668469 972983003 973062456 973236918 973671794 973968863
3654.5I73968863K60175N15699N18441L90053L98398L03447P927Q2135L85941K16424
$$ 973968863 974229038 974744737 975263178 975653231 976051629 976355076 976363003 976445138 976831079 977047503
3674.9I77047503J09494K90394L03387L14295L32237J76787m17O7949J83165K38598
$$ 977047503 977156997 977447391 977750778 978065073 978397310 978574097 978573680 978641629 978824794 979063392
3695.3I79063392K60412J27554J5915J55926K08556P2062j35779l34203j60397J13965
$$ 979063392 979323804 979451358 979467273 979623199 979831755 979903817 979768038 979433835 979273438 979387403
3715.7I79387403J15096K2411m5597j46151j00016K53975L74675j28150n17488j73091
$$ 979387403 979502499 979524910 979479313 979333162 979233146 979487121 979861796 979733646 979216158 979043067
3736.1I79043067J24096J10686j8835j29521p450J3291j85310j19925K10643L15726
$$ 979043067 979167163 979277849 979259014 979129493 979122043 979135334 978950024 978830099 979040742 979356468
3756.5I79356468K46823K22623J13904j54018k97964k48491l9936K56479K50042n1499
$$ 979356468 979603291 979825914 979939818 979785800 979487836 979239345 979199409 979455888 979705930 979654431
3776.9I79654431j98364j6272N5909l7551n8293J8120J80065K09749j4424j55092k73346
$$ 979654431 979456067 979439795 979495704 979458153 979399860 979417980 979598045 979807794 979793370 979638278 979364932
3799.3I79364932m41015L9995L56912k8193r2685J55747P7307p5936O0856n5611k83957
$$ 979364932 978923917 978963912 979320824 979292631 979199946 979355693 979433000 979357064 979417920 979362309 979078352
3821.8I79078352n4061J9491L0160J28090m8458j77324J5258R5368r9838r6381M1902
$$ 979078352 979024291 979043782 979073942 979202032 979153574 978976250 978991508 979086876 978987038 978890657 978932559
3844.2I78932559p987N484K8849k97010l39747J52290K08676J19865J30773K64585
$$ 978932559 978924572 978930056 978958905 978661895 978322148 978474438 978683114 978802979 978933752 979198337
3864.6I79198337L42369j58787p25329m04596P7963J94311O199j52886j00732p4327
$$ 979198337 979540706 979381919 978656590 978251994 978329957 978524268 978530467 978377581 978276849 978202522
3885I78202522J84178L43204Q6546m8936R7335P8320j56164k98739k33173p2181Q0585
$$ 978202522 978386700 978729904 978816450 978767514 978864849 978943169 978787005 978488266 978255093 978182912 978263497
3907.4I78263497K81871M07040J39296l05593m68552k29836M2320L1590Q6546K41816
$$ 978263497 978545368 978952408 979091704 978786111 978317559 978087723 978130043 978161633 978248179 978489995
3927.8I78489995K4021k02835K2411J57834o4791k26736j65701M7505J47462R775l8922
$$ 978489995 978514016 978311181 978333592 978491426 978426635 978199899 978034198 978081703 978229165 978238940 978200018
3950.2I78200018Q226R4235J78098R1494k1041l9458j04129k46048k91169k01225n1082
$$ 978200018 978208244 978302479 978480577 978572071 978551030 978511572 978407443 978161395 977870226 977669001 977617919
3972.7I77617919O6221L934j64032j12653M1724L8623N4539J05977P5400J5914j19
$$ 977617919 977684140 977688074 977524042 977411389 977453113 977491736 977546275 977652252 977727652 977743566 977743447
3995.1I77743447k3723
$$ 977743447 977719724
3997.1I77719724
$$ 977719724
##END=$$ End of the data block
