##TITLE=$$ Begin of the data block
##JCAMP-DX=5.00 $$ ACD/SpecManager v 10.08
##SPECTROMETER/DATA SYSTEM=16PC
##DATE=Tue Aug 20 10:35:08 2013
##DATA TYPE=INFRARED SPECTRUM
##DATA CLASS=XYDATA
##ORIGIN=
##OWNER=
##NPOINTS=3601
##FIRSTX=400.00000000
##LASTX=4000.00000000
##MAXX=4000.00000000
##MINX=400.00000000
##MAXY=37.79459000
##MINY=15.36614895
##XFACTOR=1.0000000000
##YFACTOR=0.000000100000000
##FIRSTY=29.72366714
##DELTAX=1.00000000
##XUNITS=1/CM
##YUNITS=TRANSMITTANCE
##XYDATA=(X++(Y..Y))
400 297236671 298515320 303660393 311600208 318493118 318048706 316540241 318701744 322859268 331976395
409 331976395 336873779 323833466 309433212 308611393 312568436 316588402 323358536 337185364
417 337185364 348493576 345334778 339132538 338786125 339918137 340712776 342381706 348502159 350161552
426 350161552 334562759 316934357 309315681 308474541 318327427 329466324 333471527 331291428
434 331291428 316117058 302797794 308731804 319461823 325958023 329335937 326621284 321053505
442 321053505 312899113 308099518 316181908 326652527 332270126 332802544 322471848 310672531
450 310672531 305681000 305069923 311139584 317981243 319483757 318553200 315655231 311998138 308326244
459 308326244 306495190 310073853 314664116 316676140 317253838 315230598 313947678 317512512 322459717
468 322459717 327553024 330212097 325180511 319247246 318381538 319782734 323288689 326951981 328908195
477 328908195 328746071 323545456 318968773 321004639 325752487 332439651 337671051 336572647 332807770
486 332807770 327536354 323390961 324599037 327533722 330321083 331928482 329565506 326629868 326112518
495 326112518 326443443 327303658 327930450 327185135 325873871 323755989 322829475 326295128 330302734
504 330302734 331962585 331590195 327672958 322802773 318850517 316465378 317265282 320212364 326374779
513 326374779 331052055 328280945 322917213 316637993 313014259 318523884 326123009 331017723 332935562
522 332935562 328548889 322225571 316756973 313544750 316359997 320884476 324912300 325875282 317344437
531 317344437 308695068 309014091 312735786 318349361 322776566 321356773 317324638 311068058 306465874
540 306465874 309668541 314245701 314503670 314382553 316986084 319129219 317430496 315581093 317016830
549 317016830 319118977 320785751 320902100 316683044 312034607 310322037 310380707 312732220 315682182
558 315682182 317992687 318814278 315595856 312203884 312408676 313945999 316474915 317992439 315423241
567 315423241 311641464 308344364 305984020 306070557 307126522 308489323 309224129 307523003 305340290
576 305340290 304082146 303582191 304085732 305760612 309868813 313373089 312889576 310718765 307409058
585 307409058 304829369 305591106 308012238 312501907 315397034 311062813 305823097 304972878 305962334
594 305962334 308685780 311105499 310306320 308811188 308583031 308384418 306964874 306325436 309090614
603 309090614 312137833 312731514 312332878 311247101 310204735 310115337 310745964 312585354 314375877
612 314375877 314941177 314522972 312278976 310283661 310720215 312419662 315698853 318282127 316891899
621 316891899 314850082 314489365 315499077 319297562 323027611 323878059 323126297 320501785 317835083
630 317835083 317124844 317596207 320003052 321756821 319650173 316292992 312599182 310449123 313477993
639 313477993 317333450 318396568 318102360 315977573 314127197 315165997 317091217 318601379 320204735
648 320204735 322741508 323913345 320260048 316104660 315544357 315793037 315027714 314454803 315245399
657 315245399 315679073 313740959 311483860 309949646 310152779 313488960 319854736 334356766 342760315
666 342760315 324659119 303672562 300068855 303495636 312298546 320651283 319932938 316873074 315633774
675 315633774 315295219 316572914 318720341 321800957 324100037 323431969 321272621 317339420 314721107
684 314721107 318036308 322409134 324341545 324316978 320337753 316346169 316283951 318152905 321880798
693 321880798 325628052 327441711 327586670 324712982 321711044 321532478 322643509 324907074 327081451
702 327081451 327601433 327299347 326146355 325160255 325448990 326712837 329745064 332373390 331976662
711 331976662 330692749 329635849 329252701 330787430 332959900 335407028 336622238 333801994 330473900
720 330473900 329428444 330073128 333713303 337445755 338290939 337782860 336143951 334326248 333273888
729 333273888 333232651 335483551 337862740 338315239 337795486 335910339 334646683 336666565 339552155
738 339552155 341922760 343327522 342495689 340503464 337187996 334995728 337472916 341154823 343905678
747 343905678 345283051 343237648 340452194 338912010 338659286 341131439 344127884 345972519 346526642
756 346526642 344212036 341669807 341504822 342246780 343733292 344643822 343123932 340612183 337466965
765 337466965 335072021 335229149 337039719 341002960 344726334 345656891 344775200 341277351 337961922
774 337961922 337860336 339466820 343088608 346316338 346213837 344668388 341848602 339973907 342253685
783 342253685 345883141 349468002 351984482 351142426 349345703 348237762 347808380 349145432 350594292
792 350594292 350648422 349949608 348328819 346709480 345722923 346074600 349750748 353537064 354449043 353783379
802 353783379 351366997 348624458 346708755 346260796 349535446 352840881 352453461 350720177 348436356
811 348436356 346531143 346417198 347438812 349832306 352333527 353791008 354103546 351935616 349837532
820 349837532 350456963 352163544 354711990 356592407 355550537 353572388 351598015 350507736 352261047
829 352261047 354559402 355743866 355851669 353780022 351287384 349749336 349208603 350664864 352622986
838 352622986 354032288 354557037 352861862 350894203 350295296 350647697 352615356 354592552 354858170
847 354858170 354419250 353403549 352725029 353700180 355247040 356981735 358124962 357536316 355914841
856 355914841 352720985 350529671 352916489 356338730 358445168 359234581 357166519 354506721 353116989
865 353116989 352667580 353917351 355458984 356065979 355952759 354550362 352978935 352109184 352118721 354116211
875 354116211 356179008 356365204 355838776 355061302 354195366 353460541 353146782 353908997 354870300 355302353
885 355302353 355412979 354948769 354564209 354823112 355742455 358090172 360177040 360171318 359266739 357631454
895 357631454 356507072 357776642 359683533 361174355 362020493 361316223 360038300 358573914 357785225
904 357785225 359206200 361208191 362755775 363601227 362630615 361403694 361174355 361744156 363770981
913 363770981 365938644 367031822 367406120 366763840 365847588 365135193 365119934 367147675 369138718 369025230
923 369025230 368114929 366821289 365756531 365835419 366563072 368239174 369394760 368176231 366034279
932 366034279 363437653 361475945 361887932 363192062 364802856 365770798 364408493 362341652 360590706
941 360590706 359282265 359185715 359392395 359349976 358757248 356683731 354463120 353238335 352650642 353078613
951 353078613 353452454 352602234 351204643 349322548 347624054 346917877 346843491 347604980 348316917 347903976
961 347903976 347136002 346326599 345767975 345878143 346590500 348500023 350039253 349226456 347899437 347234955
971 347234955 347233047 348719826 350391617 351160507 351205101 350089073 348567963 347197533 346138000 345938683
981 345938683 345985184 346020470 345520248 343315125 341081390 340419044 340387573 340778122 340992928 340245476
991 340245476 338891029 336747398 334638138 333352585 332809906 333764305 334497910 333148727 330901871
1000 330901871 327968826 325405579 324786682 324765205 324492950 324047318 323012123 322016945 321642151 321619492
1010 321619492 322007675 322406311 322485199 322092781 320681801 319108238 318050156 317492962 318053722 318514347
1020 318514347 317652473 316096783 313643227 311567535 311526070 312169800 312671661 313118935 313411942 313282967
1030 313282967 312092056 310855141 310503960 310651302 311439037 312208652 312255859 311856499 310765991 309840202
1040 309840202 310159912 310803413 311316967 311376801 310272217 308708916 306918373 305612087 305920830
1049 305920830 306817780 307806015 308424721 307710648 306671371 305845490 305674076 307310333 309155464
1058 309155464 309866905 309826622 308579674 307291508 307163963 307632675 308723450 309867630 310510406
1067 310510406 310636044 309752464 308733215 308289051 308414936 309665451 311070213 311842442 311985970
1076 311985970 310841084 309610596 309392452 309838295 311330795 312773933 313055992 312604427 311078072
1085 311078072 309669018 309747925 310435524 311509132 312368393 312103748 311417809 310568333 309976807 310369263
1095 310369263 311089516 311862221 312269936 311460495 310462227 310066452 310129166 310977936 311986198 312655926
1105 312655926 312929153 312237968 311613083 312076797 313086510 314634800 316134682 316869965 317219734
1114 317219734 317213535 317181358 317423344 318057289 319546471 321151733 322189331 322955627 323404312 323879471
1124 323879471 324884872 325895309 326518288 326857567 326832047 326600304 326104889 325912704 326833267 328078270
1134 328078270 329225540 329984894 329694023 329046249 328389397 328094254 328997612 330048790 330459137 330279579
1144 330279579 328886261 327513695 327351570 327909241 329389801 330900421 331446419 331533432 331267586
1153 331267586 330852051 330425034 330285301 331055412 331902504 332073441 331950188 331511269 331212273 331530800
1163 331530800 332377205 334054489 335861931 337152252 338064919 338307152 338526726 339440346 340547104
1172 340547104 341628304 342552910 342956543 343317757 344084015 344983330 345889816 346811295 347818146 348596115
1182 348596115 348751793 348590622 348044891 347838402 349122772 350545158 350979576 350893974 350150833 349440804
1192 349440804 349545479 350052338 351068268 351816406 351298561 350284119 349114914 348072777 347573051
1201 347573051 347554703 348369598 349194031 349190483 348749886 347740173 346893311 347192307 347749252 348048210
1211 348048210 347955933 346962204 345681686 344489822 343592148 343504410 343670845 343728790 343612213 343080978
1221 343080978 342293243 341169586 340182304 339957466 339952927 339960823 339601746 338121643 336436768 335198402
1231 335198402 334445496 334739685 335162392 334848175 334196091 333222389 332208862 331398735 330920715 331184616
1241 331184616 331588287 331524620 331417313 331582069 331735611 331513176 331472397 332347641 333242874 333313217
1251 333313217 333139420 332944641 332956772 333666077 334508667 335175743 335390549 334486961 333320618 332645187
1261 332645187 332098465 331426163 331056366 331492195 332252502 333043594 333804626 334355354 334760437 334976196
1271 334976196 335145721 335471878 335728416 335667114 335554352 335572472 335724106 336148033 336614838 336948624
1281 336948624 337126732 336926460 336769562 337139130 337628365 338069191 338226776 337615242 336816788 336196442
1291 336196442 335916519 336465836 337227821 337862968 338025322 336821556 335552444 335466614 335825691 336404800
1301 336404800 336911430 336874733 336603165 336210022 335809479 335497360 335441132 336103210 336691360 336467972
1311 336467972 335730057 334173431 332862625 333219528 333867569 333745956 333328705 332623978 331968307 331735382
1321 331735382 331822166 332304001 333018074 333908081 334727516 335237045 335358620 334639320 333963165 334259491
1331 334259491 334937820 335858841 336595535 336519012 336092949 335529785 334952126 334300995 334331055 336500397
1341 336500397 338637581 338446617 337757339 337888718 338075867 337850800 337640305 337970009 338075180 337073326
1351 337073326 335839500 334981918 334415665 334318161 334508438 335061798 335383911 334887009 333623657 331039200
1361 331039200 328367233 326593170 325906029 327753296 329343338 327241669 324820747 324915161 325701942
1370 325701942 326691132 326717834 323411484 319897175 319043159 319246521 320036392 320883255 321159134 320685387
1380 320685387 318394661 316324234 316843262 317886353 318045845 317717552 316266289 315374851 316953430
1389 316953430 319682121 323950043 326539764 322169304 317421188 319009056 321255188 319711456 317400455
1398 317400455 315534821 315094471 319067955 322640419 320472946 317125797 315612316 315233707 316999912
1407 316999912 318796883 318187485 317148437 317020187 317271957 317564487 318663826 322702866 325241318
1416 325241318 321024666 314628372 307804585 303766975 309282780 315441856 312920570 309723377 312512398
1425 312512398 315988312 316693077 315762997 311968079 308946838 310869217 314907303 321576347 325016251
1434 325016251 315722237 305142174 303125610 304961205 310421944 315901756 316435585 315872192 316902161
1443 316902161 318033695 318945885 318816414 315427551 312644482 314964523 318272591 318066826 320001831
1452 320001831 333330612 342755318 329879532 313251266 307032108 305983543 310534477 317843666
1460 317843666 326680679 332641602 328021049 321492920 319844971 321029892 325988998 332544327 340477715
1469 340477715 344847679 337200165 327853699 325919876 326562424 327935715 330176582 333002090 335824738
1478 335824738 338107605 339414825 338004112 337258110 341303101 346164474 349136353 350535164 349798203
1487 349798203 346853256 339187393 333559036 338217735 346174469 354439240 359262238 352905998 344340553
1496 344340553 340908775 339754829 339878082 343052368 352227440 362874527 374618301 377945900
1504 377945900 355127563 330435524 326429825 330517273 339398384 347749252 345907440 343586693
1512 343586693 350938072 356985550 349693756 342389107 348664513 355681648 353466988 347018738 334982147
1521 334982147 326440582 335567017 345736275 340639839 333498459 333725700 336433411 340640297 344038963
1530 344038963 343804588 340507278 330009918 323608856 337475052 352844467 354491959 347971916
1538 347971916 329404831 311866035 311446915 315219154 313794365 312642326 315138588 318175545
1546 318175545 319668541 319923630 317595959 315551033 317476044 319561234 316798935 316467762 330992928
1555 330992928 339924812 318468571 292082062 279446831 276097069 288586388 302536964 301620483
1563 301620483 298242340 301666985 304987679 303759804 299859524 291059723 285224438 293373108 303811798
1572 303811798 308693409 307493439 292040100 277427197 280460835 287829170 290999641 292436829
1580 292436829 291021824 288972130 288589249 288499832 287977219 287380219 286912918 286309967 285147896 284103165
1590 284103165 284019699 283970356 283099174 282033691 281024933 280344238 280556450 281032085 281408787 281449547
1600 281449547 280511379 279446602 279092312 278850555 278395882 277745476 276664963 275583267 274594784
1609 274594784 274466743 276173363 279187679 285722733 288530121 276462555 263429413 261824131
1617 261824131 265046597 272407055 278564453 275701294 270554314 267323971 265801907 268778572 271457901
1626 271457901 267772675 264323711 266826401 271869431 279431114 285055885 283415070 277103901 263477802
1635 263477802 252927303 259595642 269577751 271189690 271909485 276458015 281421185 286039124 287067413
1644 287067413 277141342 267862091 269960403 278681984 298922062 312461853 293982735 269678593
1652 269678593 259023895 256858101 268196106 281983147 286498547 288752079 293338776 295781612
1660 295781612 290661812 285399914 286797523 291289330 299287319 305658817 303615570 298535576 291773319
1669 291773319 288611412 299730530 310288906 304569473 295877457 292909622 293771973 301401615
1677 301401615 310001602 312926064 315658092 326356888 330348740 305836201 282347679 290426254
1685 290426254 305228958 309624901 311017761 309590340 309870949 319682121 329322357 330216179 326806564
1694 326806564 317813396 311830044 324320068 333391914 312131405 291066647 299717178 314192295
1702 314192295 318381786 318462601 313421974 308715591 311282387 315659046 318156967 320388069 322799454
1711 322799454 325196991 328718185 329815140 324026566 315229645 303658485 295779228 301816711
1719 301816711 310726395 313505173 314250946 313596497 312934151 314654579 316392174 315438995 315211296
1728 315211296 319438457 324470749 330426941 329728127 306284180 285744896 297179451 314236641
1736 314236641 317024708 315233231 310857048 307088852 309504738 312948952 312823772 313029060 317307472
1745 317307472 321530838 322526474 321168175 316011200 310835361 308986664 310320625 318347931 325447807
1754 325447807 321960220 317513237 320594330 324962387 327095261 327321777 322653770 319519043 326303482
1763 326303482 334144363 335148811 334790955 336455116 338517914 342017670 342351913 331232796 320752144
1772 320752144 323431015 329693794 333493233 336761932 340020676 341457367 337543488 333948364 337337265
1781 337337265 341191521 339543839 337405701 338265648 340723267 345470428 349715729 351060867 349016914
1790 349016914 339363327 330893745 333849411 339664688 342552185 344416847 345251312 345003128 343148956
1799 343148956 341094246 340159416 340074997 341314545 342969437 344153404 345269928 346823196 347624550
1808 347624550 345969429 343906631 342982292 342996140 344881287 346781960 346678963 345992317 345441589
1817 345441589 345107803 345183868 346053123 349278946 351512680 347994804 344521294 347203979 350332985
1826 350332985 349555740 346909752 341640244 337770462 341018448 345542183 346568108 346605530 346611748
1835 346611748 346468697 345783463 346337547 351323853 356113663 357064247 354410172 344103088 335345993
1844 335345993 339525223 346040001 346462708 345659714 346095314 346547356 346345444 346296539 347345581 348408699
1854 348408699 348543625 348269958 347655296 347109795 347170105 347522011 347907066 348691940 350532532 352302551
1864 352302551 353462944 352906227 347915192 342779160 341557732 342221260 344674835 347173462 347295303
1873 347295303 346976051 347608337 348399658 349127541 349474678 348709564 347850800 347922325 348173866 347815285
1883 347815285 347988358 350602379 352563133 350301514 347150345 345247993 344609032 346935730 349300156
1892 349300156 348512878 347058525 346554260 346412888 346660614 347072144 347475281 347736588 347524185 347258797
1902 347258797 347310066 347497940 347839127 348112335 348124275 347804794 346678963 345767746 346046219 347173691
1912 347173691 349784126 351927032 351410141 349592209 346307755 343935013 346196175 348892937 348113785
1921 348113785 346719971 346566925 346759338 347074738 347347031 347155800 347038727 347620735 348218918 348317642
1931 348317642 348039627 347108116 346202621 345910568 346229782 347713242 349282036 350212555 349991798 346830597
1941 346830597 343831062 344398041 345831146 346292725 346598129 347173233 347345581 346099396 344889870
1950 344889870 345246811 345927963 346028557 346065521 346436501 346594315 345810661 345026016 345126648 345546951
1960 345546951 346034775 346534729 347060204 347151527 345962982 344662437 344324112 344382515 344784508 345064621
1970 345064621 344478607 343807945 343705673 343810577 343988190 344211121 344429245 344575424 344543228 344399681
1980 344399681 344043007 343872795 344497452 345187416 345268974 345183144 345255127 345157623 344619980 343794098 342452774
1991 342452774 341460457 342041473 342889061 342852364 342687607 342821846 343089104 343653183 343948593 343146820
2001 343146820 342200050 341943970 341897507 341872940 341824760 341601372 341331711 340999603 340888023 341389160
2011 341389160 342156906 343261261 343844185 342517624 340941429 340568771 340628395 340858688 341181984 341412315
2021 341412315 341612587 341861000 341925392 341421852 340882301 340800285 340905914 341168404 341362953 341161003
2031 341161003 340840340 340549698 340345612 340367088 340514679 340797424 341026306 340968857 340762138 340399971
2041 340399971 340078354 340014458 340137024 340607872 340944519 340509415 339925995 339618683 339546204 339951019
2051 339951019 340403557 340515137 340402832 339961777 339466095 339143524 339026947 339354286 339737892 339896927
2061 339896927 339747429 338865051 337990265 337848434 338058701 338633041 339118500 338900566 338472137 338144760
2071 338144760 337847214 337570419 337439041 337713013 337974319 337767601 337464561 337269783 337225914 337515831
2081 337515831 337922592 338387489 338618507 338126678 337443848 336890945 336608658 337021828 337596664 337957153
2091 337957153 338052750 337525597 336919060 336693535 336738586 337274551 337769737 337653160 337262154 336619606
2101 336619606 336096764 336214523 336543808 336856842 337070236 336958885 336719284 336463203 336216927 335982552
2111 335982552 335941544 336491356 336985359 336724281 336262703 335951309 335699310 335484734 335449944 335861931
2121 335861931 336322556 336524506 336461792 335829010 335216293 335244179 335514297 335926285 336203804 335888634
2131 335888634 335426102 335115891 334934959 334969292 335190544 335718384 336192360 336189995 336016426 335814247
2141 335814247 335646858 335662117 335746536 335892181 335926781 335590134 335135231 334705124 334368706 334313393 334326248
2152 334326248 334210625 334103584 334062576 334127426 334379196 334749222 335335960 335716972 335301895 334692230
2162 334692230 334289780 334101448 334395180 334786186 334945221 334972153 334825745 334599724 334366074 334145775
2172 334145775 333940277 333876839 334209442 334559212 334599991 334426155 333861580 333391190 333603859 334010849
2182 334010849 334317436 334530106 334550858 334396362 333969345 333511810 333230247 333132744 333392372 333718300
2192 333718300 333843689 333866119 333772430 333624611 333490372 333337326 333154221 332942238 332633018 332422485
2202 332422485 332582932 332816124 332885971 332876205 332777481 332629929 332385788 332296371 332744827 333287468 333648682
2213 333648682 333706360 333036652 332269440 331927071 331906090 332479019 333038788 332932968 332567215 332073669
2223 332073669 331618080 331405869 331448555 332000504 332535248 332502136 332226524 331744919 331370583 331547966
2233 331547966 331917534 332264175 332597504 332924843 333035698 332549324 331980705 331732979 331760178 332349319
2243 332349319 332904358 332773933 332407951 331982841 331665039 331767578 332024803 332353363 332519989 332108994
2253 332108994 331582298 331204643 331149597 331969261 332788925 332768936 332356453 331554871 330854187 330843201 331226578
2264 331226578 332096100 332879295 332901726 332558632 331944466 331287384 330861816 330622177 330692520 330838699
2274 330838699 330877533 330779305 330365181 329897385 329457512 329407692 330441475 331644287 332260361 332506905
2284 332506905 332242737 331786652 331397285 331113091 331136246 331232796 331233521 331144791 330823441 330547104 330584297
2295 330584297 330818634 331339607 331797600 331698189 331563492 331813087 332260132 332966080 333605270 333795776
2305 333795776 333767395 333599548 333359947 333191643 332947006 332249413 331928711 332948227 334528198 336429367
2315 336429367 337991943 338367233 337882042 336426010 334462395 332210312 330288887 329533081 329513550
2324 329513550 330478897 331230164 330543518 328740845 324883957 321527252 321720352 323037148 324224472
2333 324224472 324811478 323151360 321518173 322640648 323505402 321728210 318149338 312636604 305720806
2342 305720806 295676708 289136658 293256283 304736862 326030006 347037086 357109070 360345383
2350 360345383 355517616 347959061 343559990 339420090 334189415 329105606 325013390 321738739 319897652
2359 319897652 317961922 314103127 309836388 305957317 302796135 301275978 300411701 299524307 298617363
2368 298617363 297192574 296074142 296120415 296727657 297541389 298671246 300237656 301851273 302881718
2377 302881718 304171085 306624184 309420109 311999321 314480553 316943169 318943024 319785843 320298920
2386 320298920 321261177 322120895 322469254 322656174 322978516 323187103 323029022 322812309 322771072 322873840
2396 322873840 323280106 323649635 323640099 323414574 322914352 322461624 322464943 322604408 322705994 322738876 322532196
2407 322532196 322332382 322341461 322519073 323019028 323460083 323441010 323173294 322633018 322121849 322007904
2417 322007904 322067719 322255630 322406540 322298775 322055817 321669807 321310501 321179886 321170578 321324844
2427 321324844 321394196 321024170 320574989 320287476 320164185 320382614 320657272 320738068 320696106 320529709
2437 320529709 320205460 319554329 318979988 318950653 319102764 319287300 319328537 318850288 318303108 318071136
2447 318071136 317975769 317942619 318043232 318430672 318783989 318834534 318578243 317687988 316860676 316912422 317157516
2458 317157516 317171574 316986561 316307068 315688610 315730820 316004524 316290627 316556206 316732635 316707382
2468 316707382 316233635 315642834 315167427 314854145 314957390 315086365 314874649 314503670 313929081 313461533
2478 313461533 313500633 313732624 314039707 314231148 313984146 313574562 313124886 312770119 312760830 312870979
2488 312870979 312967529 313020935 312949409 312773476 312388191 312085381 312232494 312496662 312701454 312742004 312308788
2499 312308788 311836720 311689377 311769485 312252998 312681675 312549591 312172165 311641216 311119556 310806999
2509 310806999 310682068 310860157 311129341 311320782 311419487 311286926 311125031 311113358 311178207 311402550
2519 311402550 311494598 311070442 310486794 309900055 309523582 309786568 310196152 310403099 310404301 309961548
2529 309961548 309428940 309080849 308915863 309106102 309403191 309670925 309743652 309273720 308668861 308217049
2539 308217049 307927361 307963600 308149338 308426380 308601856 308352947 308010330 307823410 307711372 307636986
2549 307636986 307717800 308251610 308660278 308275223 307662487 307131996 306780815 306959629 307217121 307167778
2559 307167778 306964874 306510925 306171646 306434631 306833744 307062149 307129383 306875954 306501865 306142578
2569 306142578 305829277 305619011 305570126 305892467 306188107 306026936 305712700 305370808 305105686 305143356
2579 305143356 305241585 305212021 305117836 304968834 304737091 304295063 303949127 304046860 304334869 304769993 305066833
2590 305066833 304804077 304344902 303870430 303502312 303492317 303630352 303863297 303969154 303553810 303080559
2600 303080559 302951336 302953949 303049564 303118935 302976379 302779427 302660942 302506924 302152405 301882973 302070847
2611 302070847 302288055 302142372 301898479 301718941 301517487 301196098 300951729 301077118 301186333 300856819
2621 300856819 300487995 300370445 300405979 300668488 300930977 300928841 300846577 300822258 300730476 300416718 300106525
2632 300106525 300031433 300018787 300000191 299891472 299503555 299081078 298836708 298677216 298570156 298542747 298716545
2643 298716545 298772335 298257351 297692299 297479630 297520409 298002968 298467407 298413048 298150539 297818184
2653 297818184 297432671 296975861 296689262 296999207 297331810 297117004 296767712 296538830 296334496 296114922
2663 296114922 295964470 296039352 296081066 295751801 295445442 295529594 295743942 295966377 296147823 296201706 296115398
2674 296115398 295804749 295395622 294901619 294573784 294864655 295181274 294909954 294564724 294520378 294577827
2684 294577827 294670830 294772377 294869194 294852028 294546356 294131508 293684235 293334732 293324699 293395996 293365955
2695 293365955 293249130 292915821 292614460 292669525 292721977 292379150 292062988 292187462 292383919 292379856 292300224
2706 292300224 292178154 292015305 291721344 291604042 292159309 292728901 292682419 292430649 292167435 291911125
2716 291911125 291767120 291666031 291568756 291489124 291493893 291381607 290831337 290264854 290032616 290025711 290362358
2727 290362358 290709972 290701637 290555229 290312042 290133247 290271530 290490150 290648232 290708065 290568123
2737 290568123 290279388 289763927 289306641 289260635 289342880 289418221 289392948 289019108 288624287 288464775 288504124
2748 288504124 288913727 289325943 289375534 289224148 288819313 288434753 288398514 288492928 288645973 288747311
2758 288747311 288665047 288390160 287710190 287101269 287043571 287310371 288017502 288617363 288408051 287967911
2768 287967911 287697563 287425270 287042141 286760559 286829720 287029266 287263641 287406693 287235737 286942711
2778 286942711 286614647 286341438 286352882 286316147 285783539 285326004 285512924 285900841 286311150 286517143
2788 286517143 286076069 285455704 284955978 284636726 284760704 285016060 285182228 285246124 285095940 284806252
2798 284806252 284307957 283918152 284106979 284345398 284176598 283852577 283449898 283038368 282692184 282471657
2808 282471657 282508621 282660484 282883873 283013344 282830009 282447815 281800747 281208992 281015396 281084538
2818 281084538 281595459 281946182 281349659 280538559 279988766 279680729 279867401 280206203 280468216 280562630
2828 280562630 280233154 279744148 279248962 278822422 278657913 278549919 278338203 278079033 277755737 277423630
2838 277423630 277137280 276878586 276674995 276443253 276128540 275671234 274921646 274091721 273304939 272675991
2848 272675991 272472153 272358170 272017479 271659126 271378994 271200409 271208038 271310806 271474113 271612167
2858 271612167 271608124 271517277 271320343 271123161 271046162 271026382 271074524 271088600 270946503 270719299 270380020
2869 270380020 270097504 270174751 270182381 269611835 269002686 268812408 268777122 268788567 268833885 268897781 268879166
2880 268879166 268593311 268275986 268172035 268069496 267767181 267476082 267428875 267356148 266970406 266555557
2890 266555557 266344547 266202202 266075859 265949249 265760422 265594254 265581360 265521526 265119324 264790535
2900 264790535 265012741 265305290 265352249 265135994 264329681 263543606 263430119 263534069 263655434 263679981
2910 263679981 263401756 262893677 262022495 261197567 260881901 260780811 260848522 260799408 260179043 259446869
2920 259446869 258943558 258568039 258292427 258237114 258645535 259120216 259328117 259317875 258886814 258455753 258451233
2931 258451233 258652210 259081841 259433270 259267807 259001732 258870125 258975754 259631882 260439396 261124134
2941 261124134 261621475 261699448 261585464 261370430 261231422 261468410 261800995 262037277 262210617 262229919
2951 262229919 262275467 262578964 262893200 263065109 263044128 262616882 262118568 261906395 261699200 261270294
2961 261270294 260813713 260453453 260172844 259992123 259923706 259961128 260181198 260821571 261389732 261318436
2971 261318436 261067619 260917187 260837555 260900726 261078835 261344910 261767387 262612114 263257027 262898445
2981 262898445 262346745 262233257 262289772 262463341 262736797 263141861 263477325 263477802 263364315 263264656 263192406
2992 263192406 263214588 263298264 263483524 263617992 263548126 263316383 262764454 262340069 262661705 263057709
3002 263057709 262925148 262674103 262591839 262442360 262005806 261518707 261140594 260879993 260861874 260895500
3012 260895500 260744820 260667324 260931015 261265755 261560917 261604538 260950089 260189056 259807816 259673843
3022 259673843 259984741 260234108 259796143 259225616 259009132 258724213 257863522 257165184 257457733 257961502
3032 257961502 258104801 258091450 257948875 257632027 256951809 256366253 256425133 256661186 256825924 256810665
3042 256810665 256294479 255663395 255189896 254893532 254972458 255163422 255264053 255287647 255157471 254940758
3052 254940758 254665146 254371872 254119873 253880730 253610840 253411522 253402710 253484726 253656616 253738880 253474464
3063 253474464 253092289 252709389 252403030 252363434 252367744 252211094 252027740 251873970 251777420 251897583 251894226
3074 251894226 251294136 250653038 250517845 250438213 250041962 249639034 249452591 249369621 249396324 249395142 249109268
3085 249109268 248899460 249225845 249529839 249315739 248853207 248120785 247492561 247507572 247646561 247490654
3095 247490654 247274399 247095108 246943951 246851921 246796379 246840954 246755371 246179810 245566368 245297432 245219231
3106 245219231 245400200 245553246 245326767 244979858 244672546 244349251 244019985 243645191 243138313 242646942
3116 242646942 242349854 242066154 241596451 241171608 241020203 240946045 240808258 240666161 240511169 240405807
3126 240405807 240502357 240519524 240117798 239623070 239263058 238991013 238905907 238797913 238399982 237982979
3136 237982979 237810612 237635136 237210751 236795654 236617813 236521244 236433754 236329079 236098289 235914707
3146 235914707 236054420 236097107 235572815 234905720 234379044 233945122 233723869 233492851 232967148 232452393
3156 232452393 232164383 232084999 232399940 232713223 232584000 232328892 232152462 231947670 231710434 231335163
3166 231335163 230592957 229848862 229474297 229218483 228965759 228678474 228170166 227771282 227898598 228105068
3176 228105068 228039970 227828026 227437019 226985455 226616135 226220360 225634575 225165596 225204697 225331783
3186 225331783 225276470 224980125 224124680 223216534 222687244 222441902 222732544 222949982 222336540 221587906
3196 221587906 221256485 221011391 220626831 220336437 220401993 220510483 220474243 220179081 219268570 218279114
3206 218279114 217656364 217313290 217456093 217650414 217469215 217095375 216459045 215890160 215829372 215872536
3216 215872536 215717316 215495834 215219269 214946022 214791298 214595070 214175701 213712921 213346004 213014832
3226 213014832 212692738 212416878 212250233 212087631 211818466 211520672 211241722 210959206 210689068 210361481
3236 210361481 209864140 209338665 208952904 208513031 207759857 207055817 206768761 206620445 206405869 206270218
3246 206270218 206346035 206465721 206602573 206465492 205471039 204468002 204323997 204396725 204302788 204131126
3256 204131126 203774681 203436852 203342667 203319321 203255177 203190079 203172455 203062057 202692986 202189674 201551914
3267 201551914 200986137 200759888 200689545 200746536 200731506 200364342 199858665 199259033 198791027 198820343 198971272
3278 198971272 198983669 198872795 198493729 198064575 197788239 197564850 197349548 197179794 197126617 197042942
3288 197042942 196778774 196413040 195903549 195461998 195367813 195373306 195358505 195219765 194708347 194135666 193712463
3299 193712463 193490753 193753014 194016933 193804741 193382988 192816257 192230225 191864738 191441765 190594444
3309 190594444 189827442 189694176 189679871 189403534 189015617 188474178 187974205 187803497 187640667 187173615
3319 187173615 186661949 186291695 185971260 185686340 185391197 185064087 184614906 183803329 183056355 182839870
3329 182839870 182795753 182753563 182612896 182142982 181562901 181052437 180496445 179768085 179081917 178636074
3339 178636074 178352833 178307762 178236485 177818775 177297115 176749706 176347733 176472187 176569462 176084995
3349 176084995 175401211 174706459 174025307 173404922 172964096 172983398 173020840 172635307 172102928 171563377
3359 171563377 170983086 170265675 169739246 169927368 170143852 169700623 169124603 168760777 168463707 168272247
3369 168272247 167978764 167285919 166499138 165786266 165262222 165239105 165290604 165000687 164650917 164430618
3379 164430618 164200058 163891792 163475990 162747154 162163506 162303696 162599792 162641754 162533531 162120590
3389 162120590 161768188 161962738 162182808 161969185 161618462 161235332 160933971 161038876 161020279 160212994
3399 160212994 159347773 159083843 158970118 158687592 158495903 158695459 158843517 158465147 157955408 157598972
3409 157598972 157250404 156737089 156425238 156900406 157330990 156832218 156147003 155778885 155560732 155613899
3419 155613899 155575752 154872894 154256105 154435635 154956102 155739069 156361341 156143904 155773401 155864000
3429 155864000 155953169 155658484 155351162 155363321 155428171 155356646 155246496 155075312 155013323 155349016 155704737
3440 155704737 155759573 155630350 155307770 154846430 154160023 153661489 153939724 154378176 154455423 154474735
3450 154474735 154545307 154726744 155164719 155709982 156364679 156817198 156587601 156180620 155968428 155867577
3460 155867577 155893087 156120777 156798601 157425404 157419682 157270432 157322168 157424927 157534361 157676697 157895088
3471 157895088 158092737 158105135 158176184 158622265 159059525 159110069 159071445 159130096 159238100 159435987 159641743
3482 159641743 159733772 159869909 160259247 160625458 160642147 160665741 161018848 161473045 162006855 162320614
3492 162320614 161837101 161365032 161684990 162301292 163106441 163715134 163491726 163078785 162900448 162975082
3502 162975082 163639069 164359570 164637089 164705505 164528370 164416542 164708366 165284386 166257629 167268028
3512 167268028 167976608 168431053 168449402 168379784 168528080 168835640 169505119 170055161 169868698 169555187
3522 169555187 169572105 169754505 170202484 170578232 170332680 170196304 170946846 171892166 172567844 173066139
3532 173066139 173256149 173341274 173385143 173674812 174725533 175913811 176806221 177346954 177195072 176770210
3542 176770210 176272621 176016083 176521530 177364578 178488731 179309616 178885460 178231468 178027382 178335419
3552 178335419 179701805 181351185 182681808 183718204 183994522 184379349 185933838 187612762 188952923
3561 188952923 189267159 187191963 184292564 181293964 179353237 180501709 182838211 185225258 187401295
3570 187401295 188558102 189197063 189450741 189616680 190063000 190710545 191495895 192738056 195053825
3579 195053825 197483292 199504128 200417519 198996544 196302185 192107677 189046135 190675011 193992386
3588 193992386 197493782 200241814 200124016 199157486 198713074 198616753 199465523 200314999 199994564 199777832
3598 199777832 200608978 202304115 205447197 208676567 210974693 211892357 209927330 207219124 205338001
3607 205338001 204488029 205946922 208062401 209275246 210583458 213236580 214918137 212906361 209666729
3616 209666729 206046333 204175472 207267990 212917328 220788727 227877388 231056690 230354309 223411083
3625 223411083 214259377 204774380 199065208 204885254 213174820 216232300 217734566 218676567 219400635
3634 219400635 220819473 222216835 222746620 223710537 226253986 229996910 235838413 241084576 243671894
3643 243671894 242608299 234483242 224485168 216075668 211024761 213808537 219769249 226660252 231721153
3652 231721153 229623070 225824127 224169502 224167099 227531662 231487274 233056068 234557629 237589359
3661 237589359 241337776 246462822 250140419 248944283 245340824 239393005 234884987 237562408 241602669
3670 241602669 243815651 242045879 228869209 216899643 219849815 226998329 231419334 235436668
3678 235436668 238750935 242302666 247654438 252638588 256204834 256562004 250067940 241224518 232456207
3687 232456207 226352921 228004456 232333183 235629311 238878727 242009392 244484177 245654106 245779266
3696 245779266 244914532 243026009 239035606 236129532 237985134 242049217 247744789 252818832 254812965
3705 254812965 253764381 247767220 240189552 233116379 228488445 230040073 234473228 240325699 245820999
3714 245820999 248095036 248945465 249290695 248904457 247717628 246176491 244546890 243299007 242935658
3723 242935658 243623257 245807419 249150047 254776230 258740196 256190300 250968704 245204926 239184856
3732 239184856 233074913 229361305 230935574 236745834 249181747 260808468 263995399 261719475
3740 261719475 252286186 242078056 236993790 236787319 247660637 256165276 245748749 231921425
3748 231921425 225830078 224012852 227755318 233960876 240751038 245754967 244493713 241410732 239397278
3757 239397278 238630295 240955830 244256248 247323990 249273071 248077164 245946884 244868507 243486404
3766 243486404 240319729 237728596 237908363 239870300 244158516 248367081 249892235 249870071 248431206
3775 248431206 245987167 242234707 239448547 240887413 243295670 244270802 244512081 243451118 242486000
3784 242486000 243168602 244466057 245862484 247358322 248824596 250133286 251023521 251762161 252572536
3793 252572536 253321877 254360924 254462013 252362728 248518219 241259098 235696068 238807449 243319511
3802 243319511 243636608 241703033 235448360 231319427 237639904 246707687 253654480 258299103 258160362
3811 258160362 255269775 249783993 244843483 245113602 246175537 245061874 242080212 234335670 228464603
3820 228464603 232675552 239356995 243004322 245504150 246489048 247213593 249284019 251277695 251893044
3829 251893044 252370358 254260788 255330315 253746758 249853859 241823425 234338760 232486000 233227730
3838 233227730 235684166 238465309 238978386 239948502 243273964 248839855 258777618 268244019 273777008
3847 273777008 273362637 261723518 245185375 225552330 211109886 214269638 224455357 236012936
3855 236012936 246584167 250890007 252037773 251058578 248898506 246584663 244903336 245512009 246822357
3864 246822357 248479366 248438358 242802143 236770153 234883785 235219479 237920284 241324654 243428707
3873 243428707 245400429 248464108 250443935 248508682 245847702 245172501 245084534 245541096 245184422
3882 245184422 241083145 237914085 241278419 245470772 246170769 244823227 239822388 235998878 239206543
3891 239206543 244768867 250371456 254778633 255589256 253983727 249738216 244662514 240746269 237223625
3900 237223625 233502388 231051674 231523037 233774185 237783909 241838684 243778000 244918098 245919704
3909 245919704 246586800 247039566 246987114 246110191 244612465 242056370 240042915 240637779 242008438
3918 242008438 243059158 243643761 242916336 241880417 241137981 241044998 242805481 244474182 244171867
3927 244171867 242904186 240596542 238609085 238624096 239598503 241266251 242977142 243844986 244309196
3936 244309196 244635105 244456768 243139267 241754761 241241455 241363297 242682934 243742218 242686749
3945 242686749 241265526 240816116 240715256 240769863 241024742 241559753 242073288 242195606 242210865 242367516
3955 242367516 242402306 242035389 241563568 241132736 240913620 241287460 241766930 241934299 241962204 241830826
3965 241830826 241699696 241753807 241895199 242122421 242328167 242363930 242350578 242335548 242390156 242682686 242967834
3976 242967834 243022194 242946148 242714157 242479553 242452850 242434273 242239723 242030869 241900444 241867542 242029190
3987 242029190 242242088 242425194 242485523 242232094 241874466 241546860 241282692 241167793 241177788 241347542
3997 241347542 241582146 241765499 241994629
4000 241994629
##END=$$ End of the data block
