##TITLE=AE2 $$ Begin of the data block
##JCAMP-DX=5.00 $$ ACD/SpecManager v 10.08
##SPECTROMETER/DATA SYSTEM=Alpha
##DATE=04 Dec 2015 11:34:10
##DATA TYPE=INFRARED SPECTRUM
##DATA CLASS=XYDATA
##ORIGIN=
##OWNER=
##NPOINTS=1765
##FIRSTX=399.76428223
##LASTX=3997.64306641
##MAXX=3997.64306641
##MINX=399.76428223
##MAXY=0.89020240
##MINY=0.43307951
##XFACTOR=1.0000000000
##YFACTOR=1.000000000000000e-9
##FIRSTY=0.81700861
##DELTAX=2.03961372
##XUNITS=1/CM
##YUNITS=ARBITRARY UNITS
##XYDATA=(X++(Y..Y))
399.8H17008615k815485k208651K71798k29538k478778j821161o53564m68553J409412
418.1H08014095J313388l190040m992843l555536l345788l698468j11520L714501K917767
436.5G97065556K256990L835797K503693o0R37283J104653r30428m62771J487315M80831
456.9H08278859j038492P7724n17845k504885j555741k82347j539886j191616J492858
475.2H01218629J283824k98142O58870P69972j701891j896858n09322k003968l735065
493.6G93786049k871990l435672n311489l039062J750469K387345M38333p28786l571510
511.9G79403687p533491r124637p853091j278758Q101046R233058j006007j0624171
528.3G59317636p895410K195359O498813K280474k984703m729867j788556K713442
$$ plain form
399.8 817008615 814193130 811984479 812256277 812026739 809547961 807726800 807073236 806604683 808014095
418.1 808014095 809327483 806137443 801144600 797589064 794243276 790544808 790433288 794147789 797065556
436.5 797065556 799322546 803158343 805662036 805661976 806599259 807703912 806773484 806310713 807798028 808278859
456.9 808278859 807240367 807318091 806800246 804295361 802739620 802457273 800917387 799725771 801218629
475.2 801218629 802502453 802204311 802863181 803633153 801931262 800034404 799525082 797521114 793786049
493.6 793786049 790914059 787478387 782166898 779127836 780878305 783265650 783703983 782975197 779403687
511.9 779403687 771870196 762745559 754892468 753613710 761714756 770947814 769941807 759317636
528.3 759317636 751422226 753617585 760116398 762396872 759412169 754682302 752893746 755607188
544.6G55607188K861142l1233K09272K070248P02798j518309j888871l535688p114231
562.9G47362316r241820j0709047j1746407o211578M891037J0187328O799579K619028
579.3G33950436j709640r270906j2933970o231189M375339J0038316P373095j861334
595.6G23730147q126617n52296J6765654K6128888K1945178J3908387P747590K959967
611.9H04506898J018882J393258N56708o41942J41859N48124j091599j826406r91702
630.2H03614080j075745j863777k360165m538894o598055l880263j323879n506336
646.6G76466966j2986958j9593835j8848717L099680L3118546L6644339J7343640L214658
662.9H18458319K45571m39942k667844j697839j43826r71019j860022r05037n57423
$$ plain form
544.6 755607188 758468330 758437097 758646369 760716617 761419415 759901106 758012235 754476547 747362316
562.9 747362316 738120496 727411449 715665042 709453464 714344501 724531829 731331408 733950436
579.3 733950436 732240796 722969890 710035920 703804731 708180070 718218386 725591481 723730147
595.6 723730147 715603530 715051234 731816888 757945776 779890954 793799341 801546931 804506898
611.9 804506898 805525780 806919038 807475746 806833804 806975663 807523787 806432188 804605782 803614080
630.2 803614080 802538335 800674558 798314393 793775499 787177444 783297181 781973302 776466966
646.6 776466966 763480008 743886173 725037456 728137136 761255682 797900021 815243661 818458319
662.9 818458319 818703890 818263948 815596104 813898265 813754439 812783420 810923398 810018361 809460938
681.2H09460938j725853j538753n74648j454592k465367j746119j668930k786934k363563
699.6G93136179p81834n53071n28515N07176N2989k511263m774868o397188o657124
717.9G71492481k648532K411365J893401k458035n235732o945014r482026p896602
734.3G41131306L35276N956650L271818r40383k495348l502369l996134l385425l742992
752.6G32632399n713404p303297q472741j0199606j0775149o689966K874613J1981666
768.9F98334515J3845563J0503888P825613P819832R223759R158373O729900L539861
785.3G66981304m73619m779994k366245R380639J7592966J3873458O649435K409040
801.6H09266984q78453l717899n315185p821500j2943566j9869089k6217699k4730921
$$ plain form
681.2 809460938 807735085 806196332 805621684 804167092 801701725 799955606 798286676 795499742 793136179
699.6 793136179 792354345 791801274 791272759 791779935 791832924 789321661 784546793 778149605 771492481
717.9 771492481 768843949 771255314 773148715 770690680 765454948 758509934 749027908 741131306
734.3 741131306 741466582 747423232 750695050 749754667 747259319 743756950 739760816 736375391 732632399
752.6 732632399 726918995 719615698 711142957 700943351 690168202 683478236 686352849 698334515
768.9 698334515 712180078 722683966 730509579 738329411 747553170 756711543 763441443 766981304
785.3 766981304 766507685 761727691 759361446 768742085 786335051 800208509 806857944 809266984
801.6 809266984 808388531 804670632 799355447 791533947 778590381 758721292 732503593 707772672
817.9G07772672j1867106J519859R076178J5219331J6422510P970810n200565j1957288
834.2G28956401k343416J5314520K2815346J8476665J0125935P77841o772697q709073
850.5G78641522l982127M873157J2704789J5099526J1483252M920363j065910n403280
866.8H17271292p222593m268884L077268R732902J1111617Q443714M769206J494705
883.2H44409227J21653K64764k12848r48489n44130k73169j074850j251638n93722
901.5H39896798r36985j731634j432180j286149k372623l126979l214955m191160m736185
919.9H16867948k339900R68695J790344J044035L86596j046359l007651l999591m269540
938.2H06394577m407704l368437o05166J883030K263844O52194j849532j213908L106594
$$ plain form
817.9 707772672 695905566 697425425 706501603 721720934 738143444 746114254 740913689 728956401
834.2 728956401 726612985 741927505 764742851 783219516 793345451 794123292 787350595 778641522
850.5 778641522 774659395 779532552 792237341 807336867 818820119 823740482 822674572 817271292
866.8 817271292 810048699 805779815 808857083 818589985 829701602 838145316 842914522 844409227
883.2 844409227 844530880 844795644 844582796 843634307 843090177 842817008 841742158 840490520 839896798
901.5 839896798 838959813 837228179 835795999 834509850 832137227 829010248 825795293 821604133 816867948
919.9 816867948 814528048 815496743 817287087 818331122 818717718 817671359 814663708 810664117 806394577
938.2 806394577 801986873 798618436 798013270 799896300 802160144 802812338 800962806 799748898 802855492
956.6H02855492L776550o07669l638387l045082j715303j685321j797259j388967j655757
974.9G91098297k660990l407359m250050n645990o308675n824149n539357n234421
991.3G52227306l687203k007126r12011J335502L950834L300965q60214n058289o302893
1009.6G41986871n092144n254925q539795j3350368j8200397k2181988k4671257k3383260
1025.9F21312737j3127625N628288K0289719K1507264J6659557J5618325J7432451
1040.2G05320716J7153799J3746620R559333O928027N874633M518450J935780n34535
1056.5G64502823j873374k958357m256785n011022n597413p107853r129584j1180699
1072.8G17387736j4213562j7666936j7663658j1347890j670420M996181N346954Q87274
$$ plain form
956.6 802855492 806632042 806024373 802385986 799340904 797625601 795940280 794143021 792754054 791098297
974.9 791098297 788437307 785029948 780779898 775133908 768825233 763001084 757461727 752227306
991.3 752227306 748540103 746532977 745620966 746956468 750907302 754208267 753348053 748289764 741986871
1009.6 741986871 736894727 731639802 723100007 709749639 691549242 669367254 644695997 621312737
1025.9 621312737 608185112 613813400 634103119 655610383 672269940 687888265 705320716
1040.2 705320716 722474515 736221135 745780468 752708495 758583128 763101578 765037358 764502823
1056.5 764502823 762629449 759671092 755414307 750403285 744805872 737698019 728568435 717387736
1072.8 717387736 703174174 685507238 667843580 656495690 654825270 659821451 665168405 666055679
1089.2F66055679m953026r568453j2773693j6391218k1550059k6366770k5215745j3995409
1105.5E35241306O03497P546902M609704n286098j6380846j9248009j0640830M977554
1121.8E01423180K1195948L2180488L7271560L8465321L4495413K5196016J4439344
1136.1G04667270N119741k477050p950306j0688543j1909127j3719917j5839397j6304017
1152.4F30898654j5177667j4539361j5777945j8502832k1633386k5209010k9084206
1166.7D90974247k9203355k0710528p980853K17229L554732M120558N648405J7481595
1183D64102030L3924907L2684893R462952j5581131k5428503j7251790K057612K0511001
1199.3E04481971L0402124L2516241L0175090K5357843J9629120J4453709J0413647
$$ plain form
1089.2 666055679 661102653 651534200 638760507 622369289 600819230 574452460 549236715 535241306
1105.5 535241306 535844803 543391705 548001409 542715311 526334465 507086456 496445626 501423180
1121.8 501423180 522619128 554799616 592071176 630536497 665031910 690227926 704667270
1136.1 704667270 709787011 707309961 699359655 688671112 676761985 663042068 647202671 630898654
1152.4 630898654 615720987 601181626 585403681 566900849 545267463 520058453 490974247
1166.7 490974247 461770892 441060364 433079511 433296740 436851472 440972030 446620435 464102030
1183 464102030 498026937 530711830 540174782 524593651 499165148 481913358 483970970 504481971
1199.3 504481971 534884095 567400336 597575426 622933269 642562389 657016098 667429745
1213.6F67429745O928742L029764j215816m475236n821943n895853n519152m710197
1229.9F49750054m047930n061627q004010j0351717q905888l836989J37329j847267
1246.2F07831955r184063j5460610j3093591k363145O006479N805493K576172J208305
1262.5E83326995P96616R30965M648745J4284909K4192929K4611891J4239013j04368
1278.8F66927695j1704385j5390396p628858Q330583K2285641K6697874K2765040J5549719
1295.2G27832913P830680p35343j0693788j8656254j4241040M630387J8832386J6301512
1311.5G31101453P634700K513826J99615k926766p889033j3150394j6394734j4998376
1327.8F86090291r856105m076362L101289J1156142J3662756P377803j47045J67310
$$ plain form
1213.6 667429745 674358487 677388251 676172435 671697199 665875256 659979403 654460251 649750054
1229.9 649750054 645702124 640640497 632636487 622284770 613378882 609541893 609679222 607831955
1246.2 607831955 598647892 583187282 570093691 567730546 573737025 579542518 582118690 583326995
1262.5 583326995 584123611 585054576 589703321 603988230 628181159 652793050 667032063 666927695
1278.8 666927695 655223310 639832914 632204056 640534639 662820280 689518154 712283194 727832913
1295.2 727832913 735663593 734928250 724234462 705578208 691337168 695967555 714799941 731101453
1311.5 731101453 738736153 741249979 741449594 738522828 730633795 717483401 701088667 686090291
1327.8 686090291 676234186 672157824 675259113 686415255 700078011 707455814 707308769 707476079
1344.1G07476079O636024J2063324J2738467J0068714O368339K304674j773835o508767
1360.4G49373019j3937593k1237135k3709893k2104144j4856279j657903J4283955
1374.7F66154027K3955524K2184551J2487590P08640p331550j0770083q959711l230929
1391F95198059L504694J0758400J4234125J1966944O650329K269923o08086k956748
1407.3G41017640m125715m880070n687237n876959o563663r125769r542644p220268
1423.7F87995315k706886K731681M166484O82294m269242r824991q126497L31640r47595
1442F70032203q301914j0985255j0256588r588957p732153n094111n830109j0287345
1458.3F01955771q966803m116476K812088J0462522J3551236J4470279J4255881J0505080
$$ plain form
1344.1 707476079 714112103 726175427 738913894 748982608 755350947 757655621 755881786 749373019
1360.4 749373019 735435426 714198291 690488398 668384254 653527975 651870072 666154027
1374.7 666154027 690109551 712294102 724781692 725490332 718158782 707388699 698428988 695198059
1391 695198059 698702753 709461153 723695278 735662222 742312551 744582474 743974388 741017640
1407.3 741017640 736891925 732011855 726324618 720447659 713883996 704758227 695215583 687995315
1423.7 687995315 685288429 688020110 692186594 692868888 688599646 678774655 670648158 670979798 670032203
1442 670032203 661730289 650745034 640488446 630899489 623167336 618073225 612243116 601955771
1458.3 601955771 592988968 588872492 591684580 602147102 615698338 630168617 644424498 654929578
1474.7F54929578R026349J1435926J3249099J1790991P820249M223048M72129m019618
1491G08927751o364048q677483j4460086k0147205k1618664k1462023l1034768n3476214
1507.3E31687260l6706955j907199J9426763L2037079L7048757L3934892L1309664
1521.6F46830261K4589121J7653287J4984548J0988414Q301616O423354L488958K290666
1537.9G35550225J369357k814114n881191o984114p598817r832263j2360096j3636649
1554.2F77812338j4086485k3696899l5560489k4612785k0704746j9220650j2653947
1568.5E27276337n207062R75252P797479J8784404K4445415K4161100K3115337J9449353
1584.8F40797615J7498553K1393895K6715398K5161147J6770303P858336J176834m793584
$$ plain form
1474.7 654929578 663955927 675391853 688640952 700431943 708252192 712475240 712947369 708927751
1491 708927751 702563703 693886220 679426134 659278929 637660265 616198242 585163474 531687260
1507.3 531687260 494980305 493073106 512499869 544536948 581585705 615520597 646830261
1521.6 646830261 671419382 689072669 704057217 715045631 723347247 729770601 733259559 735550225
1537.9 735550225 736919582 734105468 728224277 721240163 713641346 703809083 691448987 677812338
1554.2 677812338 663725853 640028954 604468465 579855680 559150934 539930284 527276337
1568.5 527276337 522069275 523044527 530842006 549626410 574071825 598232925 621348262 640797615
1584.8 640797615 658296168 679690063 706405461 731566608 748336911 756195247 757372081 752578497
1601.1G52578497j1262178j7649830k2563457k1644533j0975778K581715J1965752
1615.4F83030188J4417648Q901894M450262J912654J02341m89235j142800j024485
1631.7G10158467k69890k292513n947352o597876o307722o088316p552266q640409
1648F66462123n561173o197989j4315009j5113115j5260875k0022333k6840091k5795936
1664.3E37355602j2629509L808439J9627690K5079608K8104782K8651357K1879613
1678.6F51877582J7208099J6269803J5379727R266615N899191N904317N858421O778956
1694.9G34442711P409930O929040O060124L168702J641333J230955J245200K375961
1711.3G64503956L922403M616558K455831j251161k813876m209697o309688r077549
$$ plain form
1601.1 752578497 741316319 723666489 701103032 679458499 668482721 671064436 683030188
1615.4 683030188 697447836 706349730 710799992 712712646 712814987 712325752 711182952 710158467
1631.7 710158467 709888577 707596064 701648712 695050836 688743114 682654798 675102532 666462123
1648 666462123 660900950 654702961 640387952 625274837 610013962 589991629 563151538 537355602
1664.3 537355602 524726093 528534532 548162222 573241830 601346612 629997969 651877582
1678.6 651877582 669085681 685355484 700735211 710001826 715901017 721805334 727663755 734442711
1694.9 734442711 741852641 748781681 754841805 758010507 759651840 760882795 762127995 764503956
1711.3 764503956 768426359 773042917 775498748 774247587 771433711 767224014 760914326 751836777
1727.6G51836777j4145136k3366869m2626440m3899477j1852204K1957337M3712914
1741.9F81616902M4590712L5733223K6506603J9796729J3315677Q773745Q000075P483244
1758.2H45816910N525947L880441K435923J972735K529502L657937L809511K081216
1774.5H71710122J281917J770615J750112J095295J020014J164258J385867J655698
1790.8H82833898J110911N0009K6941O14405O00993n4776r3460N78224P95961K87532
1811.2H86750638p1823J94728K80559J96040N26965P98285M63128K90990K00748o43313
1831.6H88986945p94113j29461J98901K86698P86007Q67426k50220r63927p63773m48943
1852H87775540l47197j09255K07961K12609J15693M89116R58442M09544q29458j094580
$$ plain form
1727.6 751836777 737691641 714324772 671698332 627798855 615946651 637903988 681616902
1741.9 681616902 726207614 761940837 788447440 808244169 821559846 830333591 838333666 845816910
1758.2 845816910 851342857 855223298 857659221 859631956 862161458 865819395 869628906 871710122
1774.5 871710122 872992039 874762654 876512766 877608061 878628075 879792333 881178200 882833898
1790.8 882833898 883944809 883994818 884021759 884636164 885237157 885182381 885088921 885667145 886463106 886750638
1811.2 886750638 886678815 886873543 887154102 887350142 887877107 888675392 889138520 889429510 889630258 888986945
1831.6 888986945 888192832 888063371 888262272 888548970 889334977 890202403 889952183 888988256 888224483 887775540
1852 887775540 887428343 887319088 887527049 887739658 887855351 888344467 889302909 889712453 888882995 887788415
1872.4H87788415q19802q53241q71181r36032j359462k045274k944231l843129k234876
1890.7H71881187K214849M549801L111244J181602N35309K89917Q6069J49072K30729
1909.1H84229779N5850J23560O01411O75500J26779j18912j70827n49495p18057n09143
1929.5H83746445l61979m60744m22001m5061L11554K88963j03712m33803n72621m59254
1949.9H81487787j51932j57893m79877n77390m96686n42581m04179j05441k13563n14209
1970.3H77844036m36187k77698m09782n17965l55541k26081k21729j8060K27749P1943
1990.7H75680685l37124m31895k73705k13563n1260K09033J80662j8835q8036k46525
2011.1H74409437n17845n22494m22597n85675p12216o21438m04418Q1122M29571K30550
$$ plain form
1872.4 887788415 886968613 886115372 885244191 884308159 882948697 880903423 877959192 874116063 871881187
1890.7 871881187 874096036 878645837 881757081 882938683 883473992 883763909 883849978 883999050 884229779
1909.1 884229779 884285629 884409189 885010600 885686100 885812879 885693967 885523140 884973645 884255588 883746445
1929.5 883746445 883384466 882923722 882501721 882456660 882768214 883057177 882953465 882519662 881947041 881487787
1949.9 881487787 881335855 881177962 880698085 880120695 879624009 879081428 878677249 878571808 878358245 877844036
1970.3 877844036 877407849 877130151 876720369 876202404 875846863 875620782 875399053 875380993 875608742 875680685
1990.7 875680685 875343561 874911666 874637961 874424398 874373138 874582171 874762833 874743998 874655962 874409437
2011.1 874409437 873891592 873369098 872946501 872360826 871648610 871027172 870622754 870703876 871133447 871363997
2031.5H71363997k61306o61195p93755r56118j265108j271129p71940n6624O89447
2049.8H66016269J284420J311898P98166L73066K45571Q6963n0306O6101K63334L39210
2070.2H70734692M39703N33879L67164R3401M2856N6743r5844j52230n2214j11759
2090.6H71856391k68340k47419j83165k14100j68800m2200o7115j95324j60039k9921
2111H70279968j6988o8962l1173K4378L9518J40130K62618K42591J85252K01880J50621
2133.5H71409833K6226O199Q1659Q7380N8949P0393Q285j05142j04845n5611j21415
2155.9H71361911j89423j38462j00255j61230j92821j36316m1902L1173J3173q6844
2176.3H70359004j92643j90138r3699m5180m4227P451L8087n0247j25766r7334q3983
$$ plain form
2031.5 871363997 871102691 870441496 869647741 868691623 867426515 866155386 865383446 865326822 866016269
2049.8 866016269 867300689 868612587 869410753 869783819 870029390 870116353 870066047 870132148 870395482 870734692
2070.2 870734692 871174395 871708274 872075438 872168839 872211695 872268438 872172594 872020364 871968150 871856391
2090.6 871856391 871588051 871340632 871157467 870943367 870774567 870732367 870665252 870469928 870309889 870279968
2111 870279968 870262980 870194018 870162845 870187223 870226741 870366871 870629489 870872080 871057332 871259212 871409833
2133.5 871409833 871436059 871442258 871523917 871611297 871670246 871740639 871748924 871643782 871538937 871483326 871361911
2155.9 871361911 871172488 871034026 870933771 870772541 870579720 870443404 870401502 870432675 870445848 870359004
2176.3 870359004 870166361 869976223 869882524 869837344 869793117 869800568 869838655 869788408 869662642 869565308 869481325
2198.7H69481325j25468j28567j26719j84000k50161k70903l00645l74735l91900l39628
2219.1H66988599l26216l67165l68356l22759l02673k84076k21669j81556j73867j16944
2239.5H64323318l3617K2411J00375K10940K46704J65105P9453N8114p450j47224k17735
2262H64800394k22505k70605l14474k72572k58207k84851j57833M6969J05858J00910
2282.3H63273084J44422Q6248q8513j75655j83999k41041k71142j70708l6537O2942
2302.7H62399101J84834K54691J53184L2365L6597L5108k6703N36R7335M8935o5565
2325.2H63150418p7427j05023k00868k25007k39372l72351m15802k98917l62158m90606
2345.6H60362887j93596J78576K41637J45495J42336N1797k61009m23372n14984p84993
$$ plain form
2198.7 869481325 869355857 869227290 869100571 868916571 868666410 868395507 868094862 867720127 867328227 866988599
2219.1 866988599 866662383 866295218 865926862 865604103 865301430 865017354 864795685 864614129 864440262 864323318
2239.5 864323318 864289701 864312112 864412487 864623427 864870131 865035236 865114689 865172803 865165353 865018129 864800394
2262 864800394 864577889 864307284 863992810 863720238 863462031 863177180 863019347 863066316 863172174 863273084
2282.3 863273084 863417506 863503754 863415241 863239586 863055587 862814546 862543404 862372696 862336159 862399101
2302.7 862399101 862583935 862838626 862991810 863024175 863060772 863095880 863069177 863069713 863167048 863215983 863150418
2325.2 863150418 863072991 862967968 862767100 862542093 862302721 861930370 861514568 861215651 860853493 860362887
2345.6 860362887 860169291 860347867 860589504 860734999 860877335 860929132 860668123 860244751 859729767 858944774
2366H58944774r21846q19504p76529p47025n10931k49207k02597k06351q4221N185
2386.4H54431748q940M3869J41561R5010J7523P0393R5427P868l7610m1306j51933
2408.8H54663610k60651k43902k43187k95400k50459j70410k29835l41773l72827l93928
2429.2H51861238m63068m51148l33428k50518k19703j61350j32382k11715k76208k60830
2449.6H49100888k71738l03089k61724j92702j45316o2049L8922p629k15531l86595
2470H47293437m59612m50015l28720j65522j08301j66118k10345k46823l74615n14448
2490.4H44268918n28753m51743l25680o4194K64287M05550L79979L58582K58028J0670
2510.8H44575644j90557j77502p9572j0133J11520J91927J01566J848P391j4186q2850
$$ plain form
2366 858944774 858022928 857203424 856426895 855679870 855168939 854919732 854717135 854510784 854426563 854431748
2386.4 854431748 854422808 854466677 854608238 854703248 854720771 854791164 854886591 854894459 854856849 854815543 854663610
2408.8 854663610 854402959 854159057 853915870 853620470 853370011 853199601 852969766 852627993 852255166 851861238
2429.2 851861238 851398170 850947022 850613594 850363076 850143373 849982023 849849641 849637926 849361718 849100888
2449.6 849100888 848829150 848526061 848264337 848071635 847926319 847864270 847903192 847895563 847680032 847293437
2470 847293437 846833825 846383810 846055090 845889568 845781267 845615149 845404804 845157981 844783366 844268918
2490.4 844268918 843740165 843288422 842962742 842898548 843162835 843568385 843948364 844306946 844564974 844575644
2510.8 844575644 844385087 844207585 844128013 844117880 844229400 844421327 844522893 844524741 844532132 844517946 844435096
2533.2H44435096q6963j13905k74300l88861l68953m29511n75066n85734m85480l93152
2553.6H40733171j87219J32263K37763Q2970m9055j89364m96566p36833p20560o42896
2574H38163674n98431m82499m12524n33462o09696m79400l29673j75178J57595M70876
2594.4H35171282M56393L21150L08275K29001M6253j5378j2695r9957j72556j58250
2614.8H36073518k05219l38912l61264l18706m32312n65768n43117n40674n86867m63545
2635.2H31717134k65658k54691l15130k68996k55346k96950j65463R4593J89900J47462
2655.6H30326855J93596K34068J43468J01626J03950m3690k21670k60055l08096m14789
2676H29855263l89874l04878l74972m85301m30227l44932l85642l90708l09050l15607
$$ plain form
2533.2 844435096 844348133 844234228 843959928 843571067 843202114 842772603 842197537 841611803 841126323 840733171
2553.6 840733171 840545952 840678215 840915978 840998948 840949893 840760529 840263963 839527130 838806570 838163674
2574 838163674 837565243 837082744 836670220 836136758 835527062 835047662 834717989 834542811 834700406 835171282
2594.4 835171282 835627675 835948825 836257100 836486101 836532354 836516976 836504281 836404324 836231768 836073518
2614.8 836073518 835868299 835529387 835168123 834849417 834417105 833851337 833308220 832767546 832180679 831717134
2635.2 831717134 831451476 831196785 830881655 830612659 830357313 830060363 829894900 829989493 830179393 830326855
2655.6 830326855 830520451 830754519 830897987 830999613 831103563 831059873 830838203 830578148 830270052 829855263
2676 829855263 829465389 829160511 828785539 828300238 827870011 827525079 827139437 826748729 826439679 826124072
2696.4H26124072l46959k72452k41757l25322l13818j78874j71065k76685k85089k63333
2716.8H23448718l14653l17514k76089l65615n39720o11544n87523n77151m78387k54154
2737.2H19126368j85967l30746m07219m13537n40137o43731n71191m86612m72605m30107
2757.6H14644516m17471n26488o11902n84304o00099o79136o07729m27246l82721l86000
2778H09421420k70605j80006k38657l02017l04103m13358n45859m76182l61025m02093
2798.4H05927515m86493n10514n95212p01904o57857o45279q09610r45390j038432
2816.7G99536824j268387j564502j832605k295196l116250m203141n542159o794572
2833G72920012o262421k555490K015710M063010L876687L242135K462267J464665N69225
$$ plain form
2696.4 826124072 825777113 825504661 825262904 824937582 824623764 824444890 824273825 823997140 823712051 823448718
2716.8 823448718 823134065 822816551 822540462 822174847 821635127 821023583 820436060 819858909 819380522 819126368
2737.2 819126368 818940401 818609655 818202436 817788899 817248762 816605031 816033840 815547228 815074623 814644516
2757.6 814644516 814227045 813700557 813088655 812504351 811904252 811225116 810617387 810190141 809807420 809421420
2778 809421420 809150815 808970809 808732152 808430135 808126032 807712674 807166815 806690633 806329608 805927515
2798.4 805927515 805441022 804930508 804335296 803633392 802975535 802330256 801520646 800575256 799536824
2816.7 799536824 798268437 796703935 794871330 792576134 789459884 785256743 779714584 772920012
2833 772920012 766657591 764102101 766117811 770180821 774057508 777299643 779761910 781226575 781795800
2851.4G81795800r9242o49810j028418j251579j564204j990915k364099k685845k854526
2869.7G67307162k500832j664340j001358r44019j330197j866221k389967k815903
2886.1G52794325l162384l517151l805458l879011l810465l570974k763927j326323
2902.4G26958632J72914J344919K250552K768636K564847J680970N93722l83496j266480
2920.7G36685216j976609k426266k782345l330827m102409m585624l950238j812875
2937G11718023P88390J954079J148045l19958j082301r31382p77542j648128l449977
2955.4G07399249n205154o034673n422294l466189j105606M04000N59867N960o70254
2973.8F86464906j673162k955079l534258k498507m98474O59168N00083N39541J703680
$$ plain form
2851.4 781795800 781696558 781046748 780018330 778766751 777202547 775211632 772847533 770161688 767307162
2869.7 767307162 764806330 763141990 762140632 761196613 759866416 758000195 755610228 752794325
2886.1 752794325 749631941 746114790 742309332 738430321 734619856 731048882 728284955 726958632
2902.4 726958632 727131546 728476465 730727017 733495653 736060500 737741470 738335192 737951696 736685216
2920.7 736685216 734708607 732282341 729499996 726169169 722066760 717481136 713530898 711718023
2937 711718023 712506413 714460492 715608537 715288579 714206278 713274896 712497354 710849226 707399249
2955.4 707399249 702194095 696159422 690737128 687270939 686165333 686569333 687129200 687135160 686464906
2973.8 686464906 684791744 681836665 678302407 675803900 675305426 675964594 676464677 677004218 678707898
2992.1F78707898L052532L468514K957821K381980K483189L084481L539622L577411
3008.4G03253448L270268K756298K345562K395868K837181L198326L118515K644002
3024.7G25819468J998187J381695J069307J269460J811385K275169K383172K053261
3041.1G40061104J409233P65979K73049k32696p99358j202524j564503k254486l007710
3059.4G33448088l289997l077031k689838k573967k921343l423929l707528l551841
3075.7G08212614l056645k667368k625644k875984l285885l560125l565073l451586
3092.1F83124304l156007k565085j824618j134872m79222K84851R96709J340032J345515
3110.4F77931607J349926J396239J242995R70423O94633L14176j28806o05226j231431
$$ plain form
2992.1 678707898 681760430 685228944 688186765 690568745 693051934 696136415 699676037 703253448
3008.4 703253448 706523716 709280014 711625576 714021444 716858625 720056951 723175466 725819468
3024.7 725819468 727817655 729199350 730268657 731538117 733349502 735624671 738007843 740061104
3041.1 740061104 741470337 742236316 742509365 742276669 741477311 740274787 738710284 736455798 733448088
3059.4 733448088 730158091 727081060 724391222 721817255 718895912 715471983 711764455 708212614
3075.7 708212614 705155969 702488601 699862957 696986973 693701088 690140963 686575890 683124304
3092.1 683124304 679968297 677403212 675578594 674443722 673964500 674249351 675246060 676586092 677931607
3110.4 677931607 679281533 680677772 681920767 682891190 683585823 683899999 683771193 683165967 681934536
3128.8F81934536j981020k705217l323555l877699m387915m817605n193055n532205
3145.1F50116265n838931o118536o386876o646335o791413o768882o626248o277621
3161.4E98661423n721271n114436m459262l701568k879381k033115j164496l38971
3177.7E73248923L45707R07600J401841J768709J960873K053023K143979K220094K263307
3196.1E88314056K334655K403021K442717K510846K598107K624690K590597K555966
3212.4F08374655K463222K238452J980067J761734J548171J396716J381397J445591
3228.7F22590005J536072J577198J407743J207709J246750J401127J536786J590967
3245F34094357J437843J182735J069844J080871J012742P64966M63963K32935L6180
$$ plain form
3128.8 681934536 679953516 677248299 673924744 670047045 665659130 660841525 655648470 650116265
3145.1 650116265 644277334 638158798 631771922 625125587 618334174 611565292 604939044 598661423
3161.4 598661423 592940152 587825716 583366454 579664886 576785505 574752390 573587894 573248923
3177.7 573248923 573594630 574502230 575904071 577672780 579633653 581686676 583830655 586050749 588314056
3196.1 588314056 590648711 593051732 595494449 598005295 600603402 603228092 605818689 608374655
3212.4 608374655 610837877 613076329 615056396 616818130 618366301 619763017 621144414 622590005
3228.7 622590005 624126077 625703275 627111018 628318727 629565477 630966604 632503390 634094357
3245 634094357 635532200 636714935 637784779 638865650 639878392 640643358 641107321 641340256 641376436
3263.4F41376436j92583m40240p11083j152873j727879k250731k696872l059328l402292
3281.7F25742555l797293m174531m544615m978240n572378o429375p505238q646607
3298E80094278r675145j0554612j1241257j1504352j0851741q455217l919005K083122
3314.4E15976071Q170545J3021052J5948236J7015398J6665876J5397191J3735831
3328.6F15930200J2024283J0358453Q807421P371366O012380M825711L836513K914488
3345F72080815K076447J449406R45508M16637m2796l17753n08546p60615j001597j114607
3365.4F73222899j245737j521229j772404j773238j606286j516104j493990j480699
3381.7F60813212j462578j374960j192272j011729j095176j388788j446665j168668
$$ plain form
3263.4 641376436 641183853 640743613 640032530 638879657 637151778 634901047 632204175 629144847 625742555
3281.7 625742555 621945262 617770731 613226116 608247876 602675498 596246123 588740885 580094278
3298 580094278 570419133 559864521 548623264 537118912 526267171 517811954 513892949 515976071
3314.4 515976071 524146616 537167668 553115904 570131302 586797178 602194369 615930200
3328.6 615930200 627954483 638312936 647120357 654491723 660504103 665329814 669166327 672080815
3345 672080815 674157262 675606668 676552176 676968813 676926017 676608264 676099718 675339103 674337506 673222899
3365.4 673222899 671977162 670455933 668683529 666910291 665304005 663787901 662293911 660813212
3381.7 660813212 659350634 657975674 656783402 655771673 654676497 653287709 651841044 650672376
3398F50672376r98556j278282j585066j390398j030564r75072j105190j175701j111269
3416.3F40022278r66549r33349r72569q24094n19216k90275k75016k92241j93656k37405
3436.7F34517908l69370j00851M90248Q74937Q54015O40750N77688O63162P70986R71019
3457.1F39890492J244247J390278J488328J701296J765966J524508J299977J322568
3473.4F51627660J395523J418114J405597J277804J172841J238703J256407J203000
3489.8F61995649J302302J484990J583934J551509J608551J693010J381516J097680
3506.1F73699141J349866J631737J668811J602292J535117J635254J873672K092063
3522.4F87087953J912892J501858J410425J536548J735747J988411J941144J685739
$$ plain form
3398 650672376 649673820 648395538 646810472 645420074 644389510 643414438 642309248 641133547 640022278
3416.3 640022278 639055729 638122380 637149811 636325717 635806501 635516226 635241210 634948969 634755313 634517908
3436.7 634517908 634148538 634047687 634537935 635412872 636266887 636907637 637485325 638148487 638919473 639890492
3457.1 639890492 641134739 642525017 644013345 645714641 647480607 649005115 650305092 651627660
3473.4 651627660 653023183 654441297 655846894 657124698 658297539 659536242 660792649 661995649
3489.8 661995649 663297951 664782941 666366875 667918384 669526935 671219945 672601461 673699141
3506.1 673699141 675049007 676680744 678349555 679951847 681486964 683122218 684995890 687087953
3522.4 687087953 689000845 690502703 691913128 693449676 695185423 697173834 699114978 700800717
3538.7G00800717J918018K446711K446830J817763J519680J865685K042055J922906
3555G16780365K074420K430260K625048K693117K805591K637088J914561J580536J975536
3573.4G37516522K491594K751410K903342L092051L333449L426015K919257K242208
3589.7G60675848K294540K671957K784133K758086K661287K466560K480984K653658
3606G81447053K654850K422989K260446K068758J743854J531958J098991O35802R44555
3624.4G96809256J743734K218544J645267J152277J453102J736403J856684K046287
3640.7H10661554K283872K716958L310144K899766P75158l01540K58744Q87990P41840
3659H24234486M28021M96745R78291J517236J565993J077354Q15868M33505o29247
$$ plain form
3538.7 700800717 702718735 705165446 707612276 709430039 710949719 712815404 714857459 716780365
3555 716780365 718854785 721285045 723910093 726603210 729408801 732045889 733960450 735540986 737516522
3573.4 737516522 740008116 742759526 745662868 748754919 752088368 755514383 758433640 760675848
3589.7 760675848 762970388 765642345 768426478 771184564 773845851 776312411 778793395 781447053
3606 781447053 784101903 786524892 788785338 790854096 792597950 794129908 795228899 795864701 796809256
3624.4 796809256 798552990 800771534 802416801 803569078 805022180 806758583 808615267 810661554
3640.7 810661554 812945426 815662384 818972528 821872294 822647452 822345912 822604656 823492646 824234486
3659 824234486 824662507 825159252 826137543 827654779 829220772 830298126 831113994 831547499 830918252
3677.4H30918252r23335l01361N43654J308322J782417J018286n38290p50363j32501
3695.8H32925081L13044M47452K51472K5272L48151R64999R58264j18494q79109n26309
3716.2H34709823P0572L57389K60354p2658l13640j06216N89192J338899J020670l51071
3736.5H37503314q53717m48346q7262J36555K81095K47419k49624r42648p63952k93017
3756.9H34529817k59280m47989l28898j0729P9692j78636n82814n97596n9128M42684
3777.3H32587123K59340k98918m00781l24190l30746j64568N4180K44796M98355N87940
3797.7H32712531L99232j2040n05209p10547p99954o15597j5735M94778O06715M41194
3818.1H31995368L6538o79076q95619m83096j41382P7784M32431P24018N26071j91748
$$ plain form
3677.4 830918252 829994917 829693556 830237210 831545532 833327949 834346235 833807945 833057582 832925081
3695.8 832925081 833238125 833685577 833937049 833962321 834310472 835275471 836233735 836115241 835236132 834709823
3716.2 834709823 834780395 835137784 835398138 835325480 835011840 834905624 835494816 836833715 837854385 837503314
3736.5 837503314 836649597 836201251 836113989 836250544 836531639 836779058 836529434 835586786 834822834 834529817
3756.9 834529817 834270537 833822548 833493650 833482921 833562613 833383977 832801163 832203567 832144439 832587123
3777.3 832587123 832846463 832547545 832146764 831822574 831491828 831327260 831381440 831626236 832124591 832712531
3797.7 832712531 833111763 833099723 832594514 831883967 831084013 830468416 830452681 830947459 831554174 831995368
3818.1 831995368 832031906 831352830 830457211 829974115 829832733 829910517 830342948 831066966 831593037 831401289
3838.5H31401289q19326j002788q55148k89381N55873J016498K93493j075685j174152
3856.9H28050673n57303J54018M98176K48372R537j5199k65956o33061n91159j70469
3877.3H26727629K44438K67864m709k57433m57227k94804j15455k57134q4579M45366
3897.7H26213956O32167J23024n92590r61542q95619n65112j36733J80841K09808J9371
3918.1H24227571j13964j01029j21296k21729j82748n3108r1910k43366k84076j45316
3938.5H22669029M5836N6863r7573j24335j28567l43204m31299k39790j20460j47284
3958.9H21139216j15811q3507j22308j22845l3021P1585N7399j1802k1457k0206l0577
3981.3H20706666o7950j82688k58744k10941j53243j65165k09927j75178
$$ plain form
3838.5 831401289 830581963 829579175 828724027 828434646 828990519 830007017 830300510 829224825 828050673
3856.9 828050673 827493370 827647388 828145564 828393936 828403473 828388274 828122318 827489257 826898098 826727629
3877.3 826727629 826972067 827239931 827235222 826977789 826520562 826225758 826110303 825853169 825768590 826213956
3897.7 826213956 826846123 826969147 826376557 825415015 824519396 823954284 823817551 823998392 824208200 824227571
3918.1 824227571 824113607 824012578 823891282 823669553 823486805 823433697 823341787 823098421 822814345 822669029
3938.5 822669029 822714865 822771728 822674155 822549820 822421253 822078049 821646750 821406960 821286500 821139216
3958.9 821139216 821023405 820939898 820817590 820694745 820661724 820733309 820790708 820778906 820757449 820737243 820706666
3981.3 820706666 820638716 820456028 820197284 819986343 819833100 819667935 819458008 819282830
3997.6H19282830
$$ plain form
3997.6 819282830
##END=$$ End of the data block
