##TITLE=ADA - Hidrolise $$ Begin of the data block
##JCAMP-DX=5.00 $$ ACD/SpecManager v 10.08
##SPECTROMETER/DATA SYSTEM=Alpha
##DATE=26 Feb 2015 09:50:54
##DATA TYPE=INFRARED SPECTRUM
##DATA CLASS=XYDATA
##ORIGIN=
##OWNER=
##NPOINTS=1765
##FIRSTX=399.76428223
##LASTX=3997.64306641
##MAXX=3997.64306641
##MINX=399.76428223
##MAXY=0.75488734
##MINY=0.07468840
##XFACTOR=1.0000000000
##YFACTOR=1.000000000000000e-9
##FIRSTY=0.73058832
##DELTAX=2.03961372
##XUNITS=1/CM
##YUNITS=ARBITRARY UNITS
##XYDATA=(X++(Y..Y))
399.8G30588317k544344O6221j050770l750563l508866j127958p45356j913547j813651
418.1G14199483j094460j654804k269387j111508R00925L46541k504587l345013j406669
436.5G02060521m72546j996160l020823j773595q92818k238453l370523k232433q13424
454.8F85249746j881182l734529k932668j512230k445817m656672n127966m048467
471.2F58910215m030526m326761j909732L212988P182181P233918N305826L868580
487.5F75446689J698792k746045p414937j0322273j4621437k3466349l2411456k6897430
503.8E59265554j218796K5020778L0867100K1316111J2196839P868290O879509Q374392
520.1F70569777R554744O924093J188874k906739l471017m306496q049130j2445629
$$ y = [730588317, 728043973, 728110194, 727059424, 723308861, 719799995, 718672037, 717926681, 716013134, 714199483, 713105023, 711450219, 709180832, 708069324, 708970249, 709316790, 706812203, 703467190, 702060521, 701587975, 699591815, 696570992, 694797397, 693904579, 691666126, 688295603, 686063170, 685249746, 683368564, 679634035, 676701367, 675189137, 672743320, 668086648, 662958682, 658910215, 654879689, 650552928, 648643196, 651856184, 659038365, 666272283, 671578109, 675446689, 677145481, 674399436, 666984499, 656662226, 642040789, 618574440, 586162984, 559265554, 558046758, 583067536, 613934636, 635250747, 647447586, 655315876, 662195385, 670569777, 680124521, 687048614, 688237488, 685330749, 681859732, 677553236, 669504106, 657058477]
536.4F57058477j5015721j8066466k3909211k8924584k7491331j9199908r779573l438115
552.7E11233568L052533J4550447K8162241L6084891L5661041L0365527K2925198J4323652
569.1F96359098P710874N634725N142808K538681k69472N2869J469731L04282k067924
587.4G16875672j922547p4208l82304k736271l365338j797795j656055l888667m983962
605.8F96068525l397047k636433m827738o911039o655514p020772j1514842j9471765
622.1F33633375k9325604m0160060l4841657R175897N5575430M5872271Q9169l5578907
638.4F04439914n9062123p5527400o5585911o027013P3321760J05702459Q1313730
652.7F58575416M5251667K2654057J3067245R201884N027593J109480o26206j713932
$$ y = [657058477, 642042756, 623976290, 600067079, 571142495, 543651164, 524451256, 514671683, 511233568, 514286101, 528836548, 556998789, 593083680, 628744721, 659110248, 682035446, 696359098, 704069972, 709704697, 714847505, 717386186, 717116714, 717169583, 718639314, 718943596, 716875672, 714953125, 714878917, 714496613, 711760342, 708395004, 706597209, 704941154, 701052487, 696068525, 692671478, 690035045, 685207307, 678296268, 671640754, 664619982, 653105140, 633633375, 604307771, 564147711, 529306054, 538481951, 594057381, 639929652, 640018821, 604439914, 545377791, 469850391, 404264480, 398237467, 471559227, 577261686, 658575416, 703827083, 726481140, 739548385, 748750269, 753777862, 754887342, 754261136, 752547204]
669G52547204k651572l622114m485488m265488m892766q022785j2519121j7834902
685.3F94252968k6878417l8692832l6106467l255963L7235796M8422456L2578528J5686810
701.6G23242879P559717L871858R83298o95527n92470l05355j327097k634466k624571
720G27478266j795948j940191l069162l393650k632320k512097l676236m480839l923774
738.3G00054049l489434m511893n840778o015778n885124p061362r423435j1890948
754.7F45935297j5232503k1026433k9589116m4952333p0459903q5651308n8735132
768.9C20288569N194425O7357600R7743481R3575836O8585276L7920058J4433384K443910
785.3G07542539k219856k925575j795173j718998l668606n610585o426096q173406
$$ y = [752547204, 749895632, 746273518, 741788030, 737522542, 732629776, 724606991, 712087870, 694252968, 667374551, 628681719, 592575252, 589319289, 626555085, 674977541, 707556069, 723242879, 730802596, 734674454, 735657752, 734962225, 734369755, 734064400, 732737303, 730102837, 727478266, 725682318, 723742127, 720672965, 717279315, 714646995, 712134898, 708458662, 703977823, 700054049, 696564615, 692052722, 686211944, 680196166, 674311042, 667249680, 657826245, 645935297, 630702794, 609676361, 580087245, 535134912, 464675009, 379023701, 320288569, 325482994, 392840594, 490584075, 584159911, 652745187, 690665245, 705098629, 707542539, 705322683, 702397108, 700601935, 698882937, 695214331, 689603746, 683177650, 675004244]
801.6F75004244j2689293j5735626j0378778q88407J177132m111886q831680j1230588
817.9F12315118j4119625j8213630j8501937q041739Q389473J4575541O004274p516206
834.2E74891269k0967304l4384847m2488098l5933078j0846018K2664785M1252315
848.5D94189024L1106234M596650j9409299k6905477j458317M8778266P8253448O4361274
864.8F73511803L3040524J0055005j098692n622924p555007p701278o667495o048858
881.1F81913078o366909o367802n449951m745066n078376n592465n359888m959703
897.4F37992918n357265o180346o389499o160438o469667p348954p861853p768273
913.7E84456623p846892q539081r264231r499549r715319j0449767j1293114j1545836
$$ y = [675004244, 662314951, 646579325, 636200547, 635312140, 636489272, 632377386, 623545706, 612315118, 598195493, 579981863, 561479926, 553438187, 561827660, 576403201, 582407475, 574891269, 553923965, 519539118, 477051020, 441117942, 430271924, 452936709, 494189024, 525295258, 529891908, 510482609, 483577132, 482118815, 530897081, 609150529, 673511803, 706552327, 716607332, 715508640, 709885716, 702330709, 694629431, 687961936, 681913078, 675546169, 669178367, 663728416, 658983350, 653904974, 648312509, 642952621, 637992918, 632635653, 626455307, 620065808, 613905370, 607435703, 600086749, 592224896, 584456623, 576609731, 568070650, 558806419, 549306870, 539591551, 529141784, 517848670, 506302834]
930.1E06302834j1378020j1288703j1134624j0207206q150429n267054j707554K908260
946.4D50077504Q733362J4779001J9167036J9688845J3407230R70781n991578J546085
962.7E22378266J3339579J7552137J5735329J2444555J0584772J1753082J2578845
977F16366565R577751N316735L145873K515972J316845q34763k249419k013505j305342
995.3F31836712j295447j545429j432896j658857l164887m911423m436731k259791
1011.6F11131251k109468m619181o904185q081317r545386j1813819j4048100j5915334
1028E38094461j8161416k1123260k4159432k7317315l1468183l5876810l7694276l3639878
1044.3C08653891k0763844L222436L4789562O0052007O5912903N4705411L8038969
$$ y = [506302834, 494924814, 483636111, 472501487, 462294281, 454143852, 448876798, 447169244, 450077504, 458810866, 473589867, 492756903, 512445748, 525852978, 526823759, 520832181, 522378266, 535717845, 553269982, 569005311, 581449866, 592034638, 603787720, 616366565, 625944316, 631261051, 634406924, 636922896, 638239741, 637404978, 635155559, 633142054, 631836712, 630541265, 628995836, 627562940, 625904083, 622739196, 617827773, 613391042, 611131251, 609021783, 604402602, 597498417, 589417100, 579871714, 568057895, 554009795, 538094461, 519933045, 498809785, 474650353, 447333038, 415864855, 379988045, 342293769, 308653891, 287890047, 291112483, 325902045, 385954052, 451866955, 506572366, 544611335]
1058.6E44611335K3259938J2121200M430711m38690l081143l955781m000127m249692
1074.9E68697751m639924m466653l887772l764213m340052n022645n333841n715728
1091.2E31526923o826460q609057j0686457j3216227j5687704j5362323r773403j306474
1107.5D50058818M186928L541857k271622r359807q765578O038665K1671713J8627524
1123.8D83728498J815915p306337L97772J3206631J7310708J1904538L131449l907263
1140.1E20281911q151829j1314810j4447122j7392457k0228684k3463488k7601152
1154.4C97682369l3793301m3642342n6666553o5378457n5502564k1350614K3251183
1168.7A44599721N9127867P6262549P3953569N9831470M6643406M1215360L8033128
$$ y = [544611335, 567871273, 579992473, 584423184, 583984494, 580903351, 576947570, 572947443, 568697751, 564057827, 559591174, 555703402, 551939189, 547599137, 542576492, 537242651, 531526923, 524700463, 516091406, 505404949, 492188722, 476501018, 461138695, 451365292, 450058818, 454245746, 457787603, 455515981, 446156174, 437390596, 443429261, 465100974, 483728498, 485544413, 478238076, 478635848, 491842479, 509153187, 521057725, 524189174, 520281911, 512130082, 500815272, 486368150, 468975693, 448747009, 425283521, 397682369, 363889068, 320246726, 263580173, 198201716, 142699152, 121348538, 144599721, 203727588, 279990137, 353943706, 413775176, 460418582, 501633942, 539667070]
1183E39667070K8710008J3900160M19915q210301j2641073j4258027j4209568j3382256
1199.3E19995928j2607277j3250857j6630769k0304561j6185373k245336P348120K097279
1215.6D48217154r271086j6747415k0302474k2521407k4278491k5612742k6689470
1229.9C02794069k7699649k8539539k9098838k9359013k9011920k7443513k4006106
1244.2A07635491j8494271j1309073l143742N398899J3767965K1547295K8694362L5404190
1260.5A79501116M2048261M9072727N4823190N4311514M3623865K4893969N734414
1274.8D54009056p310003j2840778j3241201j2568027j4575988k0348728k7490079
1289C45634252l2852322l4984499l3210844k7013928j7227322o973594L36841M032582
$$ y = [539667070, 568377078, 582277238, 582697153, 574486852, 561845779, 547587752, 533378184, 519995928, 507388651, 494137794, 477507025, 457202464, 441017091, 438771755, 446119875, 448217154, 438946068, 422198653, 401896179, 379374772, 355096281, 329483539, 302794069, 275094420, 246554881, 217456043, 188097030, 159085110, 131641597, 107635491, 89141220, 77832147, 74688405, 80087304, 93855269, 115402564, 144096926, 179501116, 221549377, 270622104, 325445294, 379756808, 423380673, 448274642, 454009056, 446699053, 433858275, 420617074, 408049047, 393473059, 373124331, 345634252, 312781930, 277797431, 244586587, 217572659, 200345337, 193371743, 193708584, 197741166]
1305.4A97741166N555838P091850R792239J1693775J1079431R631559Q938074P743538
1321.7B69267470N753666N863070R890944J4982432J6974539J4793098J0738402J1040807
1338C59304428K1950156L7947505M7032297M6265364L9247691L0900896K3698747J8303514
1354.3F24650598J4129340J0703266Q247137O449223M513025K616405J267493M99725
1370.6F73076212M11511J51753n37097j554370k821088l745735l767907m002989n130171
1389F52080119o016732p780611j1002839j4207124j7805577k1028578k3628235k7292550
1405.3E23317873k7794539k4780900k0039677j3375968q746237j1784732k1889895
1419.6C94905925k4997503k1173388j8342316j8738627k3283601k4794221j7832965
$$ y = [197741166, 203297004, 210388854, 220181093, 231874868, 242954299, 252585858, 261523932, 269267470, 275021136, 280884206, 290775150, 305757582, 322732121, 337525219, 348263621, 359304428, 381254584, 419202089, 466234386, 512499750, 551747441, 582648337, 606347084, 624650598, 638779938, 649483204, 657730341, 664179564, 668692589, 671308994, 672576487, 673076212, 673487723, 673639476, 673102379, 671548009, 668726921, 664981186, 661213279, 657210290, 652080119, 646063387, 638282776, 627279937, 613072813, 595267236, 574238658, 550610423, 523317873, 495523334, 470742434, 450702757, 437326789, 428580552, 416795820, 394905925, 369908422, 348735034, 330392718, 311654091, 288370490, 263576269, 245743304]
1433.9B45743304l276199K0101041M1605264N8122635O6337973O3425123N5327088
1448.1E47386229M1858137K8853833K0902276J7545879J2649298N152464J731574m589
1464.5F76075101k277672l453315l550648m412473q917689j8239260k6249706k2681714
1480.8E86292624r86337K7746558M2342842L4390151J4147163K37464n791544j1351109
1497.1F87027812j6674042j9751727k2280872l5501778o7140937p4605107o2977106
1511.4C88096243l8565546K2876590R2399687J12456500R1200054M8306406J3844788
1525.6G30614722K5868m889548o843924r146691q413255o345391q059323r815991p643163
1544F69483304n767822m321814m132271m932463n983591o707489j1462331j8011570
$$ y = [245743304, 242467105, 262568146, 304173410, 362296045, 428634018, 492059141, 547386229, 589244366, 618098199, 639000475, 656546354, 669195652, 674348116, 676079690, 676075101, 673797429, 670344114, 666793466, 662380993, 653463304, 635224044, 608974338, 586292624, 585306287, 613052845, 655395687, 689785838, 703933001, 704170465, 698378921, 687027812, 670353770, 650602043, 628321171, 592819393, 525678456, 451073349, 388096243, 349530697, 372407287, 464806974, 577263474, 668463528, 716769934, 730614722, 730640590, 725751042, 718907118, 709760427, 701347172, 695001781, 686942458, 677126467, 669483304, 663715482, 659393668, 655261397, 650328934, 644345343, 637637854, 626175523, 608163953]
1560.3F08163953j4394522j4122486j7319322k1951079k8796613l1350076l9124877
1574.6D41104978m9744993k5603801J5497118M0032834L5908908J0764300j6231745
1588.9D51727599l5464436m6340704n2309543n4939031n4177061m8316985l3843831
1603.2A26336008j0514855J7916858M8106030P1359023P7574939P6434701O9295735
1617.4D76508439M3914020K5494456J9215405J2946427O349563R70900k574682n099773
1633.7E77724755j0095358j3318420j3466954j4690816j6465128k1657973k5468558
1648D62561548k0727933k5227427l7728965k8626949k2893786k6173264l1794220l3391864
1664.3B35997140k9232815k9744595l1078785k3806826j7234146j1818000l940269
$$ y = [608163953, 593769431, 579646945, 562327623, 540376544, 511579931, 480229855, 441104978, 391359985, 365756184, 381253302, 421286136, 457195044, 467959344, 451727599, 416263163, 369922459, 317612916, 262673885, 208496824, 160179839, 126336008, 115821153, 133738011, 181844041, 253203064, 330778003, 407212704, 476508439, 520422459, 545916915, 565132320, 578078747, 584428310, 585399210, 582824528, 577724755, 567629397, 554310977, 540844023, 526153207, 509688079, 488030106, 462561548, 441833615, 416606188, 378877223, 350250274, 327356488, 301183224, 269389004, 235997140, 206764325, 177019730, 145940945, 122134119, 104899973, 93081973, 89141704]
1678.6H9141704J720399P104188J4425993J7043121J8046841K1500305K3017674K8386176
1694.9B20386401L4403220L7435829M4505507L8359612L3307642L3157825K7708889
1709.2D69264925K3034602K0317942J9348562K0602941J9308686J6200722J6023695
1723.5F04102075J6091168J4600515J2964726J1671960J2752712J2361348R729027
1737.8F94273531R267748Q541941O961823N838811M569590L118337J867413J115382
1754.1G35554576M62353l73065o36876q90732j263320j526296j830221k170264l136993
1772.4G24189162l377557k024471n77987Q1480N4181r239M59015J208484J527966R30368
1792.8G22461402K34306O8546m28558j302063j634658j213550q93176q54730o86169
$$ y = [89141704, 90862103, 97966291, 112392284, 129435405, 147482246, 168982551, 192000225, 220386401, 254789621, 292225450, 336730957, 375090569, 408398211, 441556036, 469264925, 492299527, 512617469, 531966031, 552568972, 571877658, 588078380, 604102075, 620193243, 634793758, 647758484, 659430444, 672183156, 684544504, 694273531, 703541279, 712083220, 719045043, 724883854, 729453444, 732571781, 734439194, 735554576, 736016929, 735643864, 735006988, 734116256, 732852936, 731326640, 729496419, 727326155, 724189162, 720811605, 718787134, 718209147, 718290627, 718344808, 718335569, 718794584, 720003068, 721531034, 722461402, 722695708, 722764254, 722335696, 721033633, 719398975, 718185425, 717292249, 716437519, 715751350]
1811.2G15751350o1154N93185P84576Q46624J172781J483620J283526R54866Q31127
1829.6G23640501O83606N93364N87821O29247R04560J182198Q96514L22580L10957
1847.9G29751348M62652K67744L7134N7160J42753m3094k80440n3405M59313M12226
1868.3G31213391k43604m34578j33753j311k07186l82781l06427k37882l38316m86672
1888.7G28440881m65155j72794p5340l38554m62354m41193o83546j199246j651704
1907.1G22950995j981556k393902l017008l768861m408300l630638m31538L629267
1923.4G06948459O292224O730676N648136L966987K624035K017140J828611J560152
1939.7G37616420J140177P87914O04272L41356K920p3492P9751J39594O4254J83761
$$ y = [715751350, 715690196, 716283381, 717067957, 717914581, 719087362, 720570982, 721854508, 722809374, 723640501, 724324107, 724917471, 725505292, 726134539, 727039099, 728221297, 729117811, 729440391, 729751348, 730214000, 730481744, 730518878, 730576038, 730718791, 730675697, 730395257, 730341852, 730801165, 731213391, 730969787, 730535209, 730401456, 730400145, 730192959, 729810178, 729503751, 729265869, 728927553, 728440881, 727975726, 727802932, 727727592, 727389038, 726926684, 726485491, 725801945, 724602699, 722950995, 720969439, 718575537, 715558529, 711789668, 707381368, 703750730, 703319192, 706948459, 713240683, 719971359, 725619495, 729586482, 732210517, 734227657, 736056268, 737616420, 738756597, 739544511, 740148783, 740490139, 740493059, 740419567, 740499318, 740638912, 740703166, 740886927]
1960.1G40886927N55157P80821N76019K25008J34408J61291j9730k88486l27289k42412
1980.5G42441714l53694n69582m92513j73867q5354l90589n89669m06742k48849m04358
2000.9G38726497o68884p00593o68764r62436j481295j833319k077341k435148k277136
2019.2G25621581r74059M94719J014888R10640N41627M0710l26634o25908q56459q51452
2039.6G24989653p94411j062512j580060j872063j794636j708209j697720j469612
2056G13010430r87291o20425o36399q46505r46879r78470j196027j500427j576007
2074.3G03722000j461565j472116j612782j586557j285970q80599m50075J55747R27270
2092.7F96055353J504898J618981J519501J578629J753569J790345J673698J552820
$$ y = [740886927, 741442084, 742222905, 742798924, 743023932, 743158340, 743319631, 743299901, 743011415, 742684126, 742441714, 742088020, 741518438, 741025925, 740852058, 740766704, 740376115, 739786446, 739379704, 739130855, 738726497, 738057613, 737357020, 736688256, 735725820, 734244525, 732411206, 730333865, 727898717, 725621581, 724647522, 725142241, 726157129, 727067769, 727609396, 727650106, 727323472, 726697564, 725841105, 724989653, 724195242, 723132730, 721552670, 719680607, 717885971, 716177762, 714480042, 713010430, 712023139, 711402714, 710766315, 709919810, 708972931, 707994461, 706798434, 705298007, 703722000, 702260435, 700788319, 699175537, 697588980, 696303010, 695422411, 694972336, 695128083, 696055353, 697560251, 699179232, 700698733, 702277362, 704030931, 705821276, 707494974, 709047794]
2109G09047794J424730J113653O26684K67863J23024k9862k80500m78506n52117o38962
2129.4G10623801q20458r65297r58741q79705q37326q23379p54594o33419n87642o95646
2149.8G02667594q34584q44777p55548o80983o37413o03318o09636p00831q24035q14378
2170.2F95362091o68049n57959n06043l83795k20954j14262o3598q2135j27912j33574
2190.6F92503810j30355j40250j63019k17914l04401m40956o31094p95960q50439q47340
2211F87982082q93175r75549j014472j010656j046181j112043j088024r81271r19402
2229.3F78941309r12904q88706q10504p58171q29696r34124r18329q23081q09133q85427
2249.7F70371234r38296r37581r76384j086294j134634j064420j037717j172125j317144
$$ y = [709047794, 710472524, 711586177, 712212861, 712480724, 712603748, 712573886, 712293386, 711814880, 711262763, 710623801, 709803343, 708838046, 707879305, 706999600, 706162274, 705338895, 704584301, 703950882, 703363240, 702667594, 701833010, 700988233, 700232685, 699551702, 698914289, 698310971, 697701335, 697000504, 696176469, 695362091, 694694042, 694136083, 693630040, 693246245, 693025291, 692911029, 692847431, 692765296, 692637384, 692503810, 692373455, 692233205, 692070186, 691852272, 691547871, 691106915, 690475821, 689679861, 688829422, 687982082, 687088907, 686113358, 685098886, 684088230, 683042049, 681930006, 680841982, 679860711, 678941309, 678028405, 677139699, 676329195, 675571024, 674741328, 673807204, 672888875, 672065794, 671256661, 670371234, 669432938, 668495357, 667518973, 666432679, 665298045, 664233625, 663195908, 662023783, 660706639]
2268.1F60706639j322090j245141j170278j068950r22143q21233q71777j050890j199365
2286.4F51034772j197517j118898j050472q91328n55277k06947p2241r9480j36316
2304.8F45706296j99497l46780n40018o58393n62608l44455l27349n34773p12931p47978
2325.2F40731514p92504r90689j226782j345993j344859j339913j406073j576126k001762
2343.5F28706813k496839j975417p52210p8142k97308q51154j232088j576185j938463
2361.9F17509007k230405k421916k446771k339422k261639k234280k172291k098501
2378.2E99303782k058446j982868j827955j680553j634419j668215j680374j634121
2394.5E85136831j631141j722753j807451j799107j764118j830936j952887j985192
$$ y = [660706639, 659384549, 658139408, 656969130, 655900180, 654978037, 654156804, 653285027, 652234137, 651034772, 649837255, 648718357, 647667885, 646776557, 646221280, 646014333, 645942092, 645842612, 645706296, 645506799, 645160019, 644620001, 643961608, 643399000, 643054545, 642727196, 642192423, 641479492, 640731514, 639939010, 638948321, 637721539, 636375546, 635030687, 633690774, 632284701, 630708575, 628706813, 626209974, 624234557, 623482347, 623404205, 623106897, 622255743, 621023655, 619447470, 617509007, 615278602, 612856686, 610409915, 608070493, 605808854, 603574574, 601402283, 599303782, 597245336, 595262468, 593434513, 591753960, 590119541, 588451326, 586770952, 585136831, 583505690, 581782937, 579975486, 578176379, 576412261, 574581325, 572628438, 570643246]
2410.8E70643246j943528j924694j932740j890123j769602j690746j715064j692355
2427.2E56084394j508057j287102j188875j175701j168251j218677j391411j610636
2443.5E45535684j726866j741111j783073j886189j937807j884222j820385j777947
2459.8E30978084j701534j622439j638054j760185j894415j940727j900852j903474
2476.1E16616404k010703k127647k213479k344369k533615k682209k736837k770155
2492.4D97197390k822638k840996k784371k653927k495408k348453k207636k091945
2508.7D76952016k088338k252370k480507k619862k676458k716183k713025k633542
2525.1D56771731k521932k478391k502918k468437k317548k126395j943350j727969
$$ y = [570643246, 568699718, 566775024, 564842284, 562952161, 561182559, 559491813, 557776749, 556084394, 554576337, 553289235, 552100360, 550924659, 549756408, 548537731, 547146320, 545535684, 543808818, 542067707, 540284634, 538398445, 536460638, 534576416, 532756031, 530978084, 529276550, 527654111, 526016057, 524255872, 522361457, 520420730, 518519878, 516616404, 514605701, 512478054, 510264575, 507920206, 505386591, 502704382, 499967545, 497197390, 494374752, 491533756, 488749385, 486095458, 483600050, 481251597, 479043961, 476952016, 474863678, 472611308, 470130801, 467510939, 464834481, 462118298, 459405273, 456771731, 454249799, 451771408, 449268490, 446800053, 444482505, 442356110, 440412760, 438684791]
2541.4D38684791j480251j280904j228124j296222j314640j182199r09835m96149R5576
2559.7D29592043Q72344J718819K480775L106982L527641L648758L559232L439814
2576D51946408L425359L552050L692805L740520L692180L548562L273517K799213K136260
2594.4D81806874J426220Q25912M46796L26395L59923L86804L35217K21223Q3178j4246
2614.8D86204296m7266q3894j60187k46942l64959n74172q36849j047105j153260j214981
2635.2D80474681j351267j570106j781255j896322j866787j724691j573085j512170
2651.5D67198998j511157j488954j417756j242637r82911p61628n81503l41773j6898
2669.9D58853781L20465O23643R56237J377493J835764K216756K516151K812385L084064
$$ y = [438684791, 437204540, 435923636, 434695512, 433399290, 432084650, 430902451, 429992616, 429496467, 429592043, 430464387, 432183206, 434663981, 437770963, 441298604, 444947362, 448506594, 451946408, 455371767, 458923817, 462616622, 466357142, 470049322, 473597884, 476871401, 479670614, 481806874, 483233094, 484059006, 484505802, 484832197, 485192120, 485578924, 485914141, 486135364, 486218542, 486204296, 486157030, 486073136, 485912949, 485666007, 485301048, 484726876, 483890027, 482842922, 481689662, 480474681, 479123414, 477553308, 475772053, 473875731, 472008944, 470284253, 468711168, 467198998, 465687841, 464198887, 462781131, 461538494, 460555583, 459793955, 459212452, 458870679, 458853781, 459174246, 459797889, 460754126, 462131619, 463967383, 466184139, 468700290, 471512675, 474596739]
2688.2D74596739L286838L468305L650099L753990L753960L714294L659367L540933
2704.5E03424525L291726K841592K181649J433790P41601K39134J04010L51071P25449
2722.9E15334547R75608R94683Q38160O23942L57568R2983o0916j22070j89602l07560
2743.3E18537343m54903o62387r93073j391768j685441j821458j932800k056777k122045
2761.6E05416691k154886k215326k316982k386182k320409k202720k231508k374590
2778D87214088k481609k568841k668381k751469k819747k872646k867162k783388k625317
2796.3D62775528k441495k273441k066969j863420j713455j555860j396746j249939
2812.6D48214203j080632r17673p56234n75483m20958k52843J401L24816O18279P85112
$$ y = [474596739, 477883577, 481351882, 485001981, 488755971, 492509931, 496224225, 499883592, 503424525, 506716251, 509557843, 511739492, 513173282, 513914883, 514154017, 514258027, 514609098, 515334547, 516310155, 517304838, 518142998, 518766940, 519124508, 519217491, 519156575, 519034505, 518844903, 518537343, 518082440, 517420053, 516426980, 515035212, 513349771, 511528313, 509595513, 507538736, 505416691, 503261805, 501046479, 498729497, 496343315, 494022906, 491820186, 489588678, 487214088, 484732479, 482163638, 479495257, 476743788, 473924041, 471051395, 468184233, 465400845, 462775528, 460334033, 458060592, 455993623, 454130203, 452416748, 450860888, 449464142, 448214203, 447133571, 446215898, 445459664, 444884181, 444463223, 444210380, 444211781, 444536597, 445154876, 445939988]
2833D45939988Q41766Q80898R63568J090288J236916J351297J323700J101345Q01116
2851.4D55530882N02705K02865l4511j75476k42830k76148m07129p03276j140833j857727
2871.8D51398522k978415m540950o656170r260356j1508584j1074573n677014L058254
2888.1D02760714J0062844J2496352J1597961R409756P021218N048454L711999K854704
2904.4D64964002K328068K014071J741856J368702Q89212M40389O9648k53529m83065
2922.8D73079354o49810q12233r60439j120955j211464j229823j475960k181649l388822
2941.1D60048199n266518p966965j0512859r892910l839136M299999Q253425O536067
2957.4D41659302K532035l39538k27213K652943N458236N591422L715098J835346P40439
$$ y = [445939988, 446781754, 447662652, 448626220, 449716508, 450953424, 452304721, 453628421, 454729766, 455530882, 456033587, 456236452, 456201941, 456026465, 455783635, 455507487, 455100358, 454397082, 453256249, 451398522, 448420107, 443879157, 437222987, 427962631, 416454047, 405379474, 399702460, 402760714, 412823558, 425319910, 436917871, 446327627, 453348845, 458397299, 462109298, 464964002, 467292070, 469306141, 471047997, 472416699, 473305911, 473746300, 473815948, 473562419, 473079354, 472429544, 471617311, 470656872, 469535917, 468324453, 467094630, 465618670, 463437021, 460048199, 454781681, 446814716, 436301857, 426408947, 422569811, 426869810, 435123235, 441659302, 444191337, 443851799, 443624586, 446277529, 451735765, 457327187, 461042285, 462877631, 463618070]
2975.8D63618070L45468L27409L52323M55677P77215J203299J599431J803666J768291
2994.2D72250849J773655J836688J809716J823693J892120J957089K093851K267003
3010.5D87704664K303899K194732K132446K226233K434016K644151K720773K617538
3026.8E06978452K463818K349496K149164J822174J542807J438975J380205J152635
3043.1E21277726P66039L76045N8949l15249p10249q00550n75780k87176j90973n63204
3063.5E19035578j379729k307415k957224l034056k403140q93652J375198L611148
3079.8E11046708N083680N681574N578220N064130M402995L711462L120422K597571
3096.1E46286762J946151J127124M67598O48439J902461L425241M247904M329204M054010
$$ y = [463618070, 463963538, 464290947, 464643270, 465098947, 465876162, 467079461, 468678892, 470482558, 472250849, 474024504, 475861192, 477670908, 479494601, 481386721, 483343810, 485437661, 487704664, 490008563, 492203295, 494335741, 496561974, 498995990, 501640141, 504360914, 506978452, 509442270, 511791766, 513940930, 515763104, 517305911, 518744886, 520125091, 521277726, 522043765, 522419810, 522478759, 522163510, 521453261, 520652711, 520076931, 519789755, 519598782, 519035578, 517655849, 515348434, 512391210, 509357154, 506954014, 506060362, 507435560, 511046708, 516130388, 521811962, 527390182, 532454312, 536857307, 540568769, 543689191, 546286762, 548232913, 549360037, 549827635, 550476074, 552378535, 555803776, 560051680, 564380884, 568434894]
3114.5E68434894L528178K915025K403736K031803J955330K244592K656042K913178
3130.8E89082778K903342K719640K517164K286375J961827J660884J501321J365841
3147.1F05999172J138270Q75592P12812P19309Q38577J037419J336813J599610J635432
3165.5F15893006J465440J266122J143098J010239P61569N09560M27782M80712N77151
3183.8F23534679P32720R84371J279712J435935J396954J302064J180231R78411P42673
3202.2F33567750N69404N17964N87642Q14259J167894J464188J565099J450598J222014
3220.5F42926812J042068R64463R11355Q12888P18594O93500O71088N94020N45860
3238.9F49880648N76675O13749N90801M99844M33982M71294M97877M44174M03047L91125
$$ y = [568434894, 571963072, 574878097, 577281833, 579313636, 581268966, 583513558, 586169600, 589082778, 591986120, 594705760, 597222924, 599509299, 601471126, 603132010, 604633331, 605999172, 607137442, 608013034, 608725846, 609445155, 610283732, 611321151, 612657964, 614257574, 615893006, 617358446, 618624568, 619767666, 620777905, 621539474, 622049034, 622476816, 622957528, 623534679, 624267399, 625251770, 626531482, 627967417, 629364371, 630666435, 631846666, 632825077, 633567750, 634137154, 634655118, 635242760, 636057019, 637224913, 638689101, 640254200, 641704798, 642926812, 643968880, 644933343, 645844698, 646657586, 647376180, 648069680, 648740768, 649334788, 649880648, 650457323, 651071072, 651661873, 652161717, 652595699, 653066993, 653564870, 654009044, 654412091, 654803216]
3259.3F54803216L72231L63768L56435L48270L48389K80977J70350J18792Q9168N8890
3279.7F57310486O8843R6262P0154J7226J9372K8252j0431l4391m4525j13487j79947
3302.1F57227814j71304j29878r6977r9480j68502k53499k89380l28839m21226n46456
3322.5F54722273o41465o73413p14302q03054r09209j088977j287877j312137j265883
3340.9F46025956j326442j445174j594723j729726j701236j588345j666605j893997
3357.2F33079708k025605k053916k123177k250552k269984k098023j924336j924038
3373.5F16410077j989365j950085j829446j719772j666010j665234j675189j686692
3389.8F02228284j591146j359642j260340j359641j368165j222671j161277j174629
$$ y = [654803216, 655175447, 655539215, 655895650, 656243920, 656592309, 656873286, 657043636, 657162428, 657251596, 657310486, 657379329, 657475591, 657545745, 657562971, 657582343, 657610595, 657600164, 657565773, 657521248, 657407761, 657227814, 657056510, 656926632, 656829655, 656730175, 656561673, 656308174, 656018794, 655689955, 655268729, 654722273, 654080808, 653407395, 652693093, 651890039, 650980830, 649891853, 648603976, 647291839, 646025956, 644699514, 643254340, 641659617, 639929891, 638228655, 636640310, 634973705, 633079708, 631054103, 629000187, 626877010, 624626458, 622356474, 620258451, 618334115, 616410077, 614420712, 612470627, 610641181, 608921409, 607255399, 605590165, 603914976, 602228284, 600637138, 599277496, 598017156, 596657515, 595289350, 594066679, 592905402, 591730773]
3406.1E91730773j097917r93431r60886r60469r20296q12590p12693o66022n78225
3424.5E84028244m35591l06248k30670j57535l2604O5625R0479J20640K03610L13401
3444.9E83659351M09603M79400N47469O31749P59066Q51154Q41260Q15570R04441J064658
3465.3E90963721J080871R03308P24674P63952R22561J078546J133859R40204Q46863
3483.6E99358559J045107J111448R96769J014948J124680J176417J186788J230955
3500F08245671J227677J065731J001417J123608J185119J235008J284420J218558J213848
3518.3F18801057J348913J450598J357377J152575J053095J118123J279593J442730
3534.6F29004061J446605J355529J497328J720905J597107J225710J170039J348495
$$ y = [591730773, 590632856, 589639425, 588678539, 587718070, 586797774, 585985184, 585272491, 584606469, 584028244, 583592653, 583286405, 583055735, 582898200, 582865596, 582931221, 583021700, 583142340, 583345950, 583659351, 584068954, 584548354, 585095823, 585727572, 586486638, 587337792, 588179052, 588994622, 589899063, 590963721, 592044592, 592947900, 593672574, 594436526, 595359087, 596437633, 597571492, 598511696, 599358559, 600403666, 601515114, 602511883, 603526831, 604651511, 605827928, 607014716, 608245671, 609473348, 610539079, 611540496, 612664104, 613849223, 615084231, 616368651, 617587209, 618801057, 620149970, 621600568, 622957945, 624110520, 625163615, 626281738, 627561331, 629004061, 630450666, 631806195, 633303523, 635024428, 636621535, 637847245, 639017284, 640365779]
3551F40365779J336873J362979J599551J795947J857400J895368J820624J486898J283764
3569.3F54805183J446963J651704J801193J878679J912593K031446K231777K218961
3585.6F69978499J752735J502335J790940J963079J929343J998663K047479J990080
3601.9F84953153K046704K107501J989186J905442J929640J925588J944005J718998
3618.3G00520217J256586J211404J657665J977563J410723O38187P95424J004159J004219
3636.6G11476147J033843J071214J280010J737595J871288J029312J00196M16159Q12948
3655G20828712O47962O16789P00533P08044R97364J294792Q91090M54068N99563p7069
3675.4G27661848p10964k06709J37448M72904J037478J144111L50297k26975N3346
$$ y = [640365779, 641702652, 643065631, 644665182, 646461129, 648318529, 650213897, 652034521, 653521419, 654805183, 656252146, 657903850, 659705043, 661583722, 663496315, 665527761, 667759538, 669978499, 671731234, 673233569, 675024509, 676987588, 678916931, 680915594, 682963073, 684953153, 686999857, 689107358, 691096544, 693001986, 694931626, 696857214, 698801219, 700520217, 701776803, 702988207, 704645872, 706623435, 708034158, 708672345, 709467769, 710471928, 711476147, 712509990, 713581204, 714861214, 716598809, 718470097, 719499409, 719599605, 720015764, 720828712, 721476674, 722093463, 722793996, 723502040, 724499404, 725794196, 726685286, 727139354, 727738917, 727661848, 726950884, 726744175, 726881623, 727354527, 728392005, 729536116, 729886413, 729659438, 729712784]
3693.7G29712784L94702N42820M94003J22011J5139N11945Q03053L09348n79297n52535
3714.1G31773973P0929L53575L24189J26601j80066m06861p9632M63665M84049j44959
3734.5G32785463q00788m42505M45426L71158n70774j96278M08351n13017r74238p8857
3754.9G30433941L90828o0k75672M7505K07842M6789k76684n39959l30567P5459K43068
3777.3G30022490m4703k95401j85132k10583k84553j68323M172J04964N0842J75834
3797.7G29169607J75059m03523l43383k23458p09593m41015K53320L56436n8234K4021
3818.1G27799237j37329r51350p01189j92046p4208K0564Q4102K77459O6221o66737
3838.5G25524724p50483m44650l74258j07944N28872Q86441l08097j665234p11918
$$ y = [729712784, 730107486, 730650306, 731144309, 731266320, 731281459, 731793404, 732596457, 732905805, 732326508, 731773973, 731844902, 732198477, 732522666, 732649267, 732469201, 732062340, 731982708, 732446373, 732930422, 732785463, 731984675, 731542170, 731987596, 732358754, 731787980, 731591702, 732000053, 731487036, 730512798, 730433941, 730824769, 730824709, 730549037, 730596542, 730804384, 730851173, 730574489, 730034530, 729703963, 729779422, 730022490, 729977787, 729682386, 729497254, 729286671, 729002118, 728833795, 728837967, 728942931, 728993773, 729169607, 729344666, 728941143, 728597760, 728374302, 727664709, 727223694, 727477014, 727833450, 727775216, 727799237, 727661908, 726710558, 726009369, 725817323, 725743115, 725763679, 725847781, 726125240, 726191461, 725524724, 724774241, 724329591, 723955333, 723847389, 724376261, 725262702, 724954605, 723289371, 722577453]
3856.9G22577453J36077K58207L0518k20418P331o7174m69267m74036l50475N543K2530
3879.3G21456289k86817j71066l03983l29495q7440m12404m79460N7995K45750m530
3899.7G19684839l42965o98745p47204l73483j05381j0311Q4460j9610l05891l88802
3920.1G16776907k77340l31700m26948k83062j85669l38077m03762k20835J9133J69515
3940.5G14498162J33634R5963J55032J02758l4213p3492k1577k6464r9540j33634j18255
3962.9G14478374j29521j84894k28941k55168k87831l09229k57909j55508j04785j11640
3983.3G12452948j32918j72496j96636j71840j47343j85013k76863
3997.6G11169839
$$ y = [722577453, 722713530, 722971737, 723002255, 722781837, 722789168, 722721994, 722252727, 721778691, 721428216, 721433759, 721456289, 721169472, 720998406, 720694423, 720364928, 720277488, 719865084, 719385624, 719443619, 719689369, 719684839, 719341874, 718643129, 717895925, 717522442, 717417061, 717406750, 717491210, 717471600, 717165709, 716776907, 716499567, 716167867, 715740919, 715457857, 715272188, 714934111, 714530349, 714309514, 714328647, 714498162, 714631796, 714727759, 714882791, 714985549, 714951336, 714877844, 714856267, 714829803, 714730263, 714596629, 714478374, 714348853, 714163959, 713935018, 713679850, 713392019, 713082790, 712824881, 712669373, 712564588, 712452948, 712320030, 712147534, 711950898, 711779058, 711631715, 711446702, 711169839]
##END=$$ End of the data block
