##TITLE=AD 14 $$ Begin of the data block
##JCAMP-DX=5.00 $$ ACD/SpecManager v 10.08
##SPECTROMETER/DATA SYSTEM=Alpha
##DATE=17 Dec 2014 10:47:54
##DATA TYPE=INFRARED SPECTRUM
##DATA CLASS=XYDATA
##ORIGIN=
##OWNER=
##NPOINTS=1765
##FIRSTX=399.76428223
##LASTX=3997.64306641
##MAXX=3997.64306641
##MINX=399.76428223
##MAXY=1.00000000
##MINY=0.10137349
##XFACTOR=1.0000000000
##YFACTOR=0.000000010000000
##FIRSTY=1.00000000
##DELTAX=2.03961372
##XUNITS=1/CM
##YUNITS=ARBITRARY UNITS
##XYDATA=(X++(Y..Y))
399.8A00000000k980542k897030k879757k861887k831352k824676k823490k787572
416.1G7113694k710939k600771k491623k413195k331335k223438k104717j986295j865977
434.4E6385404j782072j728296j631528j523686j436734j358962j278934j187467j091454
452.8D3366271r99176q96350p80162o65906n60314m58270l58274k67780j79783q5234
473.2C8115022N421Q0710J42432J98835K61530L26905L86428M41844M96074N57885
493.6D1013086O21646O81150P38439Q04782Q93641R96643J100165J213226J354551
511.9D9417329J507002J651233J796425J960897K134609K285886K409864K523261K630645
530.3F8317151K704781K727360K717948K694434K637338K525604K372790K202397K026797
$$ y = [100000000, 97019458, 94122428, 91242671, 88380784, 85549432, 82724756, 79901266, 77113694, 74402755, 71801984, 69310361, 66897166, 64565831, 62342393, 60237676, 58251381, 56385404, 54603332, 52875036, 51243508, 49719822, 48283088, 46924126, 45645192, 44457725, 43366271, 42367095, 41470745, 40690583, 40024677, 39464363, 39006093, 38647819, 38380039, 38200256, 38115022, 38120443, 38201153, 38343585, 38542420, 38803950, 39130855, 39517283, 39959127, 40455201, 41013086, 41634732, 42315882, 43054321, 43859103, 44752744, 45749387, 46849552, 48062778, 49417329, 50924331, 52575564, 54371989, 56332886, 58467495, 60753381, 63163245, 65686506, 68317151, 71021932, 73749292, 76467240, 79161674, 81799012, 84324616, 86697406, 88899803, 90926600]
548.7I0926600J833617J609975J376969J163882R68295P71702N73641L95727K51585
567I9871993J26535J472%S0k688M71K217%l81m787L910J258j2970j4853L433J7488
616I9993098O902r519n764Q166P117%r811j5426k8097o5202j09011j31851j38772j58059
644.5I9343771j98394k38866k50637k45429k67785l04556l22706l22747l32910l61341
664.9I6498400l85219l87114l83192l98595m27901m45861m50796m65900m92626n18918
685.3I2142278n38117n47605n70655o04761o25348o28299o38485o69825p04497p23201
705.7H5891485p36606p67565q17179q62176q89158r13983r52548r96375j025719j041251
726.1G6888925j064181j102227j135976j151406j162321j186520j216644j229083j218587
$$ y = [90926600, 92760217, 94370192, 95747161, 96911043, 97879338, 98651040, 99224681, 99620408, 99871993, 99998528, 100000000, 100000000, 100000000, 100000000, 100000000, 100000000, 100000000, 100000000, 100000000, 100000000, 100000000, 99997312, 99997783, 100000000, 100000000, 99999619, 99994832, 99998742, 100000000, 99987030, 99972177, 99975610, 99993098, 100000000, 99990481, 99984717, 99992883, 100000000, 100000000, 99990189, 99974763, 99946666, 99881464, 99772453, 99640602, 99501830, 99343771, 99145377, 98906511, 98655874, 98410445, 98142660, 97838104, 97515398, 97192651, 96859741, 96498400, 96113181, 95726067, 95342875, 94944280, 94516379, 94070518, 93619722, 93153822, 92661196, 92142278, 91604161, 91056556, 90485901, 89881140, 89255792, 88627493, 87989008, 87319183, 86614686, 85891485, 85154879, 84387314, 83570135, 82707959, 81818801, 80904818, 79952270, 78955895, 77930176, 76888925, 75824744, 74722517, 73586541, 72435135, 71272814, 70086294, 68869650, 67640567, 66421980]
744.5F6421980j199460j180435j149207j091558j013410r30905q46607p48890o36101
762.8E7625407n21630m16631l13013j97655p4411M1688J47110K51967L60524M63933
783.2E7367289N55468O46507P49833Q60703R65643J064253J170772J291013J411205
801.6F6082686J515854J607447J694173J767832J807004J803398J765764J696933J582795
819.9H1323886J407623J174426Q99262N91379K50822j15490m86862q38757j156866
838.3H3049423j438433j679481j866924j991964k064472k103418k116758k100169k056110
856.6F5631694k002317j952726j902246j842082j778912j726061j683039j639056j590961
875D9514294j547692j516696j491014j460161j426584j397610j373207j347357j315332
$$ y = [66421980, 65222520, 64042085, 62892878, 61801320, 60787910, 59857005, 59010398, 58261508, 57625407, 57103777, 56687146, 56374133, 56176478, 56102067, 56143755, 56290865, 56542832, 56903356, 57367289, 57922757, 58569264, 59319097, 60179800, 61145443, 62209696, 63380468, 64671481, 66082686, 67598540, 69205987, 70900160, 72667992, 74474996, 76278394, 78044158, 79741091, 81323886, 82731509, 83905935, 84805197, 85396576, 85647398, 85531908, 85045046, 84206289, 83049423, 81610990, 79931509, 78064585, 76072621, 74008149, 71904731, 69787973, 67687804, 65631694, 63629377, 61676651, 59774405, 57932323, 56153411, 54427350, 52744311, 51105255, 49514294, 47966602, 46449906, 44958892, 43498731, 42072147, 40674537, 39301330, 37953973, 36638641]
893.4C6638641j279434j244670j209930j170337j124910j078605j035008r91994r45998
911.7B6557755q97717q51415q07800p63131p16599o72265o32747n96009n59260n23166
932.1A9537646m90705m62423m35968m09671l85176l64847l48127l32117l15258k99095
952.5A5694259k85146k73352k62128k50244k38988k29640k21214k11965k02153j93322
972.9A3326107j85736j78249j70441j62510j54852j47837j41528j35244j28502j22788
993.3A1798420j18130j13147j07976j03654j00127r6523r2200q8071q5373q3011p9982
1015.7A0730226p6814p3959p0456o6154o1440n5979n0083m3622l6084k7351j8518j0320
1040.2A0139446k097P604J8726K9686M0078N0984O3239P6479R0193J03037J15084J27549
$$ y = [36638641, 35359207, 34114537, 32904607, 31734270, 30609360, 29530755, 28495747, 27503753, 26557755, 25660038, 24808623, 24000823, 23237692, 22521093, 21848828, 21216081, 20620072, 20060812, 19537646, 19046941, 18584518, 18148550, 17738879, 17353703, 16988856, 16640729, 16308612, 15993354, 15694259, 15409113, 15135761, 14873633, 14623389, 14384401, 14154761, 13933547, 13721582, 13519429, 13326107, 13140371, 12962122, 12791681, 12629171, 12474319, 12326482, 12184954, 12049710, 11921208, 11798420, 11680290, 11567143, 11459167, 11355513, 11255386, 11158863, 11066663, 10978592, 10893219, 10810208, 10730226, 10653412, 10579453, 10508997, 10442843, 10381403, 10325424, 10275341, 10231719, 10195635, 10168284, 10149766, 10139446, 10137349, 10144953, 10163679, 10193365, 10233443, 10284427, 10347666, 10424145, 10514338, 10617375, 10732459, 10860008]
1064.7A0860008J39635J50299J60130J69484J78131J86213J92818J97797K01825K05278
1085.1A2641618K08288K10998K12681K12197K09947K06968K04167K01946J99977J96966
1105.5A4705753J93075J89572J86873J84506J81793J79362J77957J77398J76832J76257
1125.9A6529378J76321J77571J79455J80851J82226J84825J88339J91486J94632J98270
1146.3A8383354K02160K05636K08227K10439K13581K18184K23389K28560K33916K40926
1166.7B0568372K49896K58884K66786K74965K84423K93873L01465L07444L14075L21901
1187.1B3442084L29822L37191L45211L55282L66634L77783L88363M00144M14759M30328
1207.5B7187601M43914M56837M71595M87959N03371N16438N28592N41082N52916N61399
$$ y = [10860008, 10999643, 11149942, 11310072, 11479556, 11657687, 11843900, 12036718, 12234515, 12436340, 12641618, 12849906, 13060904, 13273585, 13485782, 13695729, 13902697, 14106864, 14308810, 14508787, 14705753, 14898828, 15088400, 15275273, 15459779, 15641572, 15820934, 15998891, 16176289, 16353121, 16529378, 16705699, 16883270, 17062725, 17243576, 17425802, 17610627, 17798966, 17990452, 18185084, 18383354, 18585514, 18791150, 18999377, 19209816, 19423397, 19641581, 19864970, 20093530, 20327446, 20568372, 20818268, 21077152, 21343938, 21618903, 21903326, 22197199, 22498664, 22806108, 23120183, 23442084, 23771906, 24109097, 24454308, 24809590, 25176224, 25554007, 25942370, 26342514, 26757273, 27187601, 27631515, 28088352, 28559947, 29047906, 29551277, 30067715, 30596307, 31137389, 31690305, 32251704]
1227.9C2251704N66339N70312N74005N74875N71158N64710N58194N51722N42959N31161
1248.2C7857139N18867N08854M99428M87691M74861M64276M56920M49791M40613M30861
1268.6D2589301M24072M20284M15620M08081M00489L95537L91695L86139L78114L71081
1289D6580413L67200L63681L57270L49909L45293L42426L37970L31518L26145L23447
1309.4E0025272L21484L17496L12251L08555L07399L05921L01147K96133K93720K92468
1329.8E3081846K88821K82335K76649K74378K72870K68865K63094K58655K57087K54946
1350.2E5779546K49756K43300K38687K36070K31838K24585K18737K15482K07800J92946
1370.6E8038747J81157J80787J85912J90109J93620J98114K04450K10983K13581K13891
$$ y = [32251704, 32818043, 33388355, 33962360, 34537235, 35108393, 35673103, 36231297, 36783019, 37325978, 37857139, 38376006, 38884860, 39384288, 39871979, 40346840, 40811116, 41268036, 41717827, 42158440, 42589301, 43013373, 43433657, 43849277, 44257358, 44657847, 45053384, 45445079, 45831218, 46209332, 46580413, 46947613, 47311294, 47668564, 48018473, 48363766, 48706192, 49044162, 49375680, 49701825, 50025272, 50346756, 50664252, 50976503, 51285058, 51592457, 51898378, 52199525, 52495658, 52789378, 53081846, 53370667, 53653002, 53929651, 54204029, 54476899, 54745764, 55008858, 55267513, 55524600, 55779546, 56029302, 56272602, 56511289, 56747359, 56979197, 57203782, 57422519, 57638001, 57845801, 58038747, 58219904, 58400691, 58586603, 58776712, 58970332, 59168446, 59372896, 59583879, 59797460, 60011351]
1391F0011351K16282K19726K20138K13176K00272J91950J95414K00933J99962J98334
1411.4F2067538K00397K02138J99383J92922J89013J91366J92809J89424J85066J84632
1431.8F3994688J87248J87576J83802J78481J78504J81591J80012J74219J71279J72747
1452.2F5790147J74915J74600J76525J84423J93381J99134K00098J99926K02257K05910
1472.6F7701316K08628K08485K06018K04283K03317J98531J91474J88333J92779J96988
1493F9700152J94621J90967J89489J88244J85436J83743J86431J89710J87349J82128
1513.4G1578270J78957J79237J79321J75065J70445J75637J81490J79470J72990J66584
1533.8G3337466J64204J63460J59532J52433J51688J52689J49864J43170J35106J30820
$$ y = [60011351, 60227633, 60447359, 60667497, 60880673, 61080945, 61272895, 61468309, 61669242, 61869204, 62067538, 62267935, 62470073, 62669456, 62862378, 63051391, 63242757, 63435566, 63624990, 63810056, 63994688, 64181936, 64369512, 64553314, 64731795, 64910299, 65091890, 65271902, 65446121, 65617400, 65790147, 65965062, 66139662, 66316187, 66500610, 66693991, 66893125, 67093223, 67293149, 67495406, 67701316, 67909944, 68118429, 68324447, 68528730, 68732047, 68930578, 69122052, 69310385, 69503164, 69700152, 69894773, 70085740, 70275229, 70463473, 70648909, 70832652, 71019083, 71208793, 71396142, 71578270, 71757227, 71936464, 72115785, 72290850, 72461295, 72636932, 72818422, 72997892, 73170882, 73337466, 73501670, 73665130, 73824662, 73977095, 74128783, 74281472, 74431336, 74574506, 74709612, 74840432]
1554.2G4840432J30463J32901J28728J20991J15419J09154R9027Q8054Q3106Q4418
1574.6G5932693Q3972P1513N7763N0950M7189L9274K5922J6403J3846R191l457j4335
1599.1G6330924j6844k0135k6941l4583l9291l6675l1411l2670l7634l5280k1184k884
1623.5G5995392J4037L1358N5903Q7857J17797J36959J56659J84548K09260K23982
1643.9G7213752K29943K34032K41005K47622K49397K48784K49797K49744K44194K33704
1664.3G9641974K25520K21729K14190K02030J85948J72872J65420J58930J51247J43760
1684.7H1483620J36125J31107J24621J15037J06436J01996J01769J02174R5874Q7720
1705.1H2586479Q2070P5722O8682O3497O2388O2269N7036N4228N7870O4552P0721P6830
$$ y = [74840432, 74970895, 75103796, 75232524, 75353515, 75468934, 75578088, 75677115, 75765169, 75848275, 75932693, 76016665, 76088178, 76145941, 76196891, 76244080, 76283354, 76309276, 76325679, 76339525, 76348716, 76345259, 76330924, 76314080, 76293945, 76267004, 76232421, 76193130, 76156455, 76125044, 76092374, 76054740, 76019460, 75998276, 75995392, 76009429, 76040787, 76096690, 76184547, 76302344, 76439303, 76595962, 76780510, 76989770, 77213752, 77443695, 77677727, 77918732, 78166354, 78415751, 78664535, 78914332, 79164076, 79408270, 79641974, 79867494, 80089223, 80303413, 80505443, 80691391, 80864263, 81029683, 81188613, 81339860, 81483620, 81619745, 81750852, 81875473, 81990510, 82096946, 82198942, 82300711, 82402885, 82498759, 82586479, 82668549, 82744271, 82812953, 82876450, 82938838, 83001107, 83058143, 83112371, 83170241, 83234793, 83305514, 83382344]
1729.6H3382344Q7023J01411J10573J12230J12944J13309J13880J13470J08880J02686
1750H4458750R6167R1809Q9001Q2779P5317P2586P3648P3904P0875O7950O8372P0352
1774.5H5391510P1150O9934O8992P1418P4304P4821P4792P4667P5048P5877P6002P6586
1799H6275101P8445P8684P7451P8624Q1063Q2117Q2773Q2171Q0937Q1187Q1939Q0824
1823.4H7241316Q0156Q2785Q5497Q4901Q2457Q0293Q1128Q4084Q4579Q2010Q0139P9566
1847.9H8228911Q0133Q0931P8583P5900P7617Q0341P8386P5138P5692P7808P8535P7271
1872.4H9165246P5937P6401P8231P8368P7081P6520P6110P5489P4959P5072P6300P7945
1896.9I0083659P7974P6855P6604P8022P9161P7975P6568P6842P8172P8618P7027P5037
$$ y = [83382344, 83469367, 83570778, 83681351, 83793581, 83906525, 84019834, 84133714, 84247184, 84356064, 84458750, 84554917, 84646726, 84735727, 84818506, 84893823, 84966409, 85040057, 85113961, 85184836, 85252786, 85321158, 85391510, 85462660, 85532594, 85601586, 85673004, 85747308, 85822129, 85896921, 85971588, 86046636, 86122513, 86198515, 86275101, 86353546, 86432230, 86509681, 86588305, 86669368, 86751485, 86834258, 86916429, 86997366, 87078553, 87160492, 87241316, 87321472, 87404257, 87489754, 87574655, 87657112, 87737405, 87818533, 87902617, 87987196, 88069206, 88149345, 88228911, 88309044, 88389975, 88468558, 88544458, 88622075, 88702416, 88780802, 88855940, 88931632, 89009440, 89087975, 89165246, 89241183, 89317584, 89395815, 89474183, 89551264, 89627784, 89703894, 89779383, 89854342, 89929414, 90005714, 90083659, 90161633, 90238488, 90315092, 90393114, 90472275, 90550250, 90626818, 90703660, 90781832, 90860450, 90937477, 91012514]
1921.3I1012514P5745P8434P8475P5686P4685P6878P8416P7331P5668P6032P8207P8940
1945.8I1937011P7051P5645P7051P8964P8845P7206P6401P7504P8499P7415P6049P6646
1970.3I2864287P8231P8386P6246P4250P4893P6300P4691P1048O9619P0846P1376O8903
1994.8I3749076O5863O5744O7866O8021O5327O3383O2138N6827M8494M3285M3321M6366
2019.2I4445711M8376M7975M7928N0414N3769N5582N5521N5409N5987N4484M8292M0364
2043.7I5059812L7867M0847M2397M0251L8248L9017M0061L8528L5870L5656L7348L7551
2068.2I5523453L5417L3980L5245L7491L8052L7038L7140L9094M0555L9310L7163L7247
2092.7I5971185L9208L9887L8326L7032L8320M0537M0424L8797L8868M0734M1527M0107
$$ y = [91012514, 91088259, 91166693, 91245168, 91320854, 91395539, 91472417, 91550833, 91628164, 91703832, 91779864, 91858071, 91937011, 92014062, 92089707, 92166758, 92245722, 92324567, 92401773, 92478174, 92555678, 92634177, 92711592, 92787641, 92864287, 92942518, 93020904, 93097150, 93171400, 93246293, 93322593, 93397284, 93468332, 93537951, 93608797, 93680173, 93749076, 93814939, 93880683, 93948549, 94016570, 94081897, 94145280, 94207418, 94264245, 94312739, 94356024, 94399345, 94445711, 94494087, 94542062, 94589990, 94640404, 94694173, 94749755, 94805276, 94860685, 94916672, 94971156, 95019448, 95059812, 95097679, 95138526, 95180923, 95221174, 95259422, 95298439, 95338500, 95377028, 95412898, 95448554, 95485902, 95523453, 95558870, 95592850, 95628095, 95665586, 95703638, 95740676, 95777816, 95816910, 95857465, 95896775, 95933938, 95971185, 96010393, 96050280, 96088606, 96125638, 96163958, 96204495, 96244919, 96283716, 96322584, 96363318, 96404845, 96444952]
2117.1I6444952L8666L9482M1521M1830M0078L9381M1056M2868M2551M1426M1872M3708
2141.6I6939391M3899M1681L9971M0949M2682M2063L9298L7807L8993M0639M0424L9410
2166.1I7427207M0233M2403M3225M1897M0423M0704M1598M0633L8004L6192L6239L6735
2190.6I7905493L6186L5423L5900L7086L7229L5804L4344L4196L4451L3671L2425L2097
2215I8324305L2699L2931L1871L0810L1239L2341L2288L0851K9683K9403K9004K7764
2239.5I8695189K6691K6929K8038K8396K7531K6584K6613K6930K6369K4980K4283K4200
2264I9012733K3424K1589K0170K0349K1541K2131K1667K1350K1160K0402J8746J6856
2288.5I9262118J5670J5271J4627J2899J1193J1218J3190J5223J5867J5199J4180J3465
$$ y = [96444952, 96483618, 96523100, 96564621, 96606451, 96646529, 96685910, 96726966, 96769834, 96812385, 96853811, 96895683, 96939391, 96983290, 97024971, 97064942, 97105891, 97148573, 97190636, 97229934, 97267741, 97306734, 97347373, 97387797, 97427207, 97467440, 97509843, 97553068, 97594965, 97635388, 97676092, 97717690, 97758323, 97796327, 97832519, 97868758, 97905493, 97941679, 97977102, 98013002, 98050088, 98087317, 98123121, 98157465, 98191661, 98226112, 98259783, 98292208, 98324305, 98357004, 98389935, 98421806, 98452616, 98483855, 98516196, 98548484, 98579335, 98609018, 98638421, 98667425, 98695189, 98721880, 98748809, 98776847, 98805243, 98832774, 98859358, 98885971, 98912901, 98939270, 98964250, 98988533, 99012733, 99036157, 99057746, 99077916, 99098265, 99119806, 99141937, 99163604, 99184954, 99206114, 99226516, 99245262, 99262118, 99277788, 99293059, 99307686, 99320585, 99331778, 99342996, 99356186, 99371409, 99387276, 99402475, 99416655, 99430120]
2312.9I9430120J2481J0908R847J0138R936Q428P076M673j508o819o485k283J877O003
2341.5I9494392J1217J7000K2846K7698L0607L0983K8801K5171J9163Q642l051p701
2366I9705768m942o08K569O932J2631J7708K1386K3157K3472K3025K1595J8853J4776
2392.5I9886322J1253R519Q440O980N853N859O283N924M709L690L486L618L297K688
2421I9967921K742L588L743K885K086K211L088L481K515J270J090J097N43l0K98R36
2453.7I9999464N36o79j383o26Q58J317N13k62m41m65l10k62M7O32P87K74j13r6J55
2492.4I9999946N4j85j43P8K50j19n90m29J84N67L87%j13j37k69n72l45L63O14M41
2533.2I9999982J8n48n61M2M35N01J31p39j532j270k44N72Q23P63N60O32M35q9%Q9
$$ y = [99430120, 99442601, 99453509, 99463356, 99473494, 99483430, 99491858, 99498934, 99503607, 99502099, 99495280, 99488795, 99486512, 99488389, 99494392, 99505609, 99522609, 99545455, 99573153, 99603760, 99634743, 99663544, 99688715, 99707878, 99716520, 99713469, 99705768, 99700826, 99700218, 99702787, 99709719, 99722350, 99740058, 99761444, 99784601, 99808073, 99831098, 99852693, 99871546, 99886322, 99897575, 99907094, 99915534, 99922514, 99928367, 99934226, 99940509, 99946433, 99951142, 99954832, 99958318, 99961936, 99965233, 99967921, 99970663, 99974251, 99977994, 99980879, 99982965, 99985176, 99988264, 99991745, 99994260, 99995530, 99996620, 99997717, 99998260, 99998230, 99998528, 99999464, 100000000, 99999321, 99997938, 99997312, 99998170, 99999487, 100000000, 99999738, 99999297, 99998832, 99998522, 99998260, 99998307, 99998939, 99999726, 100000000, 99999887, 99999791, 99999946, 100000000, 99999815, 99999672, 99999750, 100000000, 99999881, 99999291, 99998862, 99999046, 99999613, 100000000, 100000000, 99999887, 99999750, 99999481, 99998909, 99998564, 99998927, 99999541, 99999982, 100000000, 99999452, 99998891, 99998933, 99999368, 99999869, 100000000, 99999261, 99997729, 99996459, 99996215, 99996787, 99997610, 99998373, 99998933, 99999565, 100000000, 99999911, 99999911, 100000000]
2574A00000000%Tl76j412j884j120oK80J67M59Q40P15J38J61Q64R36K38%Tl58m7L16
2618.9I9999911Q9k50j37K02J85l10TK44L76j43p93j114j157j478j913j568q70m23
2655.6I9990541P7J061K182K354J329L64K92P09P45L46%o20m65N07N78%j31L0J01o74
2696.4I9999326j311r12l10j37L76J162J186N48P2l22q94j448k075j996j091k74j49
2731.1I9991751q23j287m00J067J228M77N42J306J371N24K15R18J698J413j85j514
2763.7I9998301j824j549j145j049j144j049r30j365k342k718k206k253l141m000m452
2794.3I9967134m929n663o234n830n352o187p361p648p456p361p058p003p087p528
2822.8I9874437r090j1229j2619j3369j4812j7971k2739k7793l1263l3557l5495l5399
$$ y = [100000000, 100000000, 100000000, 99999624, 99998212, 99996328, 99995208, 99995202, 99995482, 99995649, 99996108, 99996948, 99997663, 99997801, 99997962, 99998826, 99999762, 100000000, 100000000, 100000000, 99999642, 99999595, 99999911, 100000000, 99999750, 99999613, 99999815, 100000000, 99999690, 99999380, 99999624, 100000000, 99999857, 99999064, 99997950, 99996793, 99995315, 99993402, 99991834, 99990964, 99990541, 99990618, 99991679, 99993861, 99996215, 99997544, 99997908, 99998200, 99998909, 99999654, 100000000, 100000000, 99999380, 99998915, 99999422, 100000000, 100000000, 99999869, 99999899, 100000000, 99999326, 99998015, 99997103, 99996793, 99996656, 99997032, 99998194, 99999380, 99999928, 100000000, 99999678, 99998784, 99997336, 99995261, 99993265, 99992174, 99991900, 99991751, 99990928, 99989641, 99989241, 99990308, 99991536, 99992013, 99992555, 99993861, 99995232, 99995756, 99995971, 99996889, 99998587, 100000000, 99999815, 99998301, 99996477, 99994928, 99993783, 99992734, 99991590, 99990541, 99989611, 99988246, 99985904, 99983186, 99980980, 99978727, 99975586, 99971586, 99967134, 99962205, 99956542, 99950308, 99944478, 99939126, 99932939, 99925578, 99917930, 99910474, 99903113, 99896055, 99889052, 99881965, 99874437, 99865347, 99854118, 99841499, 99828130, 99813318, 99795347, 99772608, 99744815, 99713552, 99679995, 99644500, 99609101]
2847.3I9609101l2366k8032k3770j9592j5372j0884o145k384j73P33N72j67q16j282
2875.9I9469423j847k695l975n609p015q631j1438j4252j4889j4055j4245j6576k0081
2902.4I9334115k3276k5856k8390l1495l4499l6103l5208l1877k6619j9652j0949j526
2926.8I9028665O896J3274J7935K1625K4175K5416K5540K4486K1768J7875J4388J2154
2951.3I9254197J1116J1045J1366J1617J2047J3130J4830J6779J8447K0117K2072K3210
2975.8I9439973K2149J9645J6928J4287J2625J1563R584P218N425L904K020%j234j198
3004.4I9562889n90j049l022m810n704o348p003p719p713p230p838r275r709r155q482
3034.9I9467242q196q398r126j0019j0520j0729j0908j1206j1545j1706j2207j3334
$$ y = [99609101, 99576735, 99548703, 99524933, 99505341, 99489969, 99479085, 99472940, 99470556, 99470383, 99471116, 99471688, 99471521, 99470705, 99469423, 99467576, 99464881, 99460906, 99455297, 99448282, 99439651, 99428213, 99413961, 99399072, 99385017, 99370772, 99354196, 99334115, 99310839, 99284983, 99256593, 99225098, 99190599, 99154496, 99119288, 99087411, 99060792, 99041140, 99030191, 99028665, 99035561, 99048835, 99066770, 99088395, 99112570, 99137986, 99163526, 99188012, 99209780, 99227655, 99242043, 99254197, 99265313, 99276358, 99287724, 99299341, 99311388, 99324518, 99339348, 99356127, 99374574, 99394691, 99416763, 99439973, 99462122, 99481767, 99498695, 99512982, 99525607, 99537170, 99546754, 99553972, 99559397, 99563301, 99565321, 99565321, 99564087, 99562889, 99562299, 99561250, 99558228, 99553418, 99547714, 99541366, 99534363, 99526644, 99518931, 99511701, 99503863, 99494588, 99484879, 99475724, 99467242, 99459046, 99450648, 99441522, 99431503, 99420983, 99410254, 99399346, 99388140, 99376595, 99364889, 99352682, 99339348]
3059.4I9339348j3876j3858j3900j4496j5586j6725j7608j7684j6380j4317j2779j2415
3083.9I9159724j2577j2201j2267j3870j5914j7029j7441j8608k0492k1178k0408j9342
3108.4I8958397j8662j8794j9467k0074k0296k0665k1952k3490k4450k5356k6441k7084
3132.8I8691666k7138k7257k7829k8599k9182k9874l0637l1203l1549l2103l3462l5214
3157.3I8327619l6550l7348l7962l8690l9780m1008m1550m2075m3243m4614m5699m6754
3181.8I7832346m8202n0026n1767n2923n3698n4639n5695n6011n5605n5456n5963n6874
3206.3I7185487n7418n7238n7220n7799n8687n9449n9861o0356o0934o1297o1459o1792
3230.7I6471977o2787o3914o4332o4176o3813o3246o2490o1619o0785n9300n6589n3287
$$ y = [99339348, 99325472, 99311614, 99297714, 99283218, 99267632, 99250907, 99233299, 99215615, 99199235, 99184918, 99172139, 99159724, 99147147, 99134946, 99122679, 99108809, 99092895, 99075866, 99058425, 99039817, 99019325, 98998147, 98977739, 98958397, 98939735, 98920941, 98901474, 98881400, 98861104, 98840439, 98818487, 98794997, 98770547, 98745191, 98718750, 98691666, 98664528, 98637271, 98609442, 98580843, 98551661, 98521787, 98491150, 98459947, 98428398, 98396295, 98362833, 98327619, 98291069, 98253721, 98215759, 98177069, 98137289, 98096281, 98054731, 98012656, 97969413, 97924799, 97879100, 97832346, 97784144, 97734118, 97682351, 97629428, 97575730, 97521091, 97465396, 97409385, 97353780, 97298324, 97242361, 97185487, 97128069, 97070831, 97013611, 96955812, 96897125, 96837676, 96777815, 96717459, 96656525, 96595228, 96533769, 96471977, 96409190, 96345276, 96280944, 96216768, 96152955, 96089709, 96027219, 95965600, 95904815, 95845515, 95788926, 95735639]
3255.2I5735639n0145m7737m6194m5413m4656m3392m2629m3303m4876m6599m8339n0110
3279.7I5182246n1487n2517n3531n5313n7894o0499o3074o5547o8074p1597p6431q1712
3304.2I4424570q6427r0766r4706r8592j02782j07080j11282j15716j20110j23679
3324.6I3373430j27131j31303j35940j40423j44803j49113j53131j57088j61653j66870
3345I1905975j72037j76239j79863j83332j86747j90055j93632j96969j98847j99283
3365.4I0028971j98739j97608j95866j93042j88053j80727j72847j65767j58977j51408
3385.7H8225937j43069j35195j28627j23179j18679j14691j10805j06919j02764r7728
3406.1H7044281r2024q7213q3810q0079p4631o7395n9128n0861m3112l5882k8878k1094
$$ y = [95735639, 95685494, 95637757, 95591563, 95546150, 95501494, 95458102, 95415473, 95372170, 95327294, 95280695, 95232356, 95182246, 95130759, 95078242, 95024711, 94969398, 94911504, 94851005, 94787931, 94722384, 94654310, 94582713, 94506282, 94424570, 94338143, 94247377, 94152671, 94054079, 93951297, 93844217, 93732935, 93617219, 93497109, 93373430, 93246299, 93114996, 92979056, 92838633, 92693830, 92544717, 92391586, 92234498, 92072845, 91905975, 91733938, 91557699, 91377836, 91194504, 91007757, 90817702, 90624070, 90427101, 90228254, 90028971, 89830232, 89632624, 89436758, 89243716, 89055663, 88874936, 88702089, 88536322, 88377345, 88225937, 88082868, 87947673, 87819046, 87695867, 87577188, 87462497, 87351692, 87244773, 87142009, 87044281, 86952257, 86865044, 86781234, 86701155, 86626524, 86559129, 86500001, 86449140, 86406028, 86370146, 86341268, 86320174]
3430.6H6320174j1850k539N210J1789J7542K3568L1203L9351M5931N1117N6773O3634
3455.1H6651903O9905P3772P6056P9048Q2343Q3864Q3715Q3363Q3381Q4334Q5909Q6140
3479.6H7623733Q5211Q5419Q8054R1559R3234R3245R3520R4879R6571R8014R9301J00971
3504H8743711J03235J05482J07896J10490J13076J15835J18804J20914J21933J22208
3524.4H9883584J22136J22875J24466J25438J26183J27274J27697J27524J27721J27429
3544.8I1142327J26487J27536J29950J29872J28633J28359J29300J31953J34939J36637
3565.2I2445993J38939J43468J48154J50567J52850J56647J61529J66577J69372J69599
3585.6I4003695J71066J74069J75917J76335J76525J75923J76245J79040J78909J73796
$$ y = [86320174, 86308324, 86305785, 86310995, 86322784, 86340326, 86363894, 86395097, 86434448, 86480379, 86531496, 86588269, 86651903, 86721808, 86795580, 86871636, 86950684, 87033027, 87116891, 87200606, 87283969, 87367350, 87451684, 87537593, 87623733, 87708944, 87794363, 87882417, 87973976, 88067210, 88160455, 88253975, 88348854, 88445425, 88543439, 88642740, 88743711, 88846946, 88952428, 89060324, 89170814, 89283890, 89399725, 89518529, 89639443, 89761376, 89883584, 90005720, 90128595, 90253061, 90378499, 90504682, 90631956, 90759653, 90887177, 91014898, 91142327, 91268814, 91396350, 91526300, 91656172, 91784805, 91913164, 92042464, 92174417, 92309356, 92445993, 92584932, 92728400, 92876554, 93027121, 93179971, 93336618, 93498147, 93664724, 93834096, 94003695, 94174761, 94348830, 94524747, 94701082, 94877607, 95053530, 95229775, 95408815, 95587724, 95761520]
3606I5761520J69265J67656J67090J63453J58906J55145J50991J46484J40613J34439
3626.4I7315562J30605J29539J31446J30463J22577J15240J11150J07938J04040R6894
3646.8I8495454Q8691Q2016P7951P2932O8093O7723O5392O0391N4294M3041L2615L0452
3671.3I9239045L1674L0673K8777K7144K6804L1138L8307M1408M3201M4698M2558M0566
3695.8I9665993L4696K6065K2072K2870K3479K1368J7810J2892R155R299J2415J4467
3720.2I9892581J1855R352J3578J7059R763O759J2749J4371Q828L105j580p730j1313
3746.7I9979377j0061p403p034j0842j2612r167o807o956j109N985M458p93k247k032
3775.3I9912757k820k354j687O80N281N495M995M911J383j889r54J913O26j96n84m417
$$ y = [95761520, 95930785, 96098441, 96265531, 96428984, 96587890, 96743035, 96894026, 97040510, 97181123, 97315562, 97446167, 97575706, 97707152, 97837615, 97960192, 98075432, 98186582, 98294520, 98398560, 98495454, 98584145, 98666161, 98744112, 98817044, 98885137, 98952860, 99018252, 99078643, 99132937, 99175978, 99208593, 99239045, 99270719, 99301392, 99330169, 99357313, 99384117, 99415255, 99453562, 99494970, 99538171, 99582869, 99625427, 99665993, 99700689, 99726754, 99748826, 99771696, 99795175, 99816543, 99834353, 99847245, 99856400, 99865699, 99878114, 99892581, 99904436, 99913788, 99927366, 99944425, 99954188, 99960947, 99973696, 99988067, 99996895, 100000000, 99998420, 99990690, 99979377, 99969316, 99961913, 99954879, 99944037, 99931425, 99922258, 99915451, 99908495, 99907386, 99913371, 99917829, 99917036, 99914789, 99912757, 99909937, 99907583, 99905896, 99906576, 99911857, 99917352, 99922347, 99927258, 99928641, 99926752, 99925798, 99927711, 99928337, 99928141, 99927557, 99923140]
3807.9I9923140o294o050n508l057j854j449K498K312j311k181k432m488l571P081
3836.5I9896836J0586Q05n013o735o318o402o139o08L379J264k182n620o473l642L749
3867.1I9867487J1742N484n752o324m417l761l087n73L445M459J717k021l600k355
3895.6I9862444j704k69N73k539k748m53j252j508K110O265P283N281J586q4J222J556
3928.3I9877763J943M381N257L469K044J610J263J395J919J324n61j257M29L224M453
3958.9I9908656L928N156P361O652M196L564M465M655L743K855K408K521L255M327
3987.4I9967742N382O259O866O914O837
3997.6A00000000
$$ y = [99923140, 99916846, 99910796, 99905288, 99902231, 99900377, 99898928, 99901426, 99903738, 99902427, 99900246, 99897814, 99893326, 99889755, 99896836, 99907422, 99908227, 99903214, 99896479, 99890161, 99883759, 99877620, 99877012, 99880391, 99881655, 99879473, 99873853, 99867380, 99863738, 99867487, 99879229, 99884713, 99878961, 99872637, 99868220, 99864459, 99861372, 99860799, 99864244, 99868703, 99870420, 99868399, 99864799, 99862444, 99860740, 99860471, 99861044, 99858505, 99855757, 99855304, 99854052, 99852544, 99854654, 99860919, 99868202, 99873483, 99875069, 99874985, 99876207, 99877763, 99879706, 99884087, 99889344, 99892813, 99894857, 99896467, 99897730, 99899125, 99901044, 99902368, 99901807, 99900550, 99900979, 99904203, 99908656, 99912584, 99917740, 99925101, 99931753, 99935949, 99939513, 99943978, 99948633, 99952376, 99955231, 99957639, 99960160, 99963415, 99967742, 99973124, 99979383, 99986249, 99993163, 100000000]
##END=$$ End of the data block
