##TITLE=AD 13 $$ Begin of the data block
##JCAMP-DX=5.00 $$ ACD/SpecManager v 10.08
##SPECTROMETER/DATA SYSTEM=Alpha
##DATE=17 Dec 2014 10:47:54
##DATA TYPE=INFRARED SPECTRUM
##DATA CLASS=XYDATA
##ORIGIN=
##OWNER=
##NPOINTS=1765
##FIRSTX=399.76428223
##LASTX=3997.64306641
##MAXX=3997.64306641
##MINX=399.76428223
##MAXY=1.00000000
##MINY=0.22689624
##XFACTOR=1.0000000000
##YFACTOR=0.000000010000000
##FIRSTY=1.00000000
##DELTAX=2.03961372
##XUNITS=1/CM
##YUNITS=ARBITRARY UNITS
##XYDATA=(X++(Y..Y))
399.8A00000000j510572j480610j478660j503205j533520j554406j565897j561529
416.1H7811601j529878j498151j489013j462889j396388j336902j306832j272506j211679
434.4G5307363j141566j091546j068031j054544j010382r42087q91417q63266q22014
452.8F6422510p45278o47033n62507n08117m53139l69072k69335j85776j31863q9050
473.2F2461340l1799L6234Q7541J16063J47724J98543K49409K73622K70760K72989
493.6F4082426L01272L40658L58897L53188L58975L95947M43650M73517M88072N11170
514F8107772N55688O05416O35910O46806O64729P10756P65055P92825P94393Q04007
534.4G5083357Q40163Q81058Q94600Q84843Q85612R11659R38702R36597R08602Q93604
$$ plain form
399.8 100000000 98489428 97008818 95530158 94026953 92493433 90939027 89373130 87811601
416.1 87811601 86281723 84783572 83294559 81831670 80435282 79098380 77791548 76519042 75307363
434.4 75307363 74165797 73074251 72006220 70951676 69941294 68999207 68107790 67244524 66422510
452.8 66422510 65677232 65030199 64467692 63959575 63506436 63137364 62868029 62682253 62550390 62461340
473.2 62461340 62429541 62465775 62553316 62669379 62817103 63015646 63265055 63538677 63809437 64082426
493.6 64082426 64383698 64724356 65083253 65436441 65795416 66191363 66635013 67108530 67596602 68107772
514 68107772 68663460 69268876 69904786 70551592 71216321 71927077 72692132 73484957 74279350 75083357
534.4 75083357 75923520 76804578 77699178 78584021 79469633 80381292 81319994 82256591 83165193 84058797
554.8H4058797R12148R36085R31716R00275Q78959Q90488R04143Q82840Q34441P96658
575.2I2926550P89875P87353P45392O70689O13988N97250N80681N21201M33176L63314
595.6I9029469L30878K99990K20239J04046%Vj5783J5384p975J5938j5783P814j6553
626.2I9967664J1409%p3654K0910j32782j39641j47874j99353k66183k90542k46591
648.6I8503363j73128k18474l74890m35614m00293l68953l91895m38982m52739m25106
669I4823289m07052m31031m61936m47363l88521l40014l63714m87554n67949n06145
689.4I0422010m52321m64654m94314m87840m50545m29172m52566m95082n07235m89521
709.8H5698760m90827n32299n77259n85967n68432n66125n94258o24037o21861n97000
$$ plain form
554.8 84058797 84970945 85907030 86838746 87739021 88617980 89508468 90412611 91295451 92129892 92926550
575.2 92926550 93716425 94503778 95249170 95919859 96533847 97131097 97711778 98232979 98666155 99029469
595.6 99029469 99360347 99660337 99880576 99984622 99984622 99984622 99984622 99984622 99968839 99984223 99976248 99992186 99976403 99984217 99967664
626.2 99967664 99979073 99979073 99905419 99926329 99793547 99653906 99506032 99306679 99040496 98749954 98503363
648.6 98503363 98330235 98111761 97736871 97301257 96900964 96532011 96140116 95701134 95248395 94823289
669 94823289 94416237 93985206 93523270 93075907 92687386 92347372 91983658 91496104 90928155 90422010
689.4 90422010 89969689 89505035 89010721 88522881 88072336 87643164 87190598 86695516 86188281 85698760
709.8 85698760 85207933 84675634 84098375 83512408 82943976 82377851 81783593 81159556 80537695 79940695
730.2G9940695n88841o12378o43414o48803o27994o16527o31660o44463o26201n87338
750.6G3713076n59354n51420n38850m97830m38303l90958l63762l32009k72096j93566
771F9574928j25676p8797l3123L0756J00410J49697J74582J96940K35081K79754L05796
793.4G0810348L07172L02768L07196L09152K82973K20108J35797M5634n7751j92792
813.8G2470605l56936n23317o70201q00329r26799j048255j146036j207215j239562
832.2F4551955j259857j272619j267379j237732j195544j158482j130009j099092j057720
850.5E3873521j013666r79281r55689r32932r04092q73497q49545q33714q18604p97886
870.9D4914615p75435p59617p50485p41246p27257p10616o96912o86896o75097o57222
$$ plain form
730.2 79940695 79351854 78739476 78096062 77447259 76819265 76202738 75571078 74926615 74300414 73713076
750.6 73713076 73153722 72602302 72063452 71565622 71127319 70736361 70372599 70040590 69768494 69574928
771 69574928 69449252 69370455 69337332 69368088 69468498 69618195 69792777 69989717 70224798 70504552 70810348
793.4 70810348 71117520 71420288 71727484 72036636 72319609 72539717 72675514 72721148 72663397 72470605
813.8 72470605 72113669 71590352 70920151 70119822 69193023 68144768 66998732 65791517 64551955
832.2 64551955 63292098 62019479 60752100 59514368 58318824 57160342 56030333 54931241 53873521
850.5 53873521 52859855 51880574 50924885 49991953 49087861 48214364 47364819 46531105 45712501 44914615
870.9 44914615 44139180 43379563 42629078 41887832 41160575 40449959 39753047 39066151 38391054 37733832
891.3C7733832o36598o18223o02192n85338n64235n39682n17130m98360m79233m57359
911.7C2235482m34270m13147l95623l79216l60388l40375l23814l11673l00542k87836
932.1B8688598k74313k62427k53698k45989k36499k25881k16478k10252k06319k01028
952.5B6355714j93376j86845j83472j81395j78027j73247j68917j65801j63382j60371
972.9B4600881j56411j52222j48186j44384j39575j31810j22149j13691j06630r9190
993.3B3286633r0366q0932p2705o6752o1319n4406m6894l9907l3256k6250j7679o543
1017.8B2689624N230J5633K5769L7385M9748O0828O9934P8373Q8307R9082J08284J14945
1042.2B3443142J20960J28016J35468J41984J47001J51520J56532J61859J65876J67802
$$ plain form
891.3 37733832 37097234 36479011 35876819 35291481 34727246 34187564 33670434 33172074 32692841 32235482
911.7 32235482 31801212 31388065 30992442 30613226 30252838 29912463 29588649 29276976 28976434 28688598
932.1 28688598 28414285 28151858 27898160 27652171 27415672 27189791 26973313 26763061 26556742 26355714
952.5 26355714 26162338 25975493 25792021 25610626 25432599 25259352 25090435 24924634 24761252 24600881
972.9 24600881 24444470 24292248 24144062 23999678 23860103 23728293 23606144 23492453 23385823 23286633
993.3 23286633 23196267 23115335 23042630 22975878 22914559 22860153 22813259 22773352 22740096 22713846 22696167 22689624
1017.8 22689624 22694854 22710487 22736256 22773641 22823389 22884217 22954151 23032524 23120831 23219913 23328197 23443142
1042.2 23443142 23564102 23692118 23827586 23969570 24116571 24268091 24424623 24586482 24752358 24920160
1062.6B4920160J68377J69730J72681J75294J75983J76358J79344J84542J89355J92380
1083B6704204J95447K00191K06059K11510K14920K16358K17638K20615K24119K26071
1103.4B8837132K27157K29656K33493K36746K37704K37173K38180K41127K44054K45721
1123.8C1208143K46575K48090K51144K54598K56416K56571K56858K58571K60910K62505
1144.2C3760381K62469K62272K63268K64853K66087K67229K69431K73692K79743K85393
1164.6C6454818K89833K94653L01891L11354L20828L28305L34162L40775L48827L56629
1185C9682075L62385L67030L73101L81920L91263L97986M02969M09407M18070M25821
1205.4D3612027M29949M31159M32912M36911M40335M38968M32875M27002M24412M22502
$$ plain form
1062.6 24920160 25088537 25258267 25430948 25606242 25782225 25958583 26137927 26322469 26511824 26704204
1083 26704204 26899651 27099842 27305901 27517411 27732331 27948689 28166327 28386942 28611061 28837132
1103.4 28837132 29064289 29293945 29527438 29764184 30001888 30239061 30477241 30718368 30962422 31208143
1123.8 31208143 31454718 31702808 31953952 32208550 32464966 32721537 32978395 33236966 33497876 33760381
1144.2 33760381 34022850 34285122 34548390 34813243 35079330 35346559 35615990 35889682 36169425 36454818
1164.6 36454818 36744651 37039304 37341195 37652549 37973377 38301682 38635844 38976619 39325446 39682075
1185 39682075 40044460 40411490 40784591 41166511 41557774 41955760 42358729 42768136 43186206 43612027
1205.4 43612027 44041976 44473135 44906047 45342958 45783293 46222261 46655136 47082138 47506550 47929052
1225.8D7929052M16433M06400L97739L94046L91793L85115L74704L65961L62068L60406
1246.2E1783717L55023L44628L35848L33435L33744L30108L21430L14617L15333L19832
1266.6E5087715L18998L11345L04973L06088L10409L09330L01046K93421K93595K96825
1287E8133745K93976K83706K74343K73180K76351K73406K61081K48646K46597K51478
1307.4F0816509K50196K39682K30110K30396K36362K36177K25097K11406K07841K12443
1327.8F3096219K11269J99026J85805J83010J87684J85459J72532J59013J52374J50329
1348.2F4882720J43533J25897J05077R3520Q9681P9930N9855M0776L3062K9725J5444
1370.6F5699220p999k1148j8543j0145o485j1217j5158o228R077J6708J5205J3673
$$ plain form
1225.8 47929052 48345485 48751885 49149624 49543670 49935463 50320578 50695282 51061243 51423311 51783717
1246.2 51783717 52138740 52483368 52819216 53152651 53486395 53816503 54137933 54452550 54767883 55087715
1266.6 55087715 55406713 55718058 56023031 56329119 56639528 56948858 57249904 57543325 57836920 58133745
1287 58133745 58427721 58711427 58985770 59258950 59535301 59808707 60069788 60318434 60565031 60816509
1307.4 60816509 61066705 61306387 61536497 61766893 62003255 62239432 62464529 62675935 62883776 63096219
1327.8 63096219 63307488 63506514 63692319 63875329 64063013 64248472 64421004 64580017 64732391 64882720
1348.2 64882720 65026253 65152150 65257227 65350747 65440428 65520358 65580213 65620989 65654051 65683776 65699220
1370.6 65699220 65691221 65670073 65651530 65641385 65634900 65623683 65608525 65602297 65611374 65628082 65643287 65656960
1395.1F5656960K1547L5405L8111K1881J2875K6262M4983N4992N0890M3309N0312O4510
1419.6F6122037O8301O7210O8999P9429R8723J11550J08481J02525J13935J29008J26642
1442F7196840J23525J25175J30344J44005J60330J69403J70385J74576J94717K17712
1462.4F8807012K29072K34980K50244K69115K70915K56228K58917K71291K75182K77585
1482.8G1400541K80845K76995K65062K51698K50310K51460K47866K48224K56317K61671
1503.2G3990989K48432K29955K32589K41887K49070K53642K49398K47884K50184K37417
1523.6G6431447K19721K09772K05243K12091K19077K15310K00027J92058J91260J78492
1544G8474498J75768J71941J64068J69343J73271J60169J42098J31082J33437J47456
$$ plain form
1395.1 65656960 65678507 65713912 65752023 65773904 65786779 65813041 65858024 65913016 65963906 66007215 66057527 66122037
1419.6 66122037 66190338 66257548 66326547 66405976 66504699 66616249 66724730 66827255 66941190 67070198 67196840
1442 67196840 67320365 67445540 67575884 67719889 67880219 68049622 68220007 68394583 68589300 68807012
1462.4 68807012 69036084 69271064 69521308 69790423 70061338 70317566 70576483 70847774 71122956 71400541
1482.8 71400541 71681386 71958381 72223443 72475141 72725451 72976911 73224777 73473001 73729318 73990989
1503.2 73990989 74239421 74469376 74701965 74943852 75192922 75446564 75695962 75943846 76194030 76431447
1523.6 76431447 76651168 76860940 77066183 77278274 77497351 77712661 77912688 78104746 78296006 78474498
1544 78474498 78650266 78822207 78986275 79155618 79328889 79489058 79631156 79762238 79895675 80043131
1564.4H0043131J50597J38456J23864J15448J04946Q9252Q2159P0680O1851N8562M8029
1586.8H1086975K9481P528j0663j2958j1963k4504m8005o1631n8627n7465o8456q0002
1611.3H0689710p8457o1470m3923m5729n3978l8373l588L4779N8442O4331Q3757J19030
1635.8H0724531J37973J53077J75255K02632K30873K53075K62761K52998K42633K55436
1656.2H2891244K66188K55537K31344K14529K15315J95700J57082J44196J42616J45698
1676.6H4859449J50829J44881J26344R7883Q6510R5558R2304P7993P6574Q7905R4491
1699H5990721P6556N1660M8828O0713P7975Q2725O8039M9597L8916M3630N1099M5562
1723.5H6686021M3810O1285Q5992R7262Q3882P1240Q9550J17367J31112J27978J14852
$$ plain form
1564.4 80043131 80193728 80332184 80456048 80571496 80676442 80765694 80847853 80918533 80980384 81038946 81086975
1586.8 81086975 81116456 81123984 81113321 81100363 81088400 81063896 81015891 80954260 80895633 80838168 80769712 80689710
1611.3 80689710 80611253 80549783 80505860 80460131 80406153 80367780 80364192 80398971 80457413 80521744 80605501 80724531
1635.8 80724531 80862504 81015581 81190836 81393468 81624341 81877416 82140177 82393175 82635808 82891244
1656.2 82891244 83157432 83412969 83644313 83858842 84074157 84269857 84426939 84571135 84713751 84859449
1676.6 84859449 85010278 85155159 85281503 85379386 85465896 85561454 85653758 85731751 85808325 85896230 85990721
1699 85990721 86067277 86118937 86167765 86228478 86306453 86389178 86457217 86506814 86545730 86589360 86640459 86686021
1723.5 86686021 86729831 86791116 86877108 86974370 87058252 87129492 87219042 87336409 87467521 87595499 87710351
1745.9H7710351J07664J08450J07694R9975P8922O6096P3957Q0085O9291N1105M8810
1768.4H8602400O6805Q1771P8607O2901N7041P1448Q5724P9292O1011N2470O2758P7003
1792.8H9439231P4607O2365O1124P3981Q5766Q5526P3791O2990O9553P8523O8956N2721
1817.3I0289134M9430O1124P3004P2700N9450M9483N6559O7538O8248O1083N7321O2925
1841.8I1027999P1031O7502N5856N4156O1179O4361O0439N0592M0519M2183N4007N8169
1866.3I1707993N1641M7261N2982O1685O2942N5767M9334N1630N6147N4020M7845M4346
1890.7I2343593M8697N7912O2125N7322M9710M9031N5319N6160M7636L9577M1086N1236
1915.2I2959404N7274N2321M4894M6516N4806N7560N1296M3130M1038M7284N3168M8089
$$ plain form
1745.9 87710351 87818015 87926465 88034159 88134134 88213056 88279152 88353109 88433194 88502485 88553590 88602400
1768.4 88602400 88669205 88750976 88829583 88892484 88949525 89020973 89106697 89185989 89247000 89299470 89362228 89439231
1792.8 89439231 89513838 89576203 89637327 89711308 89797074 89882600 89956391 90019381 90088934 90167457 90236413 90289134
1817.3 90289134 90338564 90399688 90472692 90545392 90604842 90654325 90710884 90778422 90846670 90907753 90965074 91027999
1841.8 91027999 91099030 91166532 91222388 91276544 91337723 91402084 91462523 91513115 91553634 91595817 91649824 91707993
1866.3 91707993 91759634 91806895 91859877 91921562 91984504 92040271 92089605 92141235 92197382 92251402 92299247 92343593
1890.7 92343593 92392290 92450202 92512327 92569649 92619359 92668390 92723709 92779869 92827505 92867082 92908168 92959404
1915.2 92959404 93016678 93068999 93113893 93160409 93215215 93272775 93324071 93367201 93408239 93455523 93508691 93556780
1939.7I3556780L8457L8003M6874N4156N0831M1104L7932M5025N0628M5449L6019L3808
1964.2I4075066M1061M9103M7827L9386L5125L9369M5014M3028L3820K8020L2961M1271
1988.7I4551051M1395L3701K8705L3230M1449M2611L5310K9772L2598L6776L1323J8364
2013.1I4956285J0872J5336K5296K9844K6643K3556K8753L9346M4912M1550L7271M0155
2037.6I5319819M6140M4340L3015K4557K7663L6091L9506L5172K9493L0469L7325M0942
2062.1I5744532L6747L1024L2347L9923M4817M1837L6412L6961M3321M7326M4363L9089
2086.6I6218699L8892M4561M8810M6194M0346L9267M4448M8804M6784M1222L9584M3952
2111I6741563M8184M6343M0901L9160M3535M8614M8035M2647L9476M2367M6814M6509
$$ plain form
1939.7 93556780 93595237 93633240 93680114 93734270 93785101 93826205 93864137 93909162 93959790 94005239 94041258 94075066
1964.2 94075066 94116127 94165230 94213057 94252443 94287568 94326937 94371951 94414979 94448799 94476819 94509780 94551051
1988.7 94551051 94592446 94626147 94654852 94688082 94729531 94772142 94807452 94837224 94869822 94906598 94937921 94956285
2013.1 94956285 94967157 94982493 95007789 95037633 95064276 95087832 95116585 95155931 95200843 95242393 95279664 95319819
2037.6 95319819 95365959 95410299 95443314 95467871 95495534 95531625 95571131 95606303 95635796 95666265 95703590 95744532
2062.1 95744532 95781279 95812303 95844650 95884573 95929390 95971227 96007639 96044600 96087921 96135247 96179610 96218699
2086.6 96218699 96257591 96302152 96350962 96397156 96437502 96476769 96521217 96570021 96616805 96658027 96697611 96741563
2111 96741563 96789747 96836090 96876991 96916151 96959686 97008300 97056335 97098982 97138458 97180825 97227639 97274148
2135.5I7274148M1831L8737M0996M5139M5097M0882L8404M1157M5275M4847M0007L6299
2160I7772819L7825M2164M3369L9661L5524L6186M0394M2438L9840L6436L6788L9989
2184.5I8243433M0859L7348L3188L2717L5984L8075L5405L0488K8950L1954L4553L2592
2208.9I8655546K8175K6637K9504L2658L1346K6554K4056K6643L0000K8473K2846J9074
2233.4I8981512K0355K2906K1332J5789J1516J1754J3661J1862N620M53Q29M321M602
2259.9I9126512O32j830L117J4114K3640K6846K5892K4932K3020J5193l99j9324l5376
2286.4I9226969m7785o2835q6397j16217j45209j66940j79464j90443k11400k44319
2306.8I7775960k79433l07434l31319l57425l77029l75974l59309l42184l31283l29441
$$ plain form
2135.5 97274148 97315979 97354716 97395712 97440851 97485948 97526830 97565234 97606391 97651666 97696513 97736520 97772819
2160 97772819 97810644 97852808 97896177 97935838 97971362 98007548 98047942 98090380 98130220 98166656 98203444 98243433
2184.5 98243433 98284292 98321640 98354828 98387545 98423529 98461604 98497009 98527497 98556447 98588401 98622954 98655546
2208.9 98655546 98683721 98710358 98739862 98772520 98803866 98830420 98854476 98881119 98911119 98939592 98962438 98981512
2233.4 98981512 99001867 99024773 99046105 99061894 99073410 99085164 99098825 99110687 99116307 99116760 99117589 99121910 99126512
2259.9 99126512 99127144 99125314 99128431 99142545 99166185 99193031 99218923 99243855 99266875 99282068 99281669 99262345 99226969
2286.4 99226969 99179184 99116349 99029952 98913735 98768526 98601586 98422122 98231679 98020279 97775960
2306.8 97775960 97496527 97189093 96857774 96500349 96123320 95747346 95388037 95045853 94714570 94385129
2327.2I4385129l34060k97493j79684k1511J00213J45304J24437N4568m8721j62315
2347.6I3765867k57278l17877l48908l51632l17978k43354j13225J04254L86542O50293
2368I2956704Q32397R21404R35996Q93241Q13460P11578N95385M72969L53765K47211
2388.4I9734110J58006Q3881j6236K3997l1597k6554j4114n639l206k510k9K968L445
2414.9I9906522J222n13M83K837L392J025j299m71K223L046R83j418j312R60J836l04
2447.6I9919212l278l732j603j97j514l528l243p33J037M2k253k825q41P27p39l755
2480.2I9892777m798k861q11j424l725m477k861r77j478m161n609l951j413j705m357
2510.8I9848169n954m781k384j842m106o289n376k503j735m369p087o461l582k772
$$ plain form
2327.2 94385129 94051069 93753576 93573892 93552381 93652594 93797898 93922335 93976903 93928182 93765867
2347.6 93765867 93508589 93190712 92841804 92490172 92172194 91928840 91815615 91919869 92306411 92956704
2368 92956704 93789101 94710505 95646501 96539742 97353202 98064780 98660165 99133134 99486899 99734110
2388.4 99734110 99892116 99975997 99959761 99983758 99952161 99925607 99911493 99905854 99902648 99900138 99900109 99903077 99906522
2414.9 99906522 99907744 99907231 99907714 99910551 99913943 99914968 99913669 99913198 99915421 99918467 99919450 99918032 99916720 99917680 99919516 99919212
2447.6 99919212 99915934 99912202 99910599 99910402 99908888 99905360 99902117 99901384 99902421 99902463 99900210 99897385 99896544 99897271 99896532 99892777
2480.2 99892777 99887979 99885118 99884307 99882883 99879158 99874681 99871820 99870843 99869365 99865204 99859595 99855644 99854231 99852526 99848169
2510.8 99848169 99842215 99837434 99835050 99833208 99829102 99822813 99817437 99814934 99813199 99808830 99801743 99795282 99791700 99788928
2539.3I9788928n811q917q428n168l320n210q171p832m238k015m369q500r310o163
2567.9I9701476l809n805r704j0770q041n805p749j1641j2261q648n561p266j1832
2594.4I9592584j3518j0508p171q040j1528j2630r847o884p773j1515j3095j0270o998
2620.9I9462807q124j2803j5390j3018r620j0061j3441j4877j2171q268p981j1551
2645.4I9325502j4210j2225q130p415j0794j3214j0991p046o777j0663j3620j1813
2669.9I9198604p677o378r674j3232j2177p797o079r275j2743j1474p105n800r441
2696.4I9079752j3316j2511q166o091r167j3411j3709j0276q166j0926j5515j5831
2720.9I8942667j1271p868r590j3149j3155r137o211q494j3321j4663j1396p970q898
$$ plain form
2539.3 99788928 99783117 99774200 99765772 99760604 99757284 99752074 99743903 99736071 99731833 99729818 99725449 99716949 99707639 99701476
2567.9 99701476 99697667 99691862 99682158 99671388 99663347 99657542 99649793 99638152 99625891 99617243 99611682 99604416 99592584
2594.4 99592584 99579066 99568558 99561387 99553347 99541819 99529189 99519342 99512458 99504685 99493170 99480075 99469805 99462807
2620.9 99462807 99454683 99441880 99426490 99413472 99403852 99393791 99380350 99365473 99353302 99345034 99337053 99325502
2645.4 99325502 99311292 99299067 99290937 99283522 99272728 99259514 99248523 99241477 99234700 99224037 99210417 99198604
2669.9 99198604 99190927 99184549 99174875 99161643 99149466 99141669 99135590 99126315 99113572 99102098 99094993 99089193 99079752
2696.4 99079752 99066436 99053925 99045759 99039668 99030501 99017090 99003381 98993105 98984939 98974013 98958498 98942667
2720.9 98942667 98931396 98923528 98913938 98900789 98887634 98878497 98872286 98863792 98850471 98835808 98824412 98816442 98807544
2747.4I8807544j3227j4984j1063o521p432j2082j3924j0639o909q225j3107j5205
2771.8I8674226j2255q672r662j4830j8114j5372j0252r990j5008j8168j4871r352
2796.3I8517680r346j4835j8216j5545j1157j1570j7214k1350j8513j2160j0609j6040
2820.8I8341125k1553k0563j5450j4716k1530k8896k9599k6691k8462l6770m4435m3941
2845.3I8008519l6925l2329l4183l5787k9695j8311j0997j2272j5879j3131m911j061
2869.7I7763038o354j3757j4174p898m363r620j7696j8889j3703j1879j8228k5975
2894.2I7600502k6232j9813j6498k2668l2210l4696k9522k6513l2359m1503m2706l3689
2918.7I7242093k4515k3145k4175j7691l886P152Q458N037O932J5968K2590J8495Q118
$$ plain form
2747.4 98807544 98794317 98779333 98768270 98761749 98754317 98742235 98728311 98717672 98710763 98702538 98689431 98674226
2771.8 98674226 98661971 98653299 98643637 98628807 98610693 98595321 98585069 98575079 98560071 98541903 98527032 98517680
2796.3 98517680 98508334 98493499 98475283 98459738 98448581 98437011 98419797 98398447 98379934 98367774 98357165 98341125
2820.8 98341125 98319572 98299009 98283559 98268843 98247313 98218417 98188818 98162127 98133665 98096895 98052460 98008519
2845.3 98008519 97971594 97939265 97905082 97869295 97839600 97821289 97810292 97798020 97782141 97769010 97764099 97763038
2869.7 97763038 97756684 97742927 97728753 97720855 97716492 97706872 97689176 97670287 97656584 97644705 97626477 97600502
2894.2 97600502 97574270 97554457 97537959 97515291 97483081 97448385 97418863 97392350 97359991 97318488 97275782 97242093
2918.7 97242093 97217578 97194433 97170258 97152567 97148681 97155833 97164291 97169328 97176260 97192228 97214818 97233313 97241431
2945.2I7241431K850O812J1367P546o97k397N466J3757J3000O515N674J3924K2017
2971.7I7347265K0242J0681M691Q267J4019J1176J353m273r06M482K384o777j2267
2998.2I7400337q082j371k694j1319j6814j3096o097o402j4990k1291j7816r978q493
3024.7I7261894j4961j9854j6028q267o908j3787j9735j7428j0848r579j6469k3192
3049.2I7084838k1338j4168j1736j7149k2673k0463j3375j0997j7005k4021k3532j6975
3073.7I6871406j3405j7631k3818k3204j6582j3292j7417k3132k3151j8066j5390j9908
3098.2I6646410k6965k7954k2108j8000k1732k8599k9951k4700k0337k3180k9499l1459
3122.6I6341926k7198k3454k6441l2997l5059l0619k6161k8157l4362l7080l3438k8652
$$ plain form
2945.2 97241431 97244281 97251093 97262460 97270006 97269309 97266912 97272378 97286135 97299135 97305650 97311324 97325248 97347265
2971.7 97347265 97367507 97378188 97382879 97391146 97405165 97416341 97417694 97413421 97412515 97416997 97419381 97412604 97400337
2998.2 97400337 97392255 97390884 97388190 97376871 97360057 97346961 97340864 97334462 97319472 97298181 97280365 97270387 97261894
3024.7 97261894 97246933 97227079 97211051 97202784 97195876 97182089 97162354 97144926 97134078 97124499 97108030 97084838
3049.2 97084838 97063500 97049332 97037596 97020447 96997774 96977311 96963936 96952939 96935934 96911913 96888381 96871406
3073.7 96871406 96858001 96840370 96816552 96793348 96776766 96763474 96746057 96722925 96699774 96681708 96666318 96646410
3098.2 96646410 96619445 96591491 96569383 96551383 96529651 96501052 96471101 96446401 96426064 96402884 96373385 96341926
3122.6 96341926 96314728 96291274 96264833 96231836 96196777 96166158 96139997 96111840 96077478 96040398 96006960 95978308
3147.1I5978308k9785l6436m0615l7866l3838l6037m3273m7678m5562m1633m2701m8912
3171.6I5493972n3525n1945m7600m7768n4031n9390n7596n2226n1993n8103o3616o2632
3196.1I4833547n7536n6047o1011o6376o5559o0397n8508o3384o9463o9428o3884o0910
3220.5I4081044o5207p1258p1358o6465o4189o8038p2998p2515o6853o2758o4653o8718
3245I3266034o7711o0665n4330n4520n8473n7744n0921m5734m7350n1517n1558m6706
3269.5I2618805m2718m5056n1587n4569n1671m9245n3001o0844o5643o3723o0642o4122
3294I1955984p2998p9733q0878q0651q5211r4866j02759j03682j02693j07646j17689
3316.4I0927178j25361j26564j25140j28049j36656j45059j48148j48558j52421j60611
$$ plain form
3147.1 95978308 95948523 95912087 95871472 95833606 95799768 95763731 95720458 95672780 95627218 95585585 95542884 95493972
3171.6 95493972 95440447 95388502 95340902 95293134 95239103 95179713 95122117 95069891 95017898 94959795 94896179 94833547
3196.1 94833547 94776011 94719964 94658953 94592577 94527018 94466621 94408113 94344729 94275266 94205838 94141954 94081044
3220.5 94081044 94015837 93944579 93873221 93806756 93742567 93674529 93601531 93529016 93462163 93399405 93334752 93266034
3245 93266034 93198323 93137658 93083328 93028808 92970335 92912591 92861670 92815936 92768586 92717069 92665511 92618805
3269.5 92618805 92576087 92531031 92479444 92424875 92373204 92323959 92270958 92210114 92144471 92080748 92020106 91955984
3294 91955984 91882986 91803253 91722375 91641724 91556513 91461647 91358888 91255206 91152513 91044867 90927178
3316.4 90927178 90801817 90675253 90550113 90422064 90285408 90140349 89992201 89843643 89691222 89530611
3336.8H9530611j68067j70648Tj74410j83659j92911j96379j95217j95819k01649k08890
3359.2H7472314k11364k08915k07746k10398k12205k08544k00630j92946j88267j84822
3379.6H5446477j78099j66142j53184j45113j41722j37115j28638j21081j18917j19043
3400H4037423j15526j07991j01364r9122r9326r6470q7416p6240o8510o3836n7060
3422.5H3064562m6021l4678k7066k2441j5718m363P325J3930J6618K1940L3695M6795
3446.9H3054578N3889N6076O1011P1550Q1581Q5067Q3590Q3500Q8108R3978R5517R2333
3471.4H4000778Q9681R2548R8730J00451R6453R4324R8598J04904J07014J04356J01727
3493.8H5089564J03933J09887J13684J12808J11204J13624J19669J24407J23298J20026
$$ plain form
3336.8 89530611 89362544 89191896 89021248 88846838 88663179 88470268 88273889 88078672 87882853 87681204 87472314
3359.2 87472314 87260950 87052035 86844289 86633891 86421686 86213142 86012512 85819566 85631299 85446477
3379.6 85446477 85268378 85102236 84949052 84803939 84662217 84525102 84396464 84275383 84156466 84037423
3400 84037423 83921897 83813906 83712542 83613420 83514094 83417624 83330208 83253968 83185458 83121622 83064562
3422.5 83064562 83018541 82983863 82956797 82934356 82918638 82914275 82921600 82935530 82952148 82974088 83007783 83054578
3446.9 83054578 83108467 83164543 83225554 83297104 83378685 83463752 83547342 83630842 83718950 83812928 83908445 84000778
3471.4 84000778 84090459 84183007 84281737 84382188 84478641 84572965 84671563 84776467 84883481 84987837 85089564
3493.8 85089564 85193497 85303384 85417068 85529876 85641080 85754704 85874373 85998780 86122078 86242104
3514.2H6242104J22010J28591J33068J32823J30593J31351J36298J39976J38694J35338
3534.6H7570846J34611J38402J42974J43105J39838J41257J47963J47617J38592J34063
3555H8979268J37615J45257J51676J53428J54245J60623J71279J77086J75339J74439
3575.4I0580255J76823J80119J79512J70493J62607J68139J80524J87838J88882J90431
3595.8I2365623J97714K11781K20114K11382K00618K01070K03115J93727J72257J55205
3616.2I4332606J47444J49870J56474J57147J56790J64944J77801J80405J63979J47146
3636.6I5934606J42985J42020J35654J20360J03265R9999J04415J07038J02133R4431
3657I7086906Q3650O7705N2106L2252J5300J5092K0135J9288J6630J6838K0754L0953
$$ plain form
3514.2 86242104 86364114 86492705 86625773 86758596 86889189 87020540 87156838 87296814 87435508 87570846
3534.6 87570846 87705457 87843859 87986833 88129938 88269776 88411033 88558996 88706613 88845205 88979268
3555 88979268 89116883 89262140 89413816 89567244 89721489 89882112 90053391 90230477 90405816 90580255
3575.4 90580255 90757078 90937197 91116709 91287202 91449809 91617948 91798472 91986310 92175192 92365623
3595.8 92365623 92563337 92775118 92995232 93206614 93407232 93608302 93811417 94005144 94177401 94332606
3616.2 94332606 94480050 94629920 94786394 94943541 95100331 95265275 95443076 95623481 95787460 95934606
3636.6 95934606 96077591 96219611 96355265 96475625 96578890 96678889 96783304 96890342 96992475 97086906
3657 97086906 97170556 97238261 97290367 97322619 97337919 97353011 97373146 97392434 97409064 97425902 97446656 97477609
3681.5I7477609M2766M4060L5244K9844K5225J9669J5247J2637K1201L7980N0288M9758
3706I7861528L9137K5803J6957J5140J2743r71k2954l2568k4581j4240j3810m983K3794
3732.5I7880995M8149N5820N6606N5635N3120N3572N8485N6803M3022K9082K9474L8517
3756.9I8459280M0471L1889K6083K6625K2286J4377J1152J1349J2987J7727K2316J9479
3781.4I8716021J3411O812J121o02n090r030m882M756R597O318K915L93L546R782R924
3812I8764992Q005Q785Q607Q750N746k122j234P952J4782J7243K0033J6618j007p397
3840.6I8869753j621M792J1587J5718J8167J6320N716j728O25R460K0557K6077K5672
3867.1I9021095J6648M553Q381J4865J5903J9324K4020K5177J7512M470k288p99M995
$$ plain form
3681.5 97477609 97520375 97564435 97599679 97629523 97654748 97674417 97689664 97702301 97723502 97761482 97811770 97861528
3706 97861528 97900665 97926468 97943425 97958565 97971308 97970337 97947383 97914815 97890234 97875994 97862184 97857201 97880995
3732.5 97880995 97929144 97984964 98041570 98097205 98150325 98203897 98262382 98319185 98362207 98391289 98420763 98459280
3756.9 98459280 98499751 98531640 98557723 98584348 98606634 98621011 98632163 98643512 98656499 98674226 98696542 98716021
3781.4 98716021 98729432 98736244 98737365 98736763 98731673 98722643 98717761 98722517 98732114 98738432 98741347 98741740 98745286 98755068 98764992
3812 98764992 98772997 98781782 98790389 98799139 98804885 98802763 98801529 98809481 98824263 98841506 98861539 98878157 98877150 98869753
3840.6 98869753 98868132 98872924 98884511 98900229 98918396 98934716 98940432 98938704 98939329 98948789 98969346 98995423 99021095
3867.1 99021095 99037743 99042296 99050677 99065542 99081445 99100769 99124789 99149966 99167478 99171948 99169660 99168861 99173856
3893.6I9173856R328J1390J6404J9145J7923J8179J7482J9467K7722L1048K2310R400
3918.1I9393654L141N305J0949J3525J4376J8197K0636J7392J3036J2320J4281J6839
3942.5I9553651J8048J5062J0961J3018J9431K2310J9884J5748J4746J7369J7702J4252
3967I9752182J2380J4543J7739J7976J5062J2589J3804J6278J6332J5420J6469J9192
3991.5I9939966K0653K0224J9157
3997.6A00000000
$$ plain form
3893.6 99173856 99183184 99194574 99210978 99230123 99248046 99266225 99283707 99303174 99330896 99361944 99384254 99393654
3918.1 99393654 99396795 99402100 99413049 99426574 99440950 99459147 99479783 99497175 99510211 99522531 99536812 99553651
3942.5 99553651 99571699 99586761 99597722 99610740 99630171 99652481 99672365 99688113 99702859 99720228 99737930 99752182
3967 99752182 99764562 99779105 99796844 99814820 99829882 99842471 99856275 99872553 99888885 99904305 99920774 99939966
3991.5 99939966 99960619 99980843 100000000
3997.6 100000000
##END=$$ End of the data block
