##TITLE=AD 11 $$ Begin of the data block
##JCAMP-DX=5.00 $$ ACD/SpecManager v 10.08
##SPECTROMETER/DATA SYSTEM=Alpha
##DATE=17 Dec 2014 10:47:54
##DATA TYPE=INFRARED SPECTRUM
##DATA CLASS=XYDATA
##ORIGIN=
##OWNER=
##NPOINTS=1765
##FIRSTX=399.76428223
##LASTX=3997.64306641
##MAXX=3997.64306641
##MINX=399.76428223
##MAXY=1.00000000
##MINY=0.34639901
##XFACTOR=1.0000000000
##YFACTOR=0.000000010000000
##FIRSTY=1.00000000
##DELTAX=2.03961372
##XUNITS=1/CM
##YUNITS=ARBITRARY UNITS
##XYDATA=(X++(Y..Y))
$$ plain form
399.8 100000000 98858917 97719622 96574855 95443130 94323325 93195754 92059416 90939939
416.1 90939939 89840204 88750726 87679964 86641145 85643423 84674311 83732396 82839835 82005483
434.4 82005483 81206399 80429643 79701144 79040384 78441000 77883255 77357602 76873761 76444316 76064813
454.8 76064813 75733620 75463969 75250620 75078797 74947566 74861288 74820793 74816376 74838006 74891263 74977547
477.3 74977547 75079173 75188315 75322777 75494987 75692284 75898939 76114130 76344377 76592326 76854670
497.7 76854670 77127665 77415812 77724051 78043067 78360701 78678060 79012781 79375190 79757190 80152482
518.1 80152482 80564028 80987579 81414849 81849825 82306731 82789618 83288455 83799797 84326857 84866297
538.5 84866297 85414100 85971433 86543822 87134355 87735254 88332558 88919890 89501417 90084803 90670288
$$ packed form
399.8A00000000j141083j139295j144767j131725j119805j127571j136338j119477
416.1I0939939j099735j089478j070762j038819r97722r69112r41915q92561q34352
434.4H2005483p99084p76756p28499o60760n99384n57745n25653m83841m29445l79503
454.8G6064813l31193k69651k13349j71823j31231q6278m0495m417K1630N3257Q6284
477.3G4977547J01626J09142J34462J72210J97297K06655K15191K30247K47949K62344
497.7G6854670K72995K88147L08239L19016L17634L17359L34721L62409L82000L95292
518.1H0152482M11546M23551M27270M34976M56906M82887M98837N11342N27060N39440
538.5H4866297N47803N57333N72389N90533O00899N97304N87332N81527N83386N85485
$$ plain form
558.9 90670288 91255319 91839892 92424995 93009299 93584168 94144678 94698161 95245749 95778191 96291661
579.3 96291661 96783084 97247851 97683173 98086619 98458827 98799443 99105501 99372435 99596602 99778032
599.6 99778032 99911100 99984986 99984986 99984986 99984986 99984986 99984986 99984986 99984986 99984986 99984986 99984986 99984986 99984986 99984986 99984986 99959445 99974447 99909365 99802232 99655479 99475187 99259317 98998183
648.6 98998183 98698801 98383749 98039079 97651029 97230607 96783048 96310502 95816785 95307088 94786644
669 94786644 94256002 93712312 93157578 92596924 92031997 91464484 90903604 90352219 89791292 89226174
689.4 89226174 88671744 88127935 87599111 87087816 86592501 86114550 85656381 85215819 84785402 84359926
709.8 84359926 83939123 83518255 83088797 82649642 82206774 81761551 81308496 80844307 80372286 79895920
730.2 79895920 79414535 78927511 78437322 77946234 77451521 76950479 76444817 75938988 75437605 74943215
$$ packed form
558.9I0670288N85031N84573N85103N84304N74869N60510N53483N47588N32442N13470
579.3I6291661M91423M64767M35322M03446L72208L40616L06058K66934K24167J81430
599.6I9778032J33068P3886%S4k5541J5002o5082j07133j46753j80292k15870k61134
648.6I8998183k99382l15052l44670l88050m20422m47559m72546m93717n09697n20444
669I4786644n30642n43690n54734n60654n64927n67513n60880n51385n60927n65118
689.4H9226174n54430n43809n28824n11295m95315m77951m58169m40562m30417m25476
709.8H4359926m20803m20868m29458m39155m42868m45223m53055m64189m72021m76366
730.2G9895920m81385m87024m90189m91088m94713n01042n05662n05829n01383m94390
$$ plain form
750.6 74943215 74458414 73989087 73541278 73117316 72719193 72351182 72019094 71726334 71473253 71261168
771 71261168 71093988 70973557 70896631 70858765 70859563 70901406 70983618 71101469 71249151 71423227 71621835
793.4 71621835 71839941 72070307 72308046 72546953 72776496 72985440 73162085 73293853 73366666 73366058 73281151
815.8 73281151 73103309 72822005 72427964 71919280 71302825 70587021 69777894 68886286 67930204 66929245
836.2 66929245 65899950 64855939 63811678 62783271 61782014 60812718 59878069 58980471 58121610
854.6 58121610 57299387 56509560 55750239 55021387 54321647 53647637 52996713 52368528 51763129 51177949
875 51177949 50610429 50060236 49527645 49011290 48507714 48015040 47534457 47066739 46611050 46167064
895.4 46167064 45735431 45316139 44907463 44509137 44123614 43751460 43390530 43039653 42699993 42373088
$$ packed form
750.6G4943215m84801m69327m47809m23962l98123l68011l32088k92760k53081k12085
771G1261168j67180j20431p6926l7866P98M1843Q2212J17851J47682J74076J98608
793.4G1621835K18106K30366K37739K38907K29543K08944J76645J31768P2813o08q4907
815.8G3281151j77842k81304l94041n08684o16455p15804q09127q91608r56082j000959
836.2F6929245j029295j044011j044261j028407j001257r69296r34649q97598q58861
854.6E8121610q22223p89827p59321p28852o99740o74010o50924o28185o05399n85180
875E1177949n67520n50193n32591n16355n03576m92674m80583m67718m55689m43986
895.4D6167064m31633m19292m08676l98326l85523l72154l60930l50877l39660l26905
$$ plain form
915.8 42373088 42059091 41757143 41466305 41185731 40914690 40651786 40394938 40143546 39898247 39658928
936.2 39658928 39424402 39193967 38968685 38749287 38534629 38324630 38120580 37922162 37728128 37538394
956.6 37538394 37354052 37176216 37005079 36839959 36679593 36523256 36372048 36227190 36088526 35955414
977 35955414 35828063 35707748 35594168 35486069 35384715 35291526 35205296 35124710 35050347 34983039 34921917
999.4 34921917 34865409 34814340 34770626 34733853 34702170 34675220 34655064 34643474 34639901 34642971 34652883 34670407
1023.9 34670407 34695920 34729713 34772432 34824386 34885228 34954464 35030934 35114503 35207057 35309342 35419944
1046.3 35419944 35537776 35662526 35793209 35928389 36067864 36212754 36362281 36514014 36666501 36820292
1066.7 36820292 36976555 37134856 37294030 37454006 37614882 37775099 37933210 38088906 38242534 38394487
$$ packed form
915.8D2373088l13997l01948k90838k80574k71041k62904k56848k51392k45299k39319
936.2C9658928k34526k30435k25282k19398k14658k09999k04050j98418j94034j89734
956.6C7538394j84342j77836j71137j65120j60366j56337j51208j44858j38664j33112
977C5955414j27351j20315j13580j08099j01354r3189q6230q0586p4363o7308o1122
999.4C4921917n6508n1069m3714l6773l1683k6950k0156j1590l573L070R912J7524
1023.9C4670407K5513L3793M2719N1954O0842O9236P6470Q3569R2554J02285J10602
1046.3C5419944J17832J24750J30683J35180J39475J44890J49527J51733J52487J53791
1066.7C6820292J56263J58301J59174J59976J60876J60217J58111J55696J53628J51953
$$ plain form
1087.1 38394487 38544738 38692123 38835469 38975006 39111102 39243847 39373571 39500806 39626175 39750192
1107.5 39750192 39872777 39993587 40112600 40229309 40343788 40457886 40573165 40689197 40805393 40922001
1127.9 40922001 41040081 41160035 41279972 41398978 41518834 41640648 41762620 41882816 42001161 42118728
1148.3 42118728 42235988 42352322 42467144 42581692 42698017 42816648 42937070 43058923 43183145 43311417
1168.7 43311417 43443927 43579823 43719020 43861538 44006154 44151664 44297713 44444412 44591877 44740713
1189.1 44740713 44891781 45045739 45202932 45363674 45529407 45701760 45880932 46065980 46256298 46452281
1209.5 46452281 46654984 46864659 47080812 47303280 47532412 47768539 48010948 48258823 48512173 48771107
1229.9 48771107 49034980 49302065 49570552 49839100 50106710 50372624 50636518 50897658 51155144 51408118
$$ packed form
1087.1C8394487J50251J47385J43346J39537J36096J32745J29724J27235J25369J24017
1107.5C9750192J22585J20810J19013J16709J14479J14098J15279J16032J16196J16608
1127.9D0922001J18080J19954J19937J19006J19856J21814J21972J20196J18345J17567
1148.3D2118728J17260J16334J14822J14548J16325J18631J20422J21853J24222J28272
1168.7D3311417J32510J35896J39197J42518J44616J45510J46049J46699J47465J48836
1189.1D4740713J51068J53958J57193J60742J65733J72353J79172J85048J90318J95983
1209.5D6452281K02703K09675K16153K22468K29132K36127K42409K47875K53350K58934
1229.9D8771107K63873K67085K68487K68548K67610K65914K63894K61140K57486K52974
$$ plain form
1250.3 51408118 51656389 51900089 52139145 52374053 52605700 52834511 53060848 53285158 53507638 53728694
1270.7 53728694 53948522 54167420 54385924 54603601 54819089 55032188 55243987 55454057 55661511 55867124
1291.1 55867124 56071973 56276125 56478572 56678325 56876040 57072961 57268572 57461572 57651651 57839590
1311.5 57839590 58025509 58208734 58388370 58564663 58738989 58909667 59072834 59227926 59377229 59521639
1331.9 59521639 59660566 59793383 59920466 60041499 60155714 60264271 60368198 60464150 60549349 60624617
1352.3 60624617 60689485 60743600 60787278 60818523 60837370 60847116 60848027 60835749 60808295 60768759 60724306 60683966
1376.7 60683966 60650706 60620344 60594022 60574323 60561353 60557520 60561681 60570830 60586214 60607141 60628581 60650378
1401.2 60650378 60675591 60702270 60733378 60774934 60826445 60883611 60943156 61005020 61076021 61156958 61240286 61326510
$$ packed form
1250.3E1408118K48271K43700K39056K34908K31647K28811K26337K24310K22480K21056
1270.7E3728694K19828K18898K18504K17677K15488K13099K11799K10070K07454K05613
1291.1E5867124K04849K04152K02447J99753J97715J96921J95611J93000J90079J87939
1311.5E7839590J85919J83225J79636J76293J74326J70678J63167J55092J49303J44410
1331.9E9521639J38927J32817J27083J21033J14215J08557J03927R5952Q5199P5268
1352.3F0624617O4868N4115M3678L1245J8847R746R11j2278k7454l9536m4453m0340
1376.7F0683966l3260l0362k6322j9699j2970l833M161R149J5384K0927K1440K1797
1401.2F0650378K5213K6679L1108M1556N1511N7166N9545O1864P1001Q0937Q3328Q6224
$$ plain form
1425.7 61326510 61420339 61523807 61637837 61761737 61890733 62022257 62163705 62314743 62465519 62618244
1446.1 62618244 62777919 62947446 63129085 63322651 63528454 63748032 63981605 64229774 64492327 64766127
1466.5 64766127 65051270 65351176 65664655 65976644 66277266 66578078 66885829 67193514 67494607 67792898
1486.9 67792898 68096292 68406749 68707693 68994874 69275546 69556183 69839841 70126992 70416445 70698428
1507.3 70698428 70970690 71239418 71504122 71764177 72023845 72283083 72546166 72817314 73076135 73313308
1527.7 73313308 73536772 73754448 73969740 74181634 74387175 74582475 74780935 74981505 75160080 75325227
1548.1 75325227 75485992 75644135 75807029 75970387 76123619 76267755 76401627 76524514 76643026 76758522
1568.5 76758522 76871490 76985908 77103800 77205801 77278364 77341044 77399170 77452338 77495825 77524304 77546972
$$ packed form
1425.7F1326510R3829J03468J14030J23900J28996J31524J41448J51038J50776J52725
1446.1F2618244J59675J69527J81639J93566K05803K19578K33573K48169K62553K73800
1466.5F4766127K85143K99906L13479L11989L00622L00812L07751L07685L01093K98291
1486.9F7792898L03394L10457L00944K87181K80672K80637K83658K87151K89453K81983
1507.3G0698428K72262K68728K64704K60055K59668K59238K63083K71148K58821K37173
1527.7G3313308K23464K17676K15292K11894K05541J95300J98460K00570J78575J65147
1548.1G5325227J60765J58143J62894J63358J53232J44136J33872J22887J18512J15496
1568.5G6758522J12968J14418J17892J02001P2563O2680N8126N3168M3487K8479K2668
$$ plain form
1590.9 77546972 77564985 77562243 77541041 77519494 77502221 77472001 77427757 77382064 77336121 77288818 77239388 77183801
1615.4 77183801 77129436 77089661 77059954 77036172 77026731 77041459 77093881 77183700 77291626 77417892 77582002
1637.8 77582002 77764976 77953482 78153551 78368384 78589559 78817385 79058623 79300195 79530752 79761422
1658.2 79761422 79996377 80225724 80437630 80641890 80859113 81059039 81213951 81347275 81474680 81604743
1678.6 81604743 81735003 81862795 81992376 82104033 82194084 82277763 82351166 82412016 82474685 82554269 82646048
1701.1 82646048 82713920 82756180 82793403 82835561 82888693 82947844 83007979 83074248 83129638 83173150 83218694 83268136
1725.5 83268136 83324462 83394295 83482248 83583122 83672708 83746719 83824074 83908606 83997190 84091222 84184486
1748 84184486 84273607 84349585 84416872 84491235 84560376 84614104 84663290 84716552 84771484 84820831 84864199 84909445
$$ packed form
1590.9G7546972J8013k742k1202k1547j7273l0220m4244m5693m5943m7303m9430n5587
1615.4G7183801n4365l9775k9707k3782r441J4728N2422Q9819J07926J26266J64110
1637.8G7582002J82974J88506K00069K14833K21175K27826K41238K41572K30557K30670
1658.2G9761422K34955K29347K11906K04260K17223J99926J54912J33324J27405J30063
1678.6H1604743J30260J27792J29581J11657R0051Q3679P3403O0850O2669P9584R1779
1701.1H2646048O7872M2260L7223M2158N3132N9151O0135O6269N5390M3512M5544M9442
1725.5H3268136N6326O9833Q7953J00874Q9586P4011P7355Q4532Q8584R4032R3264
1748H4184486Q9121P5978O7287P4363O9141N3728M9186N3262N4932M9347M3368M5246
$$ plain form
1772.4 84909445 84963346 85026479 85087657 85139066 85192269 85256159 85324812 85390234 85445476 85497308 85556829 85621405
1796.9 85621405 85685652 85750937 85817146 85886019 85964578 86047506 86122513 86196160 86272073 86342025 86405402 86467993
1821.4 86467993 86532176 86600471 86676192 86751479 86819154 86883265 86947215 87013650 87085223 87159598 87233031 87305045
1845.9 87305045 87371635 87435442 87506628 87579733 87645459 87709260 87776017 87837827 87892526 87947357 88004118 88062072
1870.3 88062072 88122606 88184255 88242912 88299894 88357902 88417971 88478208 88531595 88578385 88626885 88680083 88734955
1894.8 88734955 88789308 88844651 88903707 88964671 89024842 89082259 89134675 89185178 89236307 89288306 89341927 89397424
1919.3 89397424 89454252 89513350 89576632 89641523 89704823 89768827 89835191 89900392 89963371 90025848 90087312 90149134
1943.8 90149134 90212703 90277290 90343475 90411115 90478700 90547389 90618521 90689540 90758628 90827769 90897864 90968704
$$ packed form
1772.4H4909445N3901O3133O1178N1409N3203O3890O8653O5422N5242N1832N9521O4576
1796.9H5621405O4247O5285O6209O8873P8559Q2928P5007P3647P5913O9952O3377O2591
1821.4H6467993O4183O8295P5721P5287O7675O4111O3950O6435P1573P4375P3433P2014
1845.9H7305045O6590O3807P1186P3105O5726O3801O6757O1810N4699N4831N6761N7954
1870.3H8062072O0534O1649N8657N6982N8008O0069O0237N3387M6790M8500N3198N4872
1894.8H8734955N4353N5343N9056O0964O0171N7417N2416N0503N1129N1999N3621N5497
1919.3H9397424N6828N9098O3282O4891O3300O4004O6364O5201O2979O2477O1464O1822
1943.8I0149134O3569O4587O6185O7640O7585O8689P1132P1019O9088O9141P0095P0840
$$ plain form
1968.3 90968704 91040212 91112334 91185361 91258776 91330683 91401118 91471350 91540611 91609114 91678602 91749036 91818953
1992.7 91818953 91887891 91955888 92023450 92091149 92158806 92225993 92292303 92355025 92410380 92460024 92508543 92557925
2017.2 92557925 92608964 92661935 92716742 92773074 92830521 92889214 92950064 93012667 93074775 93135208 93193710 93249011
2041.7 93249011 93300039 93348992 93398821 93449706 93500495 93550706 93600404 93649530 93697977 93745875 93793815 93842196
2066.2 93842196 93891013 93940139 93989855 94040543 94092423 94145530 94199723 94254118 94308084 94361997 94415933 94469863
2090.6 94469863 94524252 94579053 94633776 94688398 94742852 94797117 94851542 94906253 94961268 95016515 95071691 95126498
2115.1 95126498 95181000 95235306 95289803 95344943 95400518 95456034 95511431 95566988 95622450 95677602 95732927 95788527
2139.6 95788527 95843679 95897698 95950788 96003675 96056390 96108365 96159345 96209574 96259665 96309966 96360022 96409523
$$ packed form
1968.3I0968704P1508P2122P3027P3415P1907P0435P0232O9261O8503O9488P0434O9917
1992.7I1818953O8938O7997O7562O7699O7657O7187O6310O2722N5355M9644M8519M9382
2017.2I2557925N1039N2971N4807N6332N7447N8693O0850O2603O2108O0433N8502N5301
2041.7I3249011N1028M8953M9829N0885N0789N0211M9698M9126M8447M7898M7940M8381
2066.2I3842196M8817M9126M9716N0688N1880N3107N4193N4395N3966N3913N3936N3930
2090.6I4469863N4389N4801N4723N4622N4454N4265N4425N4711N5015N5247N5176N4807
2115.1I5126498N4502N4306N4497N5140N5575N5516N5397N5557N5462N5152N5325N5600
2139.6I5788527N5152N4019N3090N2887N2715N1975N0980N0229N0091N0301N0056M9501
$$ plain form
2164.1 96409523 96458876 96508700 96558863 96609080 96659118 96709055 96759027 96808374 96856779 96904665 96951860 96998161
2188.5 96998161 97044301 97090256 97135442 97179830 97223723 97267121 97310007 97352523 97394609 97435927 97476465 97516322
2213 97516322 97555655 97594607 97632974 97671092 97709244 97746599 97782588 97817492 97851419 97884399 97917002 97949648
2237.5 97949648 97982305 98014826 98046929 98078626 98110390 98142660 98174769 98205918 98236066 98265320 98293573 98320693
2262 98320693 98346597 98371458 98395395 98418105 98439741 98461342 98484057 98507881 98532534 98558074 98584253 98610878
2286.4 98610878 98637849 98665327 98694199 98725408 98758882 98793352 98827791 98863655 98903787 98949152 98997694 99047488
2310.9 99047488 99099249 99153817 99210227 99266386 99320084 99370337 99418402 99466705 99512398 99540490 99541122 99522376
2335.4 99522376 99500102 99484169 99479675 99493098 99528503 99584305 99655181 99733955 99813616 99887955 99950552 99992460
$$ packed form
2164.1I6409523M9353M9824N0163N0217N0038M9937M9972M9347M8405M7886M7195M6301
2188.5I6998161M6140M5955M5186M4388M3893M3398M2886M2516M2086M1318M0538L9857
2213I7516322L9333L8952L8367L8118L8152L7355L5989L4904L3927L2980L2603L2646
2237.5I7949648L2657L2521L2103L1697L1764L2270L2109L1149L0148K9254K8253K7120
2262I8320693K5904K4861K3937K2710K1636K1601K2715K3824K4653K5540K6179K6625
2286.4I8610878K6971K7478K8872L1209L3474L4470L4439L5864M0132M5365M8542M9794
2310.9I9047488N1761N4568N6410N6159N3698N0253M8065M8303M5693K8092O32j8746
2335.4I9522376k2274j5933m494J3423L5405N5802P0876P8774P9661P4339O2597M1908
$$ plain form
2359.9 99992460 99953216 99960756 99880081 99776101 99664551 99554765 99454153 99368858 99301094 99251235 99218827
2382.3 99218827 99201834 99196702 99199557 99207413 99218148 99229318 99239278 99247956 99255633 99262625 99268919 99274182 99278760 99283236
2410.8 99283236 99287379 99290586 99292964 99294823 99296439 99297822 99298853 99299765 99301499 99304223 99307007 99309486 99312079 99315101 99318087
2441.4 99318087 99320310 99321592 99322587 99323827 99325144 99326098 99326670 99326944 99326974 99326879 99326777 99326533 99325824 99324697 99323404 99322236 99321181
2476.1 99321181 99320030 99318916 99318153 99317622 99317169 99316794 99316514 99316239 99315470 99313903 99311984 99310225 99308801 99307531 99306220 99304628
2508.7 99304628 99302697 99300414 99297827 99295217 99292815 99290329 99287415 99284112 99280554 99277008 99273878 99271393 99269086 99266320
2537.3 99266320 99263102 99259740 99256253 99252433 99248123 99243325 99237931 99232018 99226409 99221712 99217176 99212152 99207187 99202693
2565.8 99202693 99197978 99192458 99186540 99180490 99173850 99166179 99157602 99148935 99140465 99131525 99122190 99113184 99104482 99095708
$$ packed form
2359.9I9992460l9244P540q0675j03980j11550j09786j00612q5295o7764m9859l2408
2382.3I9218827j6993n132K855P856J0735J1170R960Q678P677O992O294N263M578M476
2410.8I9283236M143L207K378J859J616J383J031R12J734K724K784K479K593L022K986
2441.4I9318087K223J282R95J240J317R54N72K74L0r5j02k44p09j127j293j168j055
2476.1I9321181j151j114p63n31m53l75k80k75p69j567j919j759j424j270j311j592
2508.7I9304628j931k283k587k610k402k486k914l303l558l546l130k485k307k766
2537.3I9266320l218l362l487l820m310m798n394n913n609m697m536n024m965m494
2565.8I9202693m715n520n918o050o640p671q577q667q470q940r335r006q702q774
$$ plain form
2594.4 99095708 99086869 99078041 99069107 99059886 99050248 99040526 99031156 99021930 99012446 99002802 98992753 98982126 98971438 98960990
2623 98960990 98950660 98940504 98930323 98919672 98908454 98896974 98885846 98874855 98863238 98850882 98838598 98826760
2647.4 98826760 98814797 98802793 98791420 98780763 98770499 98760462 98750681 98741394 98731756 98721129 98710459 98700202
2671.9 98700202 98689812 98679376 98669732 98661304 98653543 98645920 98638648 98631746 98624903 98617536 98609400 98600560 98590970 98581040
2700.5 98581040 98571289 98561102 98550147 98539042 98527914 98516470 98504776 98493248 98482138 98471123 98459792 98448652
2724.9 98448652 98438609 98430109 98422509 98414743 98406309 98397654 98389047 98380417 98371589 98362821 98354369 98345965 98337364 98328662
2753.5 98328662 98319983 98311287 98302424 98293245 98283178 98271745 98259789 98248482 98237956 98227274 98215830 98204112
2778 98204112 98192871 98181772 98169869 98157281 98144633 98132044 98119563 98106796 98093218 98079377 98065978 98052567
$$ packed form
2594.4I9095708q839q828q934r221r638r722r370r226r484r644j0049j0627j0688j0448
2623I8960990j0330j0156j0181j0651j1218j1480j1128j0991j1617j2356j2284j1838
2647.4I8826760j1963j2004j1373j0657j0264j0037r781r287r638j0627j0670j0257
2671.9I8700202j0390j0436r644q428p761p623p272o902o843p367q136q840r590r930
2700.5I8581040r751j0187j0955j1105j1128j1444j1694j1528j1110j1015j1331j1140
2724.9I8448652j0043q500p600p766q434q655q607q630q828q768q452q404q601q702
2753.5I8328662q679q696q863r179j0067j1433j1956j1307j0526j0682j1444j1718
2778I8204112j1241j1099j1903j2588j2648j2589j2481j2767j3578j3841j3399j3411
$$ plain form
2802.4 98052567 98038161 98022443 98006308 97990638 97975129 97959250 97943413 97928560 97914565 97900128 97884023 97866350
2826.9 97866350 97848010 97828841 97807413 97782165 97752672 97719282 97682703 97643709 97603494 97564101 97527671 97495532
2851.4 97495532 97468185 97445238 97426039 97410744 97399431 97390902 97383857 97377723 97372454 97367531 97361773 97354501 97346330
2877.9 97346330 97338182 97330022 97320986 97310251 97296995 97280610 97261584 97241092 97219712 97197074 97172087 97143686
2902.4 97143686 97111458 97075880 97037840 96998000 96956533 96913689 96871209 96831352 96796042 96768022 96750063 96742249
2926.8 96742249 96742326 96748382 96759927 96776474 96796227 96816826 96836454 96853799 96867019 96874160 96875799 96874148 96870643
2953.4 96870643 96866959 96864164 96862280 96862102 96864778 96870530 96879160 96890771 96905291 96921980 96939778 96957541 96974295
2979.9 96974295 96989602 97003192 97015047 97025353 97033501 97039497 97044182 97047150 97047037 97043931 97039133 97033620 97027832 97021556
$$ packed form
2802.4I8052567j4406j5718j6135j5670j5509j5879j5837j4853j3995j4437j6105j7673
2826.9I7866350j8340j9169k1428k5248k9493l3390l6579l8994m0215l9393l6430l2139
2851.4I7495532k7347k2947j9199j5295j1313q529p045o134n269m923n758p272q171
2877.9I7346330q148q160r036j0735j3256j6385j9026k0492k1380k2638k4987k8401
2902.4I7143686l2228l5578l8040l9840m1467m2844m2480l9857l5310k8020j7959p814
2926.8I6742249P7O056J1545J6547J9753K0599J9628J7345J3220P141J639j651l505
2953.4I6870643l684k795j884j78K676N752Q630J1611J4520J6689J7798J7763J6754
2979.9I6974295J5307J3590J1855J0306Q148N996M685K968j13l106m798n513n788o276
$$ plain form
3008.4 97021556 97014421 97006679 96998549 96989799 96979856 96968430 96956807 96946645 96937132 96925920 96912539 96898878 96885931
3034.9 96885931 96873415 96860969 96848267 96835446 96823072 96811122 96799195 96786177 96771884 96757531 96743631 96729141
3059.4 96729141 96713835 96698290 96682572 96665925 96647680 96628141 96607977 96587974 96569121 96552050 96535981 96519923
3083.9 96519923 96503586 96487612 96472442 96457285 96441156 96423650 96404868 96384656 96362531 96338552 96313715 96288985
3108.4 96288985 96265101 96241921 96218985 96196294 96173722 96151525 96129721 96107054 96083421 96059793 96035987 96011347
3132.8 96011347 95985514 95957834 95928550 95898706 95868677 95837998 95806432 95773941 95740449 95706230 95671254 95635444
3157.3 95635444 95599574 95563799 95526838 95487922 95447129 95404589 95360899 95316523 95271295 95225084 95177925 95129144
3181.8 95129144 95078552 95027131 94975328 94922447 94868141 94812775 94756889 94700998 94645149 94589227 94533050 94476372
$$ packed form
3008.4I7021556p135p742q130q750r943j1426j1623j0162r513j1212j3381j3661j2947
3034.9I6885931j2516j2446j2702j2821j2374j1950j1927j3018j4293j4353j3900j4490
3059.4I6729141j5306j5545j5718j6647j8245j9539k0164k0003j8853j7071j6069j6058
3083.9I6519923j6337j5974j5170j5157j6129j7506j8782k0212k2125k3979k4837k4730
3108.4I6288985k3884k3180k2936k2691k2572k2197k1804k2667k3633k3628k3806k4640
3132.8I6011347k5833k7680k9284k9844l0029l0679l1566l2491l3492l4219l4976l5810
3157.3I5635444l5870l5775l6961l8916m0793m2540m3690m4376m5228m6211m7159m8781
3181.8I5129144n0592n1421n1803n2881n4306n5366n5886n5891n5849n5922n6177n6678
$$ plain form
3206.3 94476372 94419307 94361979 94304085 94245344 94185394 94123620 94060004 93995500 93931091 93866849 93802619 93738073
3230.7 93738073 93672925 93607450 93542063 93477273 93413836 93351865 93291116 93231910 93174589 93119138 93065816 93014944
3255.2 93014944 92966431 92919534 92873031 92826629 92781126 92736810 92692620 92647719 92602229 92556173 92508781 92459321
3279.7 92459321 92407954 92355150 92300832 92244142 92184961 92123449 92058897 91991156 91920614 91847044 91769785 91688508
3304.2 91688508 91603553 91514802 91421324 91322684 91219515 91112298 91001236 90886259 90767533 90644801
3324.6 90644801 90517014 90383726 90245712 90103608 89957207 89806604 89652389 89494306 89331508 89164042
3345 89164042 88992369 88816851 88638008 88455391 88268149 88076437 87880707 87681746 87481093 87280196
3365.4 87280196 87079781 86880571 86683822 86491477 86305755 86127305 85955483 85790741 85633528 85483801
$$ packed form
3206.3I4476372n7065n7328n7894n8741n9950o1774o3616o4504o4409o4242o4230o4546
3230.7I3738073o5148o5475o5387o4790o3437o1971o0749n9206n7321n5451n3322n0872
3255.2I3014944m8513m6897m6503m6402m5503m4316m4190m4901m5490m6056m7392m9460
3279.7I2459321n1367n2804n4318n6690n9181o1512o4552o7741p0542p3570p7259q1277
3304.2I1688508q4955q8751r3478r8640j03169j07217j11062j14977j18726j22732
3324.6I0644801j27787j33288j38014j42104j46401j50603j54215j58083j62798j67466
3345H9164042j71673j75518j78843j82617j87242j91712j95730j98961k00653k00897
3365.4H7280196k00415j99210j96749j92345j85722j78450j71822j64742j57213j49727
$$ plain form
3385.7 85483801 85341811 85207129 85078776 84956378 84839439 84726793 84617651 84512717 84413111 84318811
3406.1 84318811 84228331 84139943 84054214 83973479 83898759 83830363 83769196 83715802 83670390 83632547 83602244 83580375
3430.6 83580375 83567238 83562493 83565474 83575404 83591872 83615601 83647782 83688200 83735156 83787555 83845216 83908433
3455.1 83908433 83976907 84048915 84123445 84201127 84281480 84362900 84445196 84529275 84614962 84702021 84791231 84881490
3479.6 84881490 84971070 85060591 85151869 85244697 85337341 85430110 85524535 85621285 85719949 85820007 85922170
3502 85922170 86027765 86136681 86248416 86363238 86479980 86596632 86714202 86834657 86956495 87077796
3522.4 87077796 87200147 87325251 87452751 87580818 87707525 87834096 87962478 88091218 88218969 88346761
3542.8 88346761 88474786 88602930 88735098 88872260 89006197 89133906 89261800 89394510 89531350 89670265
$$ packed form
3385.7H5483801j41990j34682j28353j22398j16939j12646j09142j04934r9606r4300
3406.1H4318811r0480q8388q5729q0735p4720o8396o1167n3394m5412l7843l0303k1869
3430.6H3580375j3137m745K981R930J6468K3729L2181M0418M6956N2399N7661O3217
3455.1H3908433O8474P2008P4530P7682Q0353Q1420Q2296Q4079Q5687Q7059Q9210R0259
3479.6H4881490Q9580Q9521R1278R2828R2644R2769R4425R6750R8664J00058J02163
3502H5922170J05595J08916J11735J14822J16742J16652J17570J20455J21838J21301
3522.4H7077796J22351J25104J27500J28067J26707J26571J28382J28740J27751J27792
3542.8H8346761J28025J28144J32168J37162J33937J27709J27894J32710J36840J38915
$$ plain form
3563.2 89670265 89811182 89956969 90110582 90270495 90430677 90591949 90759677 90934426 91113508 91292357
3583.6 91292357 91465586 91637093 91815400 92002267 92192942 92383742 92572403 92759395 92949396 93137169
3604 93137169 93312448 93481582 93656522 93841308 94024110 94195426 94358826 94519067 94679922 94840324
3624.4 94840324 94994336 95141172 95287001 95437276 95580238 95699394 95801663 95903581 96008921 96113175
3644.8 96113175 96205056 96284783 96365428 96454358 96545029 96631044 96719027 96804398 96879297 96940613 96978265 96999913
3669.2 96999913 97029680 97071737 97109336 97139657 97171587 97211695 97266608 97337168 97408158 97473925 97540879 97603154
3693.7 97603154 97659087 97705972 97741264 97773343 97809875 97845751 97870916 97887909 97901720 97917467 97943002 97977984
3718.2 97977984 98009485 98028928 98041761 98060638 98085272 98093635 98090523 98096406 98105627 98105943 98100966 98097140 98093778
$$ packed form
3563.2H9670265J40917J45787J53613J59913J60182J61272J67728J74749J79082J78849
3583.6I1292357J73229J71507J78307J86867J90675J90800J88661J86992J90001J87773
3604I3137169J75279J69134J74940J84786J82802J71316J63400J60241J60855J60402
3624.4I4840324J54012J46836J45829J50275J42962J19156J02269J01918J05340J04254
3644.8I6113175R1881P9727Q0645Q8930R0671Q6015Q7983Q5371P4899O1316L7652K1648
3669.2I6999913K9767M2057L7599L0321L1930M0108N4913P0560P0990O5767O6954O2275
3693.7I7603154N5933M6885L5292L2079L6532L5876K5165J6993J3811J5747K5535L4982
3718.2I7977984L1501J9443J2833J8877K4634Q363l112N883R221L16m977l826l362
$$ plain form
3744.7 98093778 98095697 98110199 98131812 98150933 98164093 98176312 98197818 98227751 98254919 98283362 98316228 98340255
3769.2 98340255 98352051 98362702 98375344 98386335 98400027 98418200 98438531 98461795 98477364 98484004 98490596 98494828
3793.7 98494828 98495013 98496938 98506945 98518538 98530036 98543012 98550749 98556799 98565459 98575181 98588324 98602629 98613638
3820.2 98613638 98628098 98640662 98643547 98644310 98649108 98655456 98664308 98691577 98723435 98731589 98727709 98726606 98734969 98749924
3848.7 98749924 98765409 98787630 98813421 98829287 98835075 98835075 98837626 98850083 98875374 98912680 98936433 98937958 98943001
3875.2 98943001 98956543 98971677 98986953 99006563 99033338 99057817 99069571 99071127 99072230 99080956 99094087 99109876
3899.7 99109876 99130303 99148196 99165452 99186683 99204683 99220639 99244249 99273795 99298590 99313283 99320102 99327469
3924.2 99327469 99341631 99359441 99379086 99402726 99425912 99443889 99459565 99475348 99490130 99505788 99524325 99542505
$$ packed form
3744.7I8093778J919J4502K1613J9121J3160J2219K1506K9933K7168K8443L2866K4027
3769.2I8340255J1796J0651J2642J0991J3692J8173K0331K3264J5569O640O592M232
3793.7I8494828J85J925J0007J1593J1498J2976P737O050Q660R722J3143J4305J1009
3820.2I8613638J4460J2564K885P63M798O348Q852K7269L1858Q154l880j103Q363J4955
3848.7I8749924J5485K2221K5791J5866N788%K551J2457K5291L7306K3753J525N043
3875.2I8943001J3542J5134J5276J9610K6775K4479J1754J556J103Q726J3131J5789
3899.7I9109876K0427J7893J7256K1231J8000J5956K3610K9546K4795J4693O819P367
3924.2I9327469J4162J7810J9645K3640K3186J7977J5676J5783J4782J5658J8537J8180
$$ plain form
3948.7 99542505 99557948 99574107 99594098 99617040 99639964 99660510 99680030 99699235 99716169 99731827 99748248 99765104
3973.1 99765104 99782020 99799418 99816841 99834251 99852043 99870622 99889970 99909866 99930865 99953157 99976385 100000000
3997.6 100000000
$$ packed form
3948.7I9542505J5443J6159J9991K2942K2924K0546J9520J9205J6934J5658J6421J6856
3973.1I9765104J6916J7398J7423J7410J7792J8579J9348J9896K0999K2292K3228K3615
3997.6A00000000
##END=$$ End of the data block
