##TITLE=AD 10 26g $$ Begin of the data block
##JCAMP-DX=5.00 $$ ACD/SpecManager v 10.08
##SPECTROMETER/DATA SYSTEM=Alpha
##DATE=16 Dec 2014 10:37:32
##DATA TYPE=INFRARED SPECTRUM
##DATA CLASS=XYDATA
##ORIGIN=
##OWNER=
##NPOINTS=1765
##FIRSTX=399.76428223
##LASTX=3997.64306641
##MAXX=3997.64306641
##MINX=399.76428223
##MAXY=1.00000000
##MINY=0.62196594
##XFACTOR=1.0000000000
##YFACTOR=0.000000010000000
##FIRSTY=1.00000000
##DELTAX=2.03961372
##XUNITS=1/CM
##YUNITS=ARBITRARY UNITS
##XYDATA=(X++(Y..Y))
$$ plain form
399.8 100000000 99398887 98784256 98195928 97668630 97208017 96794158 96401507 96015054 95630133 95236951
420.2 95236951 94815660 94347471 93828315 93277138 92713684 92128974 91502106 90851569 90213209 89593178
440.6 89593178 88993764 88410765 87839311 87289840 86774331 86294115 85840958 85413420 85029799 84706324
461 84706324 84439176 84205931 83986002 83784181 83618486 83492380 83394754 83310407 83233643 83173555 83134621
483.4 83134621 83105117 83075631 83055234 83060074 83095658 83151978 83214259 83280355 83369386 83502924 83678919 83880442
507.9 83880442 84103715 84368324 84689659 85061073 85468048 85907662 86392897 86938977 87544763 88189226
528.3 88189226 88856864 89554077 90295249 91075605 91865748 92640054 93401045 94164324 94920212 95638025
548.7 95638025 96297514 96902680 97470313 98000818 98470664 98861432 99182153 99455750 99688810 99863112
$$ packed form
399.8A00000000o01113o14631n88328n27298m60613m13859l92651l86453l84921l93182
420.2I5236951m21291m68189n19156n51177n63454n84710o26868o50537o38360o20031
440.6H9593178n99414n82999n71454n49471n15509m80216m53157m27538l83621l23475
461H4706324k67148k33245k19929k01821j65695j26106r7626q4347p6764o0088l8934
483.4H3134621k9504k9486k0397M840L5584N6320O2281O6096Q9031J33538J75995K01523
507.9H3880442K23273K64609L21335L71414M06975M39614M85235N46080O05786O44463
528.3H8189226O67638O97213P41172P80356P90143P74306P60991P63279P55888P17813
548.7I5638025O59489O05166N67633N30505M69846L90768L20721K73597K33060J74302
$$ plain form
569.1 99863112 99962318 99997902 99997902 99997902 99997902 99987048 99989146 99979621 99989021 99989021 99973226 99984205 99969810 99977040 99996477 99974936
601.7 99974936 99978465 99954802 99955469 99978149 99993205 99980927 99958199 99956864 99980849 99967521 99986672 99949557 99920708
628.2 99920708 99911761 99895805 99840361 99750048 99660271 99592048 99525940 99427193 99292111 99153984 99039096
650.6 99039096 98933870 98804146 98641181 98469275 98322034 98200059 98067820 97899848 97715163 97553152
671 97553152 97423887 97296226 97136831 96952021 96777719 96629643 96483773 96307611 96098983 95885718
691.4 95885718 95696688 95519584 95313996 95062685 94792801 94541174 94308084 94057143 93762046 93440628
711.8 93440628 93132913 92850494 92563516 92239386 91883355 91532999 91210467 90894300 90547013 90161532
732.2 90161532 89768958 89399558 89046121 88674426 88268477 87853545 87468094 87120104 86783320 86434519
$$ packed form
569.1I9863112R9206L5584%Uj0854K098r525R400%j5795J0979j4395P230J9437k1541
601.7I9974936L529k3663O67K2680J5056j2278k2728j335K3985j3328J9151l7115k8849
628.2I9920708q947j5956n5444r0313q9777o8223o6108r8747j35082j38127j14888
650.6I9039096j05226j29724j62965j71906j47241j21975j32239j67972j84685j62011
671I7553152j29265j27661j59395j84810j74302j48076j45870j76162k08628k13265
691.4I5885718j89030j77104k05588k51311k69884k51627k33090k50941k95097l21418
711.8I3440628l07715k82419k86978l24130l56031l50356l22532l16167l47287l85481
732.2I0161532l92574l69400l53437l71695m05949m14932l85451l47990l36784l48801
$$ plain form
752.6 86434519 86087179 85780889 85536939 85336012 85145915 84964639 84824419 84752822 84738785 84745842 84757215
775.1 84757215 84796518 84897387 85060155 85250115 85438573 85637957 85887092 86202711 86556864 86911047
795.4 86911047 87264693 87656420 88114989 88619894 89124185 89610183 90106982 90646911 91214979 91755921
815.8 91755921 92230880 92651647 93048060 93410599 93684751 93824196 93834198 93754202 93601364 93346971
836.2 93346971 92956942 92443103 91860825 91255015 90621161 89930427 89183676 88424408 87695593 86996770
856.6 86996770 86294919 85571969 84848970 84160286 83512014 82875448 82222223 81558853 80918342 80318266
877 80318266 79738665 79146391 78535044 77930903 77359205 76813972 76266897 75703245 75139505 74602842
897.4 74602842 74099350 73608476 73110527 72612441 72139448 71705085 71295488 70886785 70475531 70082819
$$ packed form
752.6H6434519l47340l06290k43950k00927j90097j81276j40220p1597j4037P057J1373
775.1H4757215L9303J00869J62768J89960J88458J99384K49135L15619L54153L54183
795.4H6911047L53646L91727M58569N04905N04291M85998M96799N39929N68068N40942
815.8I1755921M74959M20767L96413L62539K74152J39445J0002p9996j52838k54393
836.2I3346971l90029n13839n82278o05810o33854o90734p46751p59268p28815o98823
856.6H6996770p01851p22950p22999o88684o48272o36566o53225o63370o40511o00076
877H0318266n79601n92274o11347o04141n71698n45233n47075n63652n63740n36663
897.4G4602842n03492m90874m97949m98086m72993m34363m09597m08703m11254l92712
$$ plain form
917.8 70082819 69727600 69404447 69090796 68773645 68464303 68183428 67934912 67701072 67464030 67226046
938.2 67226046 67005545 66813588 66638809 66460204 66272241 66089910 65928870 65786153 65643293 65488183
958.6 65488183 65329659 65185845 65061736 64943278 64814395 64676547 64546239 64434278 64332855 64224952
979 64224952 64105326 63987386 63887233 63803893 63721025 63627875 63531595 63447547 63380271 63317019 63242835 63158131
1003.5 63158131 63077241 63011098 62953734 62889117 62811267 62732130 62666821 62615424 62564874 62505251 62441325 62387496
1028 62387496 62350106 62320071 62284827 62243938 62210542 62196594 62198734 62203401 62204885 62213421 62243330 62296075 62359113
1054.5 62359113 62420678 62483382 62560213 62657624 62766606 62872779 62972879 63077903 63199341 63333803
1074.9 63333803 63466245 63587832 63705915 63834321 63975483 64116699 64244741 64360774 64477885 64603770
$$ packed form
917.8G0082819l55219l23153l13651l17151l09342k80875k48516k33840k37042k37984
938.2F7226046k20501j91957j74779j78605j87963j82331j61040j42717j42860j55110
958.6F5488183j58524j43814j24109j18458j28883j37848j30308j11961j01423j07903
979F4224952j19626j17940j00153q3340q2868r3150r6280q4048o7276o3252p4184q4704
1003.5F3158131q0890o6143n7364o4617p7850p9137o5309n1397n0550n9623o3926n3829
1028F2387496l7390l0035l5244m0889l3396j3948K140M667J484Q536K9909N2745O3038
1054.5F2359113O1565O2704P6831R7411J08982J06173J00100J05024J21438J34462
1074.9F3333803J32442J21587J18083J28406J41162J41216J28042J16033J17111J25885
$$ plain form
1095.3 64603770 64730120 64842391 64937192 65026683 65123886 65226442 65319955 65396219 65464038 65539330 65626353
1117.7 65626353 65713310 65787560 65852094 65922219 66006470 66096687 66178030 66246885 66315520 66396469 66486669 66570961
1142.2 66570961 66640633 66703826 66774994 66857642 66940379 67011392 67074019 67143166 67227829 67321181 67409164 67488211
1166.7 67488211 67569929 67666543 67775434 67882258 67978317 68070310 68171304 68284392 68398237 68500566
1187.1 68500566 68593436 68690950 68802148 68920112 69031179 69132471 69236070 69354868 69487375 69620097
1207.5 69620097 69744712 69868964 70007086 70162362 70323151 70476907 70625859 70783806 70958525 71142137
1227.9 71142137 71320772 71491271 71664774 71852577 72051358 72246277 72428423 72604966 72789222 72983140
1248.2 72983140 73174179 73350489 73514616 73680067 73854554 74029970 74192894 74341905 74490076 74649161
$$ packed form
1095.3F4603770J26350J12271R4801Q9491R7203J02556R3513P6264O7819P5292Q7023
1117.7F5626353Q6957P4250O4534P0125Q4251R0217Q1343O8855O8635Q0949R0200Q4292
1142.2F6570961O9672O3193P1168Q2648Q2737P1013O2627O9147Q4663R3352Q7983P9047
1166.7F7488211Q1718R6614J08891J06824R6059R1993J00994J13088J13845J02329
1187.1F8500566R2870R7514J11198J17964J11067J01292J03599J18798J32507J32722
1207.5F9620097J24615J24252J38122J55276J60789J53756J48952J57947J74719J83612
1227.9G1142137J78635J70499J73503J87803J98781J94919J82146J76543J84256J93918
1248.2G2983140J91039J76310J64127J65451J74487J75416J62924J49011J48171J59085
$$ plain form
1268.6 74649161 74815553 74975687 75123221 75267273 75421476 75586540 75749427 75899184 76039594 76184660
1289 76184660 76340693 76498497 76644808 76778734 76913667 77059495 77210778 77355313 77488327 77617836
1309.4 77617836 77754968 77899301 78039283 78166425 78285605 78407866 78538203 78671515 78796995 78912812
1329.8 78912812 79030436 79157740 79288733 79411179 79521352 79629362 79743910 79861045 79974389 80080771
1350.2 80080771 80181921 80287659 80401349 80513519 80616546 80712461 80811101 80917692 81018984 81095266
1370.6 81095266 81152993 81217295 81292969 81372881 81456995 81542689 81634116 81740397 81854707 81969088 82081032
1393.1 82081032 82188201 82296449 82406759 82498831 82560730 82623214 82706678 82801110 82897836 82989126 83074468
1415.5 83074468 83164567 83253878 83339345 83431923 83522218 83603978 83684927 83765197 83838981 83910233 83989531 84059906
$$ packed form
1268.6G4649161J66392J60134J47534J44052J54203J65064J62887J49757J40410J45066
1289G6184660J56033J57804J46311J33926J34933J45828J51283J44535J33014J29509
1309.4G7617836J37132J44333J39982J27142J19180J22261J30337J33312J25480J15817
1329.8G8912812J17624J27304J30993J22446J10173J08010J14548J17135J13344J06382
1350.2H0080771J01150J05738J13690J12170J03027R5915R8640J06591J01292P6282
1370.6H1095266N7727O4302P5674P9912Q4114Q5694R1427J06281J14310J14381J11944
1393.1H2081032J07169J08248J10310R2072O1899O2484Q3464R4432R6726R1290Q5342
1415.5H3074468R0099Q9311Q5467R2578R0295Q1760Q0949Q0270P3784P1252P9298P0375
$$ plain form
1440 84059906 84123456 84209406 84302878 84383339 84457415 84540665 84634972 84723717 84799165 84880370 84978789 85090345
1464.5 85090345 85204583 85307521 85386199 85443324 85520333 85640925 85755765 85834235 85908562 86007148 86108851
1486.9 86108851 86181569 86225259 86297524 86411458 86540008 86656308 86748117 86820763 86888397 86978781 87089080
1509.3 87089080 87185645 87266511 87350768 87438393 87520170 87570542 87576789 87607336 87685251 87777811 87860548 87922406
1533.8 87922406 87971705 88020921 88080436 88123977 88150656 88204241 88273132 88342267 88404191 88435256 88440955 88460696
1558.3 88460696 88501859 88551515 88593978 88610017 88603330 88585836 88559866 88522148 88496947 88497657 88493896 88481832
1582.8 88481832 88460869 88429606 88392347 88343710 88293195 88260669 88228142 88168287 88084716 88009626 87946206 87875104
1607.2 87875104 87792414 87706465 87630010 87570173 87508672 87421930 87335861 87284380 87268835 87275285 87275362 87267959 87297601
$$ packed form
1440H4059906O3550Q5950R3472Q0461P4076Q3250R4307Q8745P5448Q1205R8419J11556
1464.5H5090345J14238J02938P8678N7125P7009J20592J14840P8470P4327R8586J01703
1486.9H6108851P2718M3690P2265J13934J28550J16300R1809P2646O7634R0384J10299
1509.3H7089080R6565Q0866Q4257Q7625Q1777N0372O247L0547P7915R2560Q2737O1858
1533.8H7922406M9299M9216N9515M3541K6679N3585O8891O9135O1924L1065N699J9741
1558.3H8460696M1163M9656M2463J6039o687j7494k5970l7718k5201P10l761j2064
1582.8H8481832k0963l1263l7259m8637n0515l2526l2527n9855q3571p5090o3420p1102
1607.2H7875104q2690q5949p6455n9837o1501q6742q6069n1481j5545O450P7p403K9642
$$ plain form
1633.7 87297601 87367094 87444276 87559921 87716269 87887609 88059944 88236880 88409126 88559377 88708997
1654.1 88708997 88879037 89049667 89204997 89344072 89480519 89613700 89716893 89834344 90004754 90173864
1674.5 90173864 90316302 90435243 90546614 90651929 90731466 90809548 90909004 91015947 91125768 91228873
1694.9 91228873 91303575 91342944 91371340 91433930 91513854 91576040 91614282 91633904 91648954 91663599 91663712 91671640
1719.4 91671640 91702759 91747200 91797853 91841322 91868448 91885674 91912925 91971803 92047226 92107582 92150307 92189676
1743.9 92189676 92227137 92259055 92277753 92294520 92318487 92339903 92366862 92399901 92425489 92444557 92472267 92515671
1768.4 92515671 92561948 92594939 92613363 92629457 92658806 92699414 92729449 92741609 92755455 92787528 92836440 92882591
1792.8 92882591 92912382 92937982 92974639 93018323 93056887 93082345 93094289 93109542 93144888 93184829 93215156 93245071
$$ packed form
1633.7H7297601O9493P7182J15645J56348J71340J72335J76936J72246J50251J49620
1654.1H8708997J70040J70630J55330J39075J36447J33181J03193J17451J70410J69110
1674.5I0173864J42438J18941J11371J05315P9537P8082R9456J06943J09821J03105
1694.9I1228873P4702L9369K8396O2590P9924O2186L8242J9622J5050J4645J13P928
1719.4I1671640L1119M4441N0653M3469K7126J7226K7251N8878P5423O0356M2725L9369
1743.9I2189676L7461L1918J8698J6767K3967K1416K6959L3039K5588J9068K7710M3404
1768.4I2515671M6277L2991J8424J6094K9349M0608L0035J2160J3846L2073M8912M6151
1792.8I2882591K9791K5600L6657M3684L8564K5458J1944J5253L5346L9941L0327K9915
$$ plain form
1817.3 93245071 93286157 93338531 93393165 93437576 93465978 93494433 93539613 93594939 93646020 93684095 93712014 93742526
1841.8 93742526 93782389 93823278 93859375 93890542 93917966 93952346 93996513 94035757 94063264 94095534 94144034 94198209
1866.3 94198209 94244874 94278854 94305128 94335765 94376123 94416356 94446635 94469047 94495004 94535667 94585109 94626790
1890.7 94626790 94656593 94685626 94724458 94769394 94807136 94833648 94858772 94894159 94941515 94989151 95028001 95060807
1915.2 95060807 95095706 95137298 95180291 95215207 95240521 95267504 95306116 95350480 95388895 95420206 95452583 95492750
1939.7 95492750 95540673 95586807 95623517 95654607 95689231 95732117 95777756 95816469 95847517 95881915 95927018 95976472
1964.2 95976472 96019775 96054041 96086413 96125543 96170288 96211702 96245366 96275663 96311074 96355331 96401286 96439064
1988.7 96439064 96468794 96499819 96538454 96580321 96615416 96640640 96664709 96697283 96737039 96773523 96798247 96814567
$$ packed form
1817.3I3245071M1086N2374N4634M4411K8402K8455M5180N5326N1081L8075K7919L0512
1841.8I3742526L9863M0889L6097L1167K7424L4380M4167L9244K7507L2270M8500N4175
1866.3I4198209M6665L3980K6274L0637M0358M0233L0279K2412K5957M0663M9442M1681
1890.7I4626790K9803K9033L8832M4936L7742K6512K5124L5387M7356M7636L8850L2806
1915.2I5060807L4899M1592M2993L4916K5314K6983L8612M4364L8415L1311L2377M0167
1939.7I5492750M7923M6134L6710L1090L4624M2886M5639L8713L1048L4398M5103M9454
1964.2I5976472M3303L4266L2372L9130M4745M1414L3664L0297L5411M4257M5955L7778
1988.7I6439064K9730L1025L8635M1867L5095K5224K4069L2574L9756L6484K4724J6320
$$ plain form
2013.1 96814567 96833992 96861124 96888816 96909022 96923327 96941221 96968955 97001350 97028100 97047293 97068125 97098464
2037.6 97098464 97134376 97163314 97178108 97186816 97202212 97226453 97251076 97267604 97277331 97290212 97312707 97338867
2062.1 97338867 97357780 97367316 97376662 97395086 97420710 97443163 97456568 97466677 97483915 97510684 97538054 97556567
2086.6 97556567 97567838 97582811 97607964 97636795 97658002 97669661 97681636 97703707 97733766 97760683 97778082 97791857
2111 97791857 97812927 97843742 97874779 97896314 97910750 97929764 97959745 97993636 98019564 98035288 98050940 98076683
2135.5 98076683 98110503 98140764 98160291 98175025 98196816 98228782 98261434 98284614 98300010 98318940 98348421 98382217
2160 98382217 98408270 98423874 98439127 98464698 98498857 98529357 98548388 98562205 98583227 98614931 98647803 98670775
2184.5 98670775 98684716 98701483 98729289 98762107 98787260 98801154 98813623 98836035 98867399 98895627 98912549 98923570
$$ packed form
2013.1I6814567J9425K7132K7692K0206J4305J7894K7734L2395K6750J9193K0832L0339
2037.6I7098464L5912K8938J4794Q708J5396K4241K4623J6528R727J2881K2495K6160
2062.1I7338867J8913R536R346J8424K5624K2453J3405J0109J7238K6769K7370J8513
2086.6I7556567J1271J4973K5153K8831K1207J1659J1975K2071L0059K6917J7399J3775
2111I7791857K1070L0815L1037K1535J4436J9014K9981L3891K5928J5724J5652K5743
2135.5I8076683L3820L0261J9527J4734K1791L1966L2652K3180J5396J8930K9481L3796
2160I8382217K6053J5604J5253K5571L4159L0500J9031J3817K1022L1704L2872K2972
2184.5I8670775J3941J6767K7806L2818K5153J3894J2469K2412L1364K8228J6922J1021
$$ plain form
2208.9 98923570 98940885 98968834 98998046 99016923 99026436 99038905 99062508 99091536 99113363 99123728 99132288 99150896
2233.4 99150896 99178749 99203461 99216551 99223298 99236143 99259597 99284393 99299192 99305052 99313742 99333143 99357951
2257.9 99357951 99375886 99382538 99386948 99400592 99423635 99445039 99456137 99460852 99470657 99490327 99511492 99522704
2282.3 99522704 99523562 99524790 99535143 99550498 99558580 99553794 99543500 99539346 99544036 99547708 99539328 99520946 99504906
2308.9 99504906 99497992 99493003 99478459 99454504 99433118 99423546 99421632 99414694 99395949 99372721 99363488 99376905 99400657
2335.4 99400657 99416274 99419779 99420893 99425530 99426818 99414736 99390483 99366754 99354625 99352491 99350637 99346489 99352789
2361.9 99352789 99387306 99449736 99521059 99583626 99636507 99689734 99747175 99800664 99839395 99862516 99880290 99901831
2386.4 99901831 99924338 99937922 99939078 99935704 99938089 99947745 99956632 99957269 99952126 99950546 99957049 99966139 99969125 99964768
$$ packed form
2208.9I8923570J7315K7949K9212J8877R513J2469K3603K9028K1827J0365Q560J8608
2233.4I9150896K7853K4712J3090O747J2845K3454K4796J4799N860Q690J9401K4808
2257.9I9357951J7935O652M410J3644K3043K1404J1098M715R805J9670K1165J1212
2282.3I9522704Q58J228J0353J5355Q082m786j0294m154M690L672q380j8382j6040
2308.9I9504906o914m989j4544k3955k1386r572j914o938j8745k3228r233J3417K3752
2335.4I9400657J5617L505J114M637J288j2082k4253k3729j2129k134j854m148O300
2361.9I9352789L4517O2430P1323O2567N2881N3227N7441N3489L8731K3121J7774K1541
2386.4I9901831K2507J3584J156l374K385R656Q887O37n143j580O503R090K986m357
$$ plain form
2414.9 99964768 99961245 99966264 99977189 99984223 99982375 99977249 99978089 99986595 99994504 99993843 99986488 99981600 99984682 99991059 99991971
2445.5 99991971 99986100 99981219 99984396 99993169 99998331 99995089 99988663 99987960 99994379 99992198 99997818 99990278 99986315 99990815 99998397
2476.1 99998397 99992651 99994254 99988717 99990225 99996758 99992460 99995703 99989021 99987894 99993289 99998069 99995887 99988961 99985254
2504.7 99985254 99989045 99995512 99996644 99991202 99986285 99988610 99996012 99992311 99996299 99989963 99988800 99993968 99998450 99995780
2533.2 99995780 99988002 99983454 99986869 99993593 99994969 99989504 99984711 99987197 99994409 99998206 99994951 99989665 99989730 99995559 99992853
2563.8 99992853 99997294 99990004 99986207 99989808 99995524 99995583 99989921 99985921 99989080 99996424 99992806 99996382 99990392 99989337 99994218
2594.4 99994218 99998862 99997568 99991852 99988985 99992830 99998945 99993986 99995041 99990571 99992311 99997866 99993408 99995542 99989283
2623 99989283 99988616 99994558 99993110 99998552 99992394 99989176 99992639 99997979 99997801 99991477 99985945 99987090 99993044 99996513 99993509
$$ packed form
2414.9I9964768l523N019J0925P034j848n126Q40Q506P909o61p355m888L082O377R12
2445.5I9991971n871m881L177Q773N162l242o426p03O419k181N620p540l963M500P582
2476.1I9998397n746J603n537J508O533m298L243o682j127N395M780k182o926l707
2504.7I9985254L791O467J132n442m917K325P402l701L988o336j163N168M482k670
2533.2I9995780p778m548L415O724J376n465m793K486P212L797l255n286O5N829k706
2563.8I9992853M441p290l797L601N716N9n662m000L159P344l618L576n990j055M881
2594.4I9994218M644j294n716k867L845O115m959J055m470J740N555m458K134o259
2623I9989283o67N942j448N442o158l218L463N340j78o324n532J145N954L469l004
$$ plain form
2653.5 99993509 99988258 99987769 99993235 99998319 99997193 99991870 99989283 99992681 99997747 99997950 99992669 99988014 99989587 99995941 99993354
2684.1 99993354 99997413 99991846 99990481 99995255 99993402 99998146 99991095 99986291 99987990 99992406 99992836 99987662 99982554 99983460 99989283
2714.7 99989283 99992770 99989182 99982446 99980336 99984622 99989074 99987406 99981260 99978143 99981916 99988151 99989778 99985266 99980569
2743.3 99980569 99981934 99988198 99992269 99989700 99984217 99982852 99987137 99991781 99991220 99986345 99983382 99986082 99991262 99992669 99988747
2773.9 99988747 99985170 99987686 99994940 99993157 99998212 99992728 99990499 99993712 99997598 99996477 99990380 99984962 99984360 99986082 99984252
2804.5 99984252 99976993 99968910 99965650 99967027 99967217 99962211 99954695 99950522 99951798 99954242 99951941 99943995 99935257 99929994 99925786
2835.1 99925786 99915528 99895769 99870843 99847841 99828207 99807602 99783510 99759477 99741411 99731809 99727547 99723428
2859.5 99723428 99718118 99715632 99719244 99725777 99728274 99723852 99716669 99712718 99712777 99712205 99707258 99699056 99691391 99686593 99682719
$$ packed form
2653.5I9993509n251m89N466N084j126n323k587L398N066K03n281m655J573O354k587
2684.1I9993354M059n567j365M774j853M744p051m804J699M416M30n174n108R06N823
2714.7I9989283L487l588o736k110M286M452j668o146l117L773O235J627m512m697
2743.3I9980569J365O264M071k569n483j365M285M644n61m875k963K700N180J407l922
2773.9I9988747l577K516P254j783N055n484k229L213L886j121o097n418o02J722j830
2804.5I9984252p259q083l260J377J90n006p516m173J276K444k301p946q738n263m208
2835.1I9925786j0258j9759k4926k3002j9634k0605k4092k4033j8066r602m262m119
2859.5I9723428n310k486L612O533K497m422p183l951N9n72m947q202p665m798l874
$$ plain form
2890.1 99682719 99675012 99662149 99648798 99639994 99635023 99628633 99617159 99602228 99587607 99573570 99556619 99534327
2914.6 99534327 99508643 99484849 99467349 99455380 99445349 99437696 99438059 99450874 99474055 99500155 99523407 99543643
2939.1 99543643 99562949 99581170 99595076 99601257 99599916 99595129 99590677 99585855 99578047 99568605 99562436 99563217 99570388 99580473
2967.6 99580473 99590904 99602264 99616921 99635780 99656492 99675369 99691534 99707657 99725813 99743986 99758226 99767226
2992.1 99767226 99772948 99778527 99785483 99791765 99794298 99793625 99793053 99794233 99795389 99793154 99786562 99778193 99770981 99764705 99756259
3022.7 99756259 99744171 99731141 99721283 99715281 99709547 99701208 99691254 99681830 99673593 99665159 99653816 99638993 99623400
3049.2 99623400 99610388 99600238 99589801 99577296 99563843 99551064 99539351 99527436 99513972 99499434 99485391 99472499
3073.7 99472499 99459600 99444479 99426538 99407464 99389738 99373704 99356550 99336034 99313337 99291658 99272275 99252874
$$ packed form
2890.1I9682719p707j2863j3351q804m971o390j1474j4931j4621j4037j6951k2292
2914.6I9534327k5684k3794j7500j1969j0031p653L63J2815K3181K6100K3252K0236
2939.1I9543643J9306J8221J3906O181j341m787m452m822p808r442o169P81P171J0085
2967.6I9580473J0431J1360J4657J8859K0712J8877J6165J6123J8156J8173J4240R000
2992.1I9767226N722N579O956O282K533o73n72J180J156k235o592q369p212o276q446
3022.7I9756259j2088j3030r858o002n734q339r954r424q237q434j1343j4823j5593
3049.2I9623400j3012j0150j0437j2505j3453j2779j1713j1915j3464j4538j4043j2892
3073.7I9472499j2899j5121j7941j9074j7726j6034j7154k0516k2697k1679j9383j9401
$$ plain form
3098.2 99252874 99231523 99209857 99190676 99174178 99157679 99138427 99115914 99091989 99068940 99046689 99022347 98994619
3122.6 98994619 98965645 98937041 98907256 98874718 98840410 98806632 98775244 98745626 98714912 98681635 98646432 98610497
3147.1 98610497 98574275 98536813 98496950 98455346 98413581 98371661 98328269 98283225 98237616 98192507 98148775 98105550
3171.6 98105550 98060423 98012376 97962219 97911161 97859675 97807068 97752488 97695726 97637480 97578371 97518510 97458076
3196.1 97458076 97397178 97335970 97275245 97215098 97154570 97093391 97032416 96971947 96911132 96849090 96786058 96722960
3220.5 96722960 96660477 96598738 96536899 96474183 96411330 96349788 96289992 96230805 96170723 96109843 96049315 95989919
3245 95989919 95931870 95874739 95818228 95762581 95708758 95657790 95609087 95561528 95514715 95468444 95422244 95375001
3269.5 95375001 95325547 95273477 95219606 95165479 95111108 95054567 94994795 94932199 94868177 94804382 94740951 94676489
$$ packed form
3098.2I9252874k1351k1666j9181j6498j6499j9252k2513k3925k3049k2251k4342k7728
3122.6I8994619k8974k8604k9785l2538l4308l3778l1388k9618l0714l3277l5203l5935
3147.1I8610497l6222l7462l9863m1604m1765m1920m3392m5044m5609m5109m3732m3225
3171.6I8105550m5127m8047n0157n1058n1486n2607n4580n6762n8246n9109n9861o0434
3196.1I7458076o0898o1208o0725o0147o0528o1179o0975o0469o0815o2042o3032o3098
3220.5I6722960o2483o1739o1839o2716o2853o1542n9796n9187o0082o0880o0528n9396
3245I5989919n8049n7131n6511n5647n3823n0968m8703m7559m6813m6271m6200m7243
3269.5I5375001m9454n2070n3871n4127n4371n6541n9772o2596o4022o3795o3431o4462
$$ plain form
3294 94676489 94609720 94540405 94468099 94390714 94306099 94214511 94118720 94022065 93924665 93823671 93717194 93605632
3318.4 93605632 93491167 93376976 93263537 93148351 93030167 92909241 92785072 92657125 92526048 92392331
3338.8 92392331 92256391 92118818 91978908 91834801 91685939 91534454 91384333 91238105 91093576 90947008
3359.2 90947008 90798450 90649986 90502626 90356338 90210372 90063936 89917618 89773923 89635789 89502984
3379.6 89502984 89373374 89249098 89135283 89032090 88933569 88834894 88736153 88639319 88544929 88451612 88357425
3402.1 88357425 88262403 88169175 88080925 87997812 87916601 87836385 87761045 87694651 87637639 87587661 87541908 87499094
3426.5 87499094 87459868 87424934 87394941 87369835 87349081 87333649 87323868 87318349 87316793 87320250 87329161 87345225 87371933
3453.1 87371933 87409288 87451768 87495196 87539721 87587190 87639946 87698019 87758178 87818563 87880081 87943399 88007492
$$ packed form
3294I4676489o6769o9315p2306p7385q4615r1588r5791r6655r7400j00994j06477j11562
3318.4I3605632j14465j14191j13439j15186j18184j20926j24169j27947j31077j33717
3338.8I2392331j35940j37573j39910j44107j48862j51485j50121j46228j44529j46568
3359.2I0947008j48558j48464j47360j46288j45966j46436j46318j43695j38134j32805
3379.6H9502984j29610j24276j13815j03193r8521r8675r8741r6834r4390r3317r4187
3402.1H8357425r5022r3228q8250q3113q1211q0216p5340o6394n7012m9978m5753m2814
3426.5H7499094l9226l4934k9993k5106k0754j5432r781n519j556L457Q911J6064K6708
3453.1H7371933L7355M2480M3428M4525M7469N2756N8073O0159O0385O1518O3318O4093
$$ plain form
3477.5 88007492 88070750 88134283 88201624 88274062 88351077 88432229 88514936 88597208 88681448 88770235 88862610 88955641
3502 88955641 89047986 89140069 89232802 89326942 89422327 89520502 89622343 89725363 89829749 89937735 90046424
3524.4 90046424 90153193 90259713 90369278 90484703 90603042 90719903 90837073 90957695 91080010 91201484
3544.8 91201484 91323298 91442370 91553414 91666853 91793573 91926920 92058367 92188883 92323440 92463756
3565.2 92463756 92606115 92745948 92882991 93025023 93175936 93329012 93479329 93627429 93777710 93940842
3585.6 93940842 94115615 94287080 94447607 94603097 94759440 94918013 95080179 95239156 95395052 95564944
3606 95564944 95747477 95923203 96079218 96226603 96383202 96545619 96704984 96854502 96992373 97125763
3626.4 97125763 97257715 97382110 97493970 97603488 97730422 97873527 98011190 98133820 98243880 98355573
$$ packed form
3477.5H8007492O3258O3533O7341P2438P7015Q1152Q2707Q2272Q4240Q8787R2375R3031
3502H8955641R2345R2083R2733R4140R5385R8175J01841J03020J04386J07986J08689
3524.4I0046424J06769J06520J09565J15425J18339J16861J17170J20622J22315J21474
3544.8I1201484J21814J19072J11044J13439J26720J33347J31447J30516J34557J40316
3565.2I2463756J42359J39833J37043J42032J50913J53076J50317J48100J50281J63132
3585.6I3940842J74773J71465J60527J55490J56343J58573J62166J58977J55896J69892
3606I5564944J82533J75726J56015J47385J56599J62417J59365J49518J37871J33390
3626.4I7125763J31952J24395J11860J09518J26934J43105J37663J22630J10060J11693
$$ plain form
3646.8 98355573 98474419 98582995 98670328 98742294 98808879 98866218 98916632 98967433 99019897 99083954 99155915
3669.2 99155915 99211657 99246562 99282575 99325162 99363768 99392241 99406630 99407041 99408525 99420303 99433362 99449992
3693.7 99449992 99474090 99503917 99537635 99567461 99587053 99603492 99627578 99652541 99668902 99672198 99657464 99627626
3718.2 99627626 99598074 99578547 99565971 99552894 99537623 99537820 99556184 99577504 99604452 99646068 99696678 99745923
3742.7 99745923 99791723 99831665 99859291 99878854 99899077 99920601 99938238 99941748 99929070 99915934 99907935 99902046
3767.1 99902046 99904561 99914694 99921709 99922967 99923879 99923354 99918669 99912089 99903399 99903333 99916267 99930483 99943334 99957907
3795.7 99957907 99972284 99979299 99981761 99983442 99981928 99982953 99986041 99986517 99985480 99980700 99973053 99970978 99971747 99975920 99987471
3826.3 99987471 99997866 99994493 99996626 99993819 99982941 99967211 99969268 99982363 99992424 99993277 99985117 99975532 99965268
$$ packed form
3646.8I8355573J18846J08576Q7333P1966O6585N7339N0414N0801N2464O4057P1961
3669.2I9155915N5742L4905L6013M2587L8606K8473J4389M11J484J1778J3059J6630
3693.7I9449992K4098K9827L3718K9826J9592J6439K4086K4963J6361L296j4734k9838
3718.2I9627626k9552j9527j2576j3077j5271J97J8364K1320K6948M1616N0610M9245
3742.7I9745923M5800L9942K7626J9563K0223K1524J7637L510j2678j3136p999n889
3767.1I9902046K515J0133P015J258R12n25m685o580q690o6J2934J4216J2851J4573
3795.7I9957907J4377P015K462J681j514J025L088M76j037m780p647k075P69M173J1551
3826.3I9987471J0395l373K133k807j0878j5730K057J3095J0061Q53q160r585j0264
$$ plain form
3852.8 99965268 99957174 99962103 99976248 99991113 99989629 99998522 99989754 99974549 99966860 99975985 99982506 99981016 99978709 99976265
3881.4 99976265 99969816 99957651 99948198 99951285 99963212 99974197 99976647 99974138 99972570 99968863 99965358 99962622 99957258 99955231
3909.9 99955231 99957132 99953055 99941218 99931747 99932730 99943376 99956083 99961740 99960595 99958235 99955648 99953389 99952972 99952745
3938.5 99952745 99951410 99951094 99952096 99951369 99949038 99948764 99951053 99953079 99952716 99950004 99948120 99948657 99950373 99953383 99957937 99962807
3971.1 99962807 99967581 99973273 99979681 99984705 99987364 99988830 99990827 99993587 99995565 99996316 99997056 99998361 100000000
3997.6 100000000
$$ packed form
3852.8I9965268q094M929J4145J4865j484Q893q768j5205p689R125O521j490k307k444
3881.4I9976265o449j2165r453L087J1927J0985K450k509j568l707l505k736n364k027
3909.9I9955231J901m077j1837r471R83J0646J2707N657j145k360k587k259m17k27
3938.5I9952745j335l16J002p27k331k74K289K026l63k712j884N37J716L010M554M870
3971.1I9962807M774N692O408N024K659J466J997K760J978P51P40J305J639
3997.6A00000000
##END=$$ End of the data block
