##TITLE=AD 10 $$ Begin of the data block
##JCAMP-DX=5.00 $$ ACD/SpecManager v 10.08
##SPECTROMETER/DATA SYSTEM=Alpha
##DATE=16 Dec 2014 10:37:32
##DATA TYPE=INFRARED SPECTRUM
##DATA CLASS=XYDATA
##ORIGIN=
##OWNER=
##NPOINTS=1765
##FIRSTX=399.76428223
##LASTX=3997.64306641
##MAXX=3997.64306641
##MINX=399.76428223
##MAXY=1.00000000
##MINY=0.57655776
##XFACTOR=1.0000000000
##YFACTOR=0.000000010000000
##FIRSTY=1.00000000
##DELTAX=2.03961372
##XUNITS=1/CM
##YUNITS=ARBITRARY UNITS
##XYDATA=(X++(Y..Y))
399.8A00000000p28327p44987p79998p86155p85482q14885q64911r01461q99708q46446
$$ 100000000 99271673 98526686 97746688 96960533 96175051 95360166 94495255 93593794 92694086 91847640
420.2I1847640p74681p48372p70677p88080p58225o96915o57177o78903p10571o81621
$$ 91847640 91072959 90324587 89553910 88765830 88007605 87310690 86653513 85974610 85264039 84582418
440.6H4582418o18678n73474n67013n72008n42146m70644l96163l57985l52413l37088
$$ 84582418 83963740 83390266 82823253 82251245 81709099 81238455 80842292 80484307 80131894 79794806
461G9794806k81757k06196j56278j45161j34742q8781j8591L3909M7332M6063O9171
$$ 79794806 79513049 79306853 79150575 79005414 78870672 78781891 78763300 78797209 78844541 78890604 78959775
483.4G8959775J22905J74850J89811J75112J78391K22874K81083L07960K95943K90108
$$ 78959775 79082680 79257530 79447341 79622453 79800844 80023718 80304801 80612761 80908704 81198812
503.8H1198812L31372M05526M63026M79430M83787N20379N98734O82378P26736P32821
$$ 81198812 81530184 81935710 82398736 82878166 83361953 83882332 84481066 85163444 85890180 86623001
524.2H6623001P48152Q05080Q76271R05335Q76534Q37183Q36277Q61359Q57055P91776
$$ 86623001 87371153 88176233 89052504 89957839 90834373 91671556 92507833 93369192 94226247 95018023
544.6I5018023O94740O24383O02942N86379N18954M06253L09747K74706K74748K43425
$$ 95018023 95712763 96337146 96940088 97526467 98045421 98451674 98761421 99036127 99310875 99554300
565I9554300J58245P1191M2779O5833P6896l4112L0750n1123q672M3726M4966m536
$$ 99554300 99712545 99783736 99826515 99892348 99969244 99935132 99965882 99914759 99906087 99949813 99994779 99990243
589.4I9990243m4471k6626K6131M7427m8869P289n7173j3804K5773J3340l3123n3692
$$ 99990243 99945772 99919146 99945277 99992704 99943835 99951124 99893951 99880147 99905920 99919260 99886137 99832445
613.9I9832445j8954L6353N2834J6862k2710j5270L0779N8842l4666K8807o7312m4578
$$ 99832445 99813491 99849844 99902678 99919540 99896830 99881560 99912339 99971181 99936515 99965322 99898010 99853432
638.4I9853432r638j6928o8372j11264j01662n4449l4093q7899j48929j60324j22929
$$ 99853432 99843794 99826866 99758494 99647230 99545568 99491119 99457026 99369127 99220198 99059874 98936945
660.8I8936945q2940q7464j29145j54400j31249q7553p4536j05530j41829j40047j05542
$$ 98936945 98854005 98766541 98637396 98482996 98351747 98264194 98189658 98084128 97942299 97802252 97696710
683.3I7696710r2918j33735j77556j97673j82670j55771j59317j99307k38180k42191
$$ 97696710 97603792 97470057 97292501 97094828 96912158 96756387 96597070 96397763 96159583 95917392
703.7I5917392k19983k09487k33620k73925k91926k75945k54530k61742k98822l32451
$$ 95917392 95697409 95487922 95254302 94980377 94688451 94412506 94157976 93896234 93597412 93264961
724.1I3264961l34412l16208l14176l44569l86548m07451l99399l87722l99429m29898
$$ 93264961 92930549 92614341 92300165 91955596 91569048 91161597 90762198 90374476 89975047 89545149
744.5H9545149m47536m31484l94761l67702l61442l55387l23200k65163k07383j70231
$$ 89545149 89097613 88666129 88271368 87903666 87542224 87186837 86863637 86598474 86391091 86220860
764.9H6220860j46877j12909n5421J1486O2490R0682J14501J54835K10815K61563K91264
$$ 86220860 86073983 85961074 85905653 85917139 85979629 86070311 86184812 86339647 86550462 86812025 87103289
787.3H7103289L07072L32468L79622M34143M73129M92043N08517N40822N85390O18422
$$ 87103289 87410361 87742829 88122451 88556594 89029723 89521766 90030283 90571105 91156495 91774917
807.7I1774917O22880O07389N94569N91719N79804N35804M59444L72529K92916K13086
$$ 91774917 92397797 93005186 93599755 94191474 94771278 95307082 95766526 96139055 96431971 96645057
828.1I6645057J11342j7983j54674k72632l66193m51880n43732o32983o96803p26485
$$ 96645057 96756399 96738416 96583742 96311110 95944917 95493037 94949305 94316322 93619519 92893034
848.5I2893034p37524p50893p70980p83855p75701p52938p35974p34931p39628p32976
$$ 92893034 92155510 91404617 90633637 89849782 89074081 88321143 87585169 86850238 86110610 85377634
868.9H5377634p12407o92678o88433o97613p04497o98090o84702o79761o88815p00915
$$ 85377634 84665227 83972549 83284116 82586503 81882006 81183916 80499214 79819453 79130638 78429723
889.3G8429723p00999o87128o71202o64586o64997o59728o41787o18040o00785n93728
$$ 78429723 77728724 77041596 76370394 75705808 75040811 74381083 73739296 73121256 72520471 71926743
909.7G1926743n87869n71996n46312n20933n03433m90623m72433m44150m12780l88705
$$ 71926743 71338874 70766878 70220566 69699633 69196200 68705577 68233144 67788994 67376214 66987509
930.1F6987509l73966l61425l42625l18164k97653k88481k86621k82079k70283k56306
$$ 66987509 66613543 66252118 65909493 65591329 65293676 65005195 64718574 64436495 64166212 63909906
950.5F3909906k48664k49821k52504k48265k37727k28298k26229k30354k31964k25657
$$ 63909906 63661242 63411421 63158917 62910652 62672925 62444627 62218398 61988044 61756080 61530423
970.9F1530423k16055k10887k11233k11078k03794j89328j74999j66446j60832j51854
$$ 61530423 61314368 61103481 60892248 60681170 60477376 60288048 60113049 59946603 59785771 59633917
991.3E9633917j37562j22255j13177j12433j14148j11646j05327j00994j02532j07283
$$ 59633917 59496355 59374100 59260923 59148490 59034342 58922696 58817369 58716375 58613843 58506560
1011.6E8506560j08349j02514r3454q6719q3649q0472p1818n7656m4280l6615l3361
$$ 58506560 58398211 58295697 58202243 58115524 58031875 57951403 57879585 57821929 57777649 57741034 57707673
1034.1E7707673k8455j8239n203N167J1176J7089K8699M7082O7449Q4877R8681J12319
$$ 57707673 57679218 57660979 57655776 57660943 57672119 57689208 57717907 57764989 57832438 57917315 58015996 58128315
1058.6E8128315J27775J42830J53178J57583J60283J66339J76090J85012J89215J90282
$$ 58128315 58256090 58398920 58552098 58709681 58869964 59036303 59212393 59397405 59586620 59776902
1079E9776902J94097K03228K14433K21205K19357K12050K06005K02841J98418J89495
$$ 59776902 59970999 60174227 60388660 60609865 60829222 61041272 61247277 61450118 61648536 61838031
1099.4F1838031J77359J67150J62631J61916J59717J53607J46335J43486J47254J52474
$$ 61838031 62015390 62182540 62345171 62507087 62666804 62820411 62966746 63110232 63257486 63409960
1119.8F3409960J53691J51992J51890J54883J57964J56337J48690J39743J34194J31756
$$ 63409960 63563651 63715643 63867533 64022416 64180380 64336717 64485407 64625150 64759344 64891100
1140.1F4891100J28311J20437J09816J03700J06191J13321J19757J24187J29515J39135
$$ 64891100 65019411 65139848 65249664 65353364 65459555 65572876 65692633 65816820 65946335 66085470
1160.5F6085470J52439J64872J73277J78504J84220J93196K02960K07657K05910K02405
$$ 66085470 66237909 66402781 66576058 66754562 66938782 67131978 67334938 67542595 67748505 67950910
1180.9F7950910K01619K03460K03896J99652J92582J87970J88762J92350J94627J95169
$$ 67950910 68152529 68355989 68559885 68759537 68952119 69140089 69328851 69521201 69715828 69910997
1201.3F9910997J97685K05475K16806K26676K32381K35385K40034K48068K55418K57629
$$ 69910997 70108682 70314157 70530963 70757639 70990020 71225405 71465439 71713507 71968925 72226554
1221.7G2226554K55424K53642K55823K60681K64096K63518K60603K59710K62290K64806
$$ 72226554 72481978 72735620 72991443 73252124 73516220 73779738 74040341 74300051 74562341 74827147
1242.1G4827147K62600K56061K50155K47705K46650K42346K33055K22808K16555K14464
$$ 74827147 75089747 75345808 75595963 75843668 76090318 76332664 76565719 76788527 77005082 77219546
1262.5G7219546K12544K07293J99723J94061J92791J94085J93673J89692J84482J81604
$$ 77219546 77432090 77639383 77839106 78033167 78225958 78420043 78613716 78803408 78987890 79169494
1282.9G9169494J81520J80161J74826J67632J62501J60908J60259J57082J50311J42306
$$ 79169494 79351014 79531175 79706001 79873633 80036134 80197042 80357301 80514383 80664694 80807000
1303.3H0807000J38152J39445J41537J40155J36554J35475J39064J43969J43331J33616
$$ 80807000 80945152 81084597 81226134 81366289 81502843 81638318 81777382 81921351 82064682 82198298
1323.7H2198298J22821J19675J21712J22726J19394J14417J13339J17307J23680J26749
$$ 82198298 82321119 82440794 82562506 82685232 82804626 82919043 83032382 83149689 83273369 83400118
1344.1H3400118J21189J13606J13684J15991J12557J02222Q9836Q3971Q5884Q9807
$$ 83400118 83521307 83634913 83748597 83864588 83977145 84079367 84169203 84253174 84339058 84428865
1364.5H4428865R0337Q2993O7562N8299O6841P8142P9184Q0121Q8024R9444J11860
$$ 84428865 84519202 84602195 84669757 84728056 84794897 84873039 84952223 85032344 85120368 85219812 85331672
1386.9H5331672J15169J11228J14047J22333J28180J27017J10090P9816O8975P9471
$$ 85331672 85446841 85558069 85672116 85794449 85922629 86049646 86159736 86239552 86308527 86387998
1407.3H6387998Q3935P9578P2015O8080P5895Q0013O9839O8539P8178Q9830J01900
$$ 86387998 86471933 86551511 86623526 86691606 86767501 86847514 86917353 86985892 87064070 87153900 87255800
1429.8H7255800J05750R7055Q9192R7591R8371P5972O5440O5106O1089N7191N8913
$$ 87255800 87361550 87458605 87547797 87645388 87743759 87819731 87885171 87950277 88011366 88068557 88127470
1452.2H8127470O5124O8760O3086O6596Q2361R9987J17368J34873J41090J22655R8598
$$ 88127470 88192594 88261354 88324440 88391036 88473397 88573384 88690752 88825625 88966715 89089370 89187968
1474.7H9187968J08683J21850J10262R7108J04994J13493J00553O1786L9369M8792
$$ 89187968 89296651 89418501 89528763 89625871 89730865 89844358 89944911 90006697 90046066 90094858
1495I0094858O6442P9989Q3524P5525N4962M5442N9301O6411O6901P6139Q9836J04874
$$ 90094858 90161300 90241289 90324813 90400338 90455300 90500742 90560043 90626454 90693355 90769494 90859330 90964204
1519.5I0964204J06537O9875L5226L8028N0122O2650O5661O0778N5790O3217N8091
$$ 90964204 91070741 91140616 91175842 91213870 91263992 91326642 91392303 91453081 91508871 91572088 91630179
1542I1630179K6375L2729N0199N9837P2634P0280N0258L3844K9749L6794N7506O9732
$$ 91630179 91656554 91689283 91739482 91799319 91871953 91942233 91992491 92026335 92056084 92092878 92150384 92220116
1566.4I2220116P0649O4874M9579J9663R60K0731K4527J4377L075o372q666k2918n0962
$$ 92220116 92290765 92355639 92405218 92424881 92425841 92446572 92471099 92485476 92488551 92482179 92473513 92450595 92399633
1593I2399633n9092n0062n2780p2569q7434r2232r9915j06764j10519j13326j06710
$$ 92399633 92340541 92290479 92237699 92165130 92077696 91985464 91885549 91778785 91668266 91554940 91448230
1615.4I1448230r7830j06620j14197r8264p1979m0000j9008j5247N281K8497J2916
$$ 91448230 91350400 91243780 91129583 91031319 90959340 90919340 90900332 90885085 90890366 90918863 90931779
1637.8I0931779K4504P1245J14828J37788J51700J63394J57518J54745J76120J85615
$$ 90931779 90956283 91027528 91142356 91280144 91431844 91595238 91752756 91907501 92083621 92269236
1658.2I2269236J75321J65647J69438J71775J18059P0965J03438J36376J49929J49334
$$ 92269236 92444557 92610204 92779642 92951417 93069476 93140441 93243879 93380255 93530184 93679518
1678.6I3679518J41435J29182R2721P6907Q8060Q6761R0009J11395J22547J02234N4395
$$ 93679518 93820953 93950135 94042856 94119763 94207823 94294584 94384593 94495988 94618535 94720769 94775164
1701.1I4775164M2272O5481Q1677R3132R3162Q1748O3324L0851K3830L9023M3601M9067
$$ 94775164 94817436 94882917 94964594 95057726 95150888 95232636 95295960 95326811 95350641 95389664 95433265 95482332
1725.5I5482332N7250N7679M2707J2344M107K9462M7553N7584O8814O6334N4609M0681
$$ 95482332 95539582 95597261 95639968 95652312 95656419 95685881 95733434 95791018 95859832 95926166 95980775 96021456
1750I6021456M3845N9277M4435K7275L2222L6115K8723J8442J9735L3420M4179M3857
$$ 96021456 96065301 96124578 96169013 96196288 96228510 96264625 96293348 96311790 96331525 96364945 96409124 96452981
1774.5I6452981L1227K4694L6800M4197L3093J8084R816J7918L1232L0435K7626L3743
$$ 96452981 96484208 96508902 96545702 96589899 96622992 96641076 96650892 96668810 96700042 96730477 96758103 96791846
1799I6791846M0704M6354N1141M2248K7084L0726L1406J6105R203J5438K4742L3068
$$ 96791846 96832550 96878904 96930045 96972293 96999377 97030103 97061509 97077614 97086817 97102255 97126997 97160065
1823.4I7160065L5978K4950J4609K0504K9212L5847M0096L8117L4040L3051K9588L1304
$$ 97160065 97196043 97220993 97235602 97256106 97285318 97321165 97361261 97399378 97433418 97466469 97496057 97527361
1847.9I7527361M0245L3939K1309K4098K6190J4150Q202J7678K6048L1054L4100L1608
$$ 97527361 97567606 97601545 97622854 97646952 97673142 97687292 97695494 97713172 97739220 97770274 97804374 97835982
1872.4I7835982K6679K9033L4333L4582K6787J2558Q935K1255K9725K7418K2513K3335
$$ 97835982 97862661 97891694 97926027 97960609 97987396 97999954 98008889 98030144 98059869 98087287 98109800 98133135
1896.9I8133135K9158K9993K5017J7935J0550J1062J6427K0594K3245K2895K2614K6643
$$ 98133135 98162293 98192286 98217303 98235238 98245788 98256850 98273277 98293871 98317116 98340011 98362625 98389268
1921.3I8389268L2103L0154K2376J9621K0087J8478J9306K0939J7154J5867K0736K6256
$$ 98389268 98421371 98451525 98473901 98493522 98513609 98532087 98551393 98572332 98589486 98605353 98626089 98652345
1945.8I8652345K9439K6977K1404K0432K2930K1297J7398J6362J6701J9115K3860K6804
$$ 98652345 98681784 98708761 98730165 98750597 98773527 98794824 98812222 98828584 98845285 98864400 98888260 98915064
1970.3I8915064K5648K1070J6565J7970K1941K0319J5307J3667J5849J9485K1749K0516
$$ 98915064 98940712 98961782 98978347 98996317 99018258 99038577 99053884 99067551 99083400 99102885 99124634 99145150
1994.8I9145150J7792J6844J8001J9962K0176J6349J0145N102L040L392K992J079J317
$$ 99145150 99162942 99179786 99197787 99217749 99237925 99254274 99264419 99269521 99272561 99275953 99278945 99280024 99281341
2021.3I9281341N585J1289J4764J4716J3125J3823J8799K3872K2935J4472M459K700
$$ 99281341 99286926 99298215 99312979 99327695 99340820 99354643 99373442 99397314 99420249 99434721 99439180 99441880
2045.8I9441880P582R483P021M101L606O139R424R757O700L934M762Q476J1009R340
$$ 99441880 99449462 99458945 99465966 99470067 99473673 99479812 99489236 99498993 99505693 99509627 99514389 99522865 99533874 99543214
2074.3I9543214N340L511N108P880Q655O085K951L272O813R143P969N108M328O967
$$ 99543214 99548554 99552065 99557173 99565053 99573708 99579793 99582744 99586016 99592829 99601972 99609941 99615049 99619377 99626344
2102.9I9626344J0008R954O837L653L779P248J0234R275N960M667O921J0132J1045
$$ 99626344 99636352 99646306 99653143 99656796 99660575 99667823 99678057 99687332 99693292 99697959 99704880 99715012 99726057
2129.4I9726057Q923O264N871P892R960R304O306M441O199R787J1235Q828N263M280
$$ 99726057 99734980 99741244 99747115 99755007 99764967 99774271 99780577 99785018 99791217 99801004 99812239 99821067 99826330 99830610
2157.9I9830610O371Q685Q577N829L553M601P749R560Q476N871N049O949Q798P850
$$ 99830610 99836981 99845666 99854243 99860072 99863625 99868226 99875975 99885535 99894011 99899882 99904931 99911880 99920678 99928528
2186.5I9928528M941K927L356N245O145M661K402J848L332N317N662L618J448J359
$$ 99928528 99933469 99936396 99939752 99944997 99951142 99955803 99958205 99960053 99963385 99968702 99974364 99977982 99979430 99980789
2215I9980789K915M226L660J663N24J145K384K211M11j269j228L64J561l93O38m53
$$ 99980789 99983704 99987930 99991590 99993253 99993777 99994922 99997306 99999517 99999928 99998659 99997431 99997795 99999356 99998963 99999601 99999148
2247.7I9999148L5%Tj287Q17j973j187M2R12J067Q64P51%q76Q11m310o771p367p796
$$ 99999148 99999183 99999183 99999183 99997896 99998713 99996740 99995553 99995595 99996507 99997574 99998438 99999189 99999189 99998313 99999124 99994814 99988043 99980676 99972880
2286.4I9972880r769j3155j6868k0719k4527k7108k8503l1394l7289m3809m7314m8685
$$ 99972880 99963111 99949956 99933088 99912369 99887842 99860734 99832231 99800837 99763548 99719739 99672425 99623740
2310.9I9623740n1850n5206n3203m6093l9231l5835l6049m0274l8684r000L4314N3293
$$ 99623740 99571890 99516684 99463481 99417388 99378157 99342322 99306273 99265999 99227315 99218315 99252629 99305922
2335.4I9305922L8636J2904r501l0655n0688o3538o5774o2132n5849m4525k5666L457
$$ 99305922 99344558 99357462 99347961 99317306 99266618 99203080 99137306 99075174 99019325 98974800 98949134 98952591
2359.9I8952591N0646J13124J55109J56898J37573J19436J02055Q1360O0255M0328
$$ 98952591 99003237 99116361 99271470 99428368 99565941 99685377 99787432 99868792 99929047 99969375
2380.2I9969375K2543j640Q083p153r846r758p510m619k575j294m05R0J60j07n66o38
$$ 99969375 99991918 99990278 99998361 99991208 99981362 99971604 99964094 99959475 99956900 99955606 99955201 99955291 99955451 99955344 99954778 99954140
2412.9I9954140J97J609K480J955R36J007J782K545K855K378J359R30J931L195L010
$$ 99954140 99954337 99955946 99958426 99960381 99961317 99962324 99964106 99966651 99969506 99971884 99973243 99974173 99976104 99979299 99982309
2443.5I9982309J592N72R24K014K134J073P2K86J776K748J806k27j156k50J198J609
$$ 99982309 99983901 99984473 99985397 99987411 99989545 99990618 99990690 99990976 99992752 99995500 99997306 99997079 99995923 99995673 99996871 99998480
2476.1I9998480P39p45r89L16J382%o79Q17m95K92P81j538R5k354j025J382J944N3
$$ 99998480 99999219 99998474 99997485 99997801 99999183 99999183 99998504 99999321 99998826 99999118 99999899 99998361 99998456 99996102 99995077 99996459 99998403 99998456
2512.8I9998456j526q76J013J950r96R90k164j210N24N19j478l141j985J091K980K277
$$ 99998456 99996930 99996054 99997067 99999017 99998021 99999011 99996847 99995637 99996161 99996680 99995202 99992061 99990076 99991167 99994147 99996424
2545.5I9996424K98o80J37J604J806J07k182k717r84P09J55j740k152m23J699K145
$$ 99996424 99996722 99996042 99996179 99997783 99999589 99999696 99997514 99994797 99993813 99994522 99994677 99992937 99990785 99990362 99992061 99994206
2578.1I9994206L94k098k808p21J836K152M82o67K50K259K963k69J753j604j180K45
$$ 99994206 99994600 99992502 99989694 99988973 99990809 99992961 99993443 99992776 99993026 99995285 99998248 99997979 99999732 99998128 99996948 99997193
2610.7I9997193P15n19j985j490P81K575K021j43j634r41P63R41j269m089m709k306
$$ 99997193 99997908 99997389 99995404 99993914 99994695 99997270 99999291 99999148 99997514 99996573 99997336 99998277 99997008 99992919 99988210 99985904
2643.4I9985904L69K68k181l791k486J55J568O56j425j949m8J794R48k199m620m053
$$ 99985904 99986273 99986541 99984360 99980569 99978083 99978238 99979806 99980462 99979037 99977088 99977040 99978834 99979782 99977583 99972963 99968910
2676I9968910j752o56k086m381n084l070J91J335l04k128k116n48P45K38j645k789
$$ 99968910 99967158 99966502 99964416 99960035 99954951 99951881 99952072 99953407 99953103 99950975 99948859 99948311 99949056 99949294 99947649 99944860
2708.6I9944860j747L70R42q35l171l689k116q71j853m322n507l576O5K241J336p04
$$ 99944860 99943113 99943483 99944425 99943590 99940419 99936730 99934614 99933743 99931890 99927568 99922061 99918485 99918550 99920791 99922127 99921423
2741.2I9921423o38J592L284K706J61k497l332k337j347j657k503k563j371J13R0j759
$$ 99921423 99920785 99922377 99925661 99928367 99928528 99926031 99922699 99920362 99919015 99917358 99914855 99912292 99910921 99911034 99911124 99909365
2773.9I9909365l642l898k235l99q53l516n907o163m822l755m447o920r072r024p880
$$ 99909365 99905723 99901825 99899590 99899191 99898338 99894822 99888915 99882752 99877930 99874175 99869728 99862808 99853736 99844712 99836832
2804.5I9836832p730r120j0300r673p934p498r108j1486j2213r840o777p230j2201
$$ 99836832 99829102 99819982 99809682 99800009 99792075 99784577 99775469 99763983 99751770 99741930 99735153 99727923 99715722
2831I9715722j8764k3860k7382l0923l6019m1187m2331l8624l2478k5946k0624j5693
$$ 99715722 99696958 99673098 99645716 99614793 99578774 99537587 99495256 99456632 99424154 99398208 99377584 99361891
2855.5I9361891q917j306L541L761N42l504o277p629r459j1957j3596j3745j2642j1986
$$ 99361891 99352974 99351668 99355209 99358970 99359512 99356008 99349731 99342102 99332643 99320686 99307090 99293345 99280703 99268717
2884I9268717j3650j6016j6725j6540j6677j6672j6457j6462j6785j8025k0879k5177
$$ 99268717 99255067 99239051 99222326 99205786 99189109 99172437 99155980 99139518 99122733 99104708 99083829 99058652
2908.5I9058652l0750l5149l5262l1799k7126k2018j6415r698Q9J3167K6155L5041
$$ 99058652 99027902 98992753 98957491 98925692 98898566 98876548 98860133 98850435 98850524 98863691 98889846 98924887
2933I8924887L8487L8564L7366L4470K8598K1005J4555R966O843N638N478N990R728
$$ 98924887 98963374 99001938 99039304 99073774 99102372 99123377 99137932 99147898 99154741 99160379 99165857 99171847 99181575
2959.5I9181575J6903K4927L1883L6287L8046L7795L5208L0560K4974K0134J6594J3745
$$ 99181575 99198478 99223405 99255288 99291575 99329621 99367416 99402624 99433184 99458158 99478292 99494886 99508631
2984I9508631J0872P361L821J067j371k229n25P69k4k002m280n114m190m477q696j4245
$$ 99508631 99519503 99526864 99530685 99531752 99530381 99528152 99527627 99528396 99528372 99526370 99522090 99516976 99512786 99508309 99499613 99485368
3016.6I9485368j6243j5145j5396j8358k0141j7738j3650j1491j0383j0336j3000j5682
$$ 99485368 99469125 99453980 99438584 99420226 99400085 99382347 99368697 99357206 99346823 99336487 99323487 99307805
3041.1I9307805j6659j9121k4605k9034k8431k4825k2894k2620k2227k2149k2322k0814
$$ 99307805 99291146 99272025 99247420 99218386 99189955 99165130 99142236 99119616 99097389 99075240 99052918 99032104
3065.5I9032104j6755j4096j5533j7482j7417j8579k2679k6691k8294k8223k8771l1501
$$ 99032104 99015349 99001253 98985720 98968238 98950821 98932242 98909563 98882872 98854578 98826355 98797584 98766083
3090I8766083l4762l5506l4112l2538l0464k7138k3979k2298k2328k4557k7633k9975
$$ 98766083 98731321 98695815 98661703 98629165 98598701 98571563 98547584 98525286 98502958 98478401 98450768 98420793
3114.5I8420793l3283l6383l8105l9673l9792l9470m1336m3756m4054m1908l8087l5036
$$ 98420793 98387510 98351127 98313022 98273349 98233557 98194087 98152751 98108995 98064941 98023033 97984946 97949910
3139I7949910l4904l6955l8976m0817m2963m4596m6188m7624m8232m9943n3608n6964
$$ 97949910 97915006 97878051 97839075 97798258 97755295 97710699 97664511 97616887 97568655 97518712 97465104 97408140
3163.4I7408140n7710n6248n3251n0616n0581n1820n2679n3805n5665n7739n9491o0707
$$ 97408140 97350430 97294182 97240931 97190315 97139734 97087914 97035235 96981430 96925765 96868026 96808535 96747828
3187.9I6747828o1191o2155o4022o4593o4212o4355o4522o4373o3056o0892o0982o4009
$$ 96747828 96686637 96624482 96560460 96495867 96431655 96367300 96302778 96238405 96175349 96114457 96053475 95989466
3212.4I5989466o6769o6275o2865n9581n8198n8299n9605o1994o2448n9295n7447n9366
$$ 95989466 95922697 95856422 95793557 95733976 95675778 95617479 95557874 95495880 95433432 95374137 95316690 95257324
3236.9I5257324o0540n8967n8347n9557n9945n8394n5778n3466n1790n0581n0336m9472
$$ 95257324 95196784 95137817 95079470 95019913 94959968 94901574 94845796 94792330 94740540 94689959 94639623 94590151
3261.3I4590151m5961m3148m5508n0664n3626n4139n5313n6636n6416n6160n6445n6845
$$ 94590151 94544190 94501042 94455534 94404870 94351244 94297105 94241792 94185156 94128740 94072580 94016135 93959290
3285.8I3959290n6875n6237n5259n4700n5837n9611o5124p0935p6819q3011q7524q8435
$$ 93959290 93902415 93846178 93790919 93736219 93680382 93620771 93555647 93484712 93407893 93324882 93237358 93148923
3310.3I3148923q8269r0897r6291j02997j07229j05142j00756r9182r9945j02264j05899
$$ 93148923 93060654 92969757 92873466 92770469 92663240 92558098 92457342 92358160 92258215 92155951 92050052
3332.7I2050052j08278j09112j12307j17290j20056j21528j25116j32215j38068j35112
$$ 92050052 91941774 91832662 91720355 91603065 91483009 91361481 91236365 91104150 90966082 90830970
3353.1I0830970j24425j17046j17206j19454j20663j20312j18888j18947j21641j24407
$$ 90830970 90706545 90589499 90472293 90352839 90232176 90111864 89992976 89874029 89752388 89627981
3373.5H9627981j24210j20526j17660j18297j14137j01120q8274q3739q4620q4967
$$ 89627981 89503771 89383245 89265585 89147288 89033151 88932031 88843757 88760018 88675398 88590431
3393.9H8590431q3703q2039q1277q3495q9365r3692r1493q6070q2820q0162p2736o1709
$$ 88590431 88506728 88424689 88343412 88259917 88170552 88076860 87985367 87899297 87816477 87736315 87663579 87601870
3418.4H7601870n1218m1908l5185l1238l0137l4302l6627l3164l0404k6328j9794j5349
$$ 87601870 87550652 87508744 87473559 87442321 87412184 87377882 87341255 87308091 87277687 87251359 87231565 87216216
3442.9H7216216j1772n728J687R591K2059L6568M2569M1211L9530L6973L7932M5526
$$ 87216216 87204444 87198716 87200403 87209994 87232053 87268621 87311190 87352401 87391931 87428904 87466836 87512362
3467.3H7512362M9853M7791M6558M9018N0271M9794N4901O4469O6376O3574P0542P7397
$$ 87512362 87562215 87610006 87656564 87705582 87755853 87805647 87860548 87925017 87991393 88054967 88125509 88202906
3491.8H8202906P4374P1651P5919Q5061R1917R2750Q9282Q4883Q0538P6479Q2761R4300
$$ 88202906 88277280 88348931 88424850 88509911 88601828 88694578 88783860 88868743 88949281 89025760 89108521 89202821
3516.3H9202821R1744Q8405J02634J15317J14607J06156R8950J08951J18989J10513
$$ 89202821 89294565 89382970 89485604 89600921 89715528 89821684 89920634 90029585 90148574 90259087
3536.7I0259087J04952J11896J15090J17684J34647J24067N8478L6597R0981J34015
$$ 90259087 90364039 90475935 90591025 90708709 90843356 90967423 91025901 91062498 91153479 91287494
3557.1I1287494J33258J19859J25038J55646J79803J62423J13487J10627J53815J65862
$$ 91287494 91420752 91540611 91665649 91821295 92001098 92163521 92277008 92387635 92541450 92707312
3577.5I2707312J37949R4146O4510J12962J97161K14439J68604J38330J43356J58023
$$ 92707312 92845261 92939407 93003917 93116879 93314040 93528479 93697083 93835413 93978769 94136792
3597.9I4136792J64295R7191K2274J02288K28524K32506J05792L2735J06215J85109
$$ 94136792 94301087 94398278 94420552 94522840 94751364 94983870 95089662 95122397 95228612 95413721
3618.3I5413721K26217K19137J85406K01332K42758K06560M7499p5388J4848J57183
$$ 95413721 95639938 95859075 96044481 96245813 96488571 96695131 96742630 96667242 96682090 96839273
3638.7I6839273J59860Q8596K4360Q3417K30008K62499J79261J18298J29532N4139
$$ 96839273 96999133 97087729 97112089 97195506 97425514 97688013 97867274 97985572 98115104 98169243
3659I8169243m4113p8905j04582N686J67150J20097l0857j3078J00917J68312J89095
$$ 98169243 98125130 98046225 97941643 97947329 98114479 98234576 98203719 98190641 98291558 98459870 98648965
3681.5I8648965J26922r387l6460K3388j5360l9279j9026K5421J03152J02347m541
$$ 98648965 98775887 98766500 98730040 98753428 98738068 98698789 98679763 98705184 98808336 98910683 98906142
3703.9I8906142q6135l5119L6716P6849Q7213J2571j19645j59698o9851M321o2626
$$ 98906142 98820007 98784888 98821604 98898453 98985666 98998237 98878592 98718894 98649043 98653364 98590738
3726.4I8590738j91719r2399M8262k2620p1984L6740J39421J66130J99807K21145J46502
$$ 98590738 98399019 98306620 98354882 98332262 98260278 98297018 98436439 98602569 98802376 99023521 99170023
3748.8I9170023N8186O0290J41824J94454J15931q232j6975l6472j04880m8596O2370
$$ 99170023 99228209 99288499 99430323 99624777 99740708 99732476 99715501 99679029 99574149 99525553 99587923
3771.2I9587923O7520L5066N7638O5308J8567m7386j42014j20168l3892m0686l1519
$$ 99587923 99655443 99690509 99748147 99813455 99832022 99784636 99642622 99522454 99488562 99447876 99416357
3793.7I9416357K8497O5935K4342j066r543m2576J5688P3570O5237M8811j389n0163
$$ 99416357 99444854 99510789 99535131 99534065 99524522 99481946 99497634 99571204 99636441 99685252 99683863 99633700
3818.1I9633700l4845p6354q5330K5797R2930Q2832Q0133Q0746j23739k99466r2876
$$ 99633700 99598855 99522501 99437171 99462968 99555898 99638730 99718863 99799609 99675870 99376404 99283528
3840.6I9283528J03397J47825J03116L5208J6022n3370j30063o3431M5728J43695J81484
$$ 99283528 99386925 99534750 99637866 99673074 99689096 99635726 99505663 99442232 99487960 99631655 99813139
3863I9813139J10889l2455k31784j88530Q4978J25593N4157M6218N5718J7899r0271
$$ 99813139 99924028 99891573 99659789 99471259 99556237 99681830 99735987 99782205 99837923 99855822 99765551
3885.4I9765551j54865q8149K5916R7078P8917M8494L4112j5575K778M2236J1545L3724
$$ 99765551 99610686 99522537 99548453 99645531 99724448 99772942 99807054 99791479 99794257 99836493 99848038 99881762
3909.9I9881762Q7917q7929L0297j32817q9287J371P1907O4247L6967K1583k0903m5479
$$ 99881762 99969679 99881750 99912047 99779230 99689943 99691314 99763221 99827468 99864435 99886018 99865115 99819636
3934.4I9819636j1134J8937J2952J3297J6428r281k2316Q297L5811L0839O896j5545
$$ 99819636 99808502 99827439 99840391 99853688 99870116 99860835 99838519 99846816 99882627 99913466 99920362 99904817
3958.9I9904817j0621k45r268o634J1837J9157J2869M703j377j389O485Q994M751K670
$$ 99904817 99894196 99893951 99884683 99878049 99889886 99909043 99921912 99926615 99925238 99923849 99930334 99939328 99944079 99946749
3987.4I9946749K164N263J3184J7262J5378
$$ 99946749 99948913 99954176 99967360 99984622 100000000
3997.6A00000000
$$ 100000000
##END=$$ End of the data block
