##TITLE=AD 09 $$ Begin of the data block
##JCAMP-DX=5.00 $$ ACD/SpecManager v 10.08
##SPECTROMETER/DATA SYSTEM=Alpha
##DATE=16 Dec 2014 10:37:32
##DATA TYPE=INFRARED SPECTRUM
##DATA CLASS=XYDATA
##ORIGIN=
##OWNER=
##NPOINTS=1765
##FIRSTX=399.76428223
##LASTX=3997.64306641
##MAXX=3997.64306641
##MINX=399.76428223
##MAXY=1.00000000
##MINY=0.39359391
##XFACTOR=1.0000000000
##YFACTOR=0.000000010000000
##FIRSTY=1.00000000
##DELTAX=2.03961372
##XUNITS=1/CM
##YUNITS=ARBITRARY UNITS
##XYDATA=(X++(Y..Y))
399.8 100000000 98783213 97593480 96444887 95332563 94254190 93207663 92184579 91170961
416.1 91170961 90152168 89121360 88079882 87026286 85957217 84875685 83787590 82698661 81616545
434.4 81616545 80558455 79531097 78525406 77545661 76601952 75694740 74823153 73990351 73205727
452.8 73205727 72474200 71798396 71189356 70651132 70181334 69775939 69428164 69139105 68915755 68752939
473.2 68752939 68644029 68590277 68587422 68627602 68703616 68810081 68949538 69130158 69353431 69614023 69908106
495.6 69908106 70235586 70596796 70997787 71450865 71962374 72533417 73166609 73870087 74646318 75490737
516 75490737 76405126 77398515 78471321 79615903 80825973 82089335 83394188 84731501 86089867
534.4 86089867 87452912 88797289 90100610 91351801 92545706 93666339 94695783 95627236 96460664
552.7 96460664 97199661 97846979 98402846 98868251 99246073 99541014 99758530 99903357 99981290 99981290 99981290 99981290 99981290 99981290 99981290 99981290 99981290 99981290 99981290 99981195
593.5 99981195 99999899 99999434 99999434 99999434 99999326 99999893 99997938 99998128 99998128 99998128 99998128 99996978 99998850 99998862 99998862 99998862 99994200 99995339 99977732 99944115 99895334
636.4 99895334 99832571 99753553 99657613 99544871 99416399 99278581 99132943 98969823 98793876 98612696
656.8 98612696 98425597 98233092 98039252 97845358 97649437 97450280 97246146 97036034 96821898 96605420
677.2 96605420 96384394 96151388 95895076 95612168 95320368 95028269 94731021 94425249 94110125 93785769
697.5 93785769 93453902 93117112 92774218 92420572 92051142 91662514 91253263 90823364 90372896 89901435
717.9 89901435 89410001 88900149 88373357 87832212 87279081 86713392 86133420 85537940 84925598 84297532
738.3 84297532 83658147 83012205 82364595 81720960 81086373 80468631 79878581 79325920 78818727 78362954
758.7 78362954 77961355 77614808 77325469 77097094 76933557 76836044 76802427 76829857 76918352 77068877 77279770
781.2 77279770 77548951 77873468 78249443 78676468 79157990 79697073 80294144 80946678 81652486 82411444
801.6 82411444 83222234 84080893 84980386 85909200 86850476 87785196 88696212 89565766 90371436 91086656
822 91086656 91683578 92137200 92428023 92542017 92471784 92215657 91776603 91164970 90399802 89505929
842.4 89505929 88510704 87440979 86320597 85169595 84004456 82837796 81679422 80537051 79414940
860.7 79414940 78313369 77230614 76164198 75113332 74080449 73066866 72069818 71085238 70109671
879.1 70109671 69142145 68184769 67239404 66304809 65378594 64459854 63549703 62650830 61766297 60897845
899.5 60897845 60046750 59214580 58402377 57611620 56844348 56101340 55382669 54688674 54020029 53378111
919.9 53378111 52764344 52178961 51621145 51089770 50583827 50102395 49644524 49208927 48794314 48399076
940.3 48399076 48020852 47657683 47308517 46972483 46648499 46335381 46032351 45738751 45454040 45177966
960.7 45177966 44910249 44650668 44398749 44153535 43914783 43682903 43457770 43239114 43027192 42822444
981.1 42822444 42624500 42433122 42249078 42072940 41904896 41744718 41591576 41444215 41301513 41162747
1001.4 41162747 41027507 40895167 40764573 40635455 40508831 40385452 40265220 40149060 40038610 39935127
1021.8 39935127 39839047 39750415 39669350 39596188 39531937 39477223 39432180 39397037 39372468 39359394 39359391 39373809
1046.3 39373809 39403355 39448521 39509729 39587173 39680442 39788696 39910975 40046588 40194049 40351564 40518779
1068.8 40518779 40695935 40882638 41078061 41281623 41492134 41708001 41927934 42151296 42377761 42605963
1089.2 42605963 42833206 43057668 43278670 43495125 43706521 43912998 44114512 44310746 44501954 44688821
1109.6 44688821 44871467 45049903 45224553 45396179 45565662 45733911 45901629 46069553 46238148 46407399
1129.9 46407399 46577159 46747506 46919072 47092441 47267586 47443938 47620952 47797912 47974685 48151940
1150.3 48151940 48330292 48510444 48692998 48878261 49067193 49260861 49459812 49664494 49875304 50092405
1170.7 50092405 50315404 50543928 50777674 51016146 51258826 51504952 51753664 52004719 52258795 52517205
1191.1 52517205 52781147 53050828 53326017 53606969 53894418 54189670 54493803 54806578 55126947 55454361
1211.5 55454361 55788517 56129622 56478083 56833476 57194990 57561618 57932508 58307111 58684915 59064966
1231.9 59064966 59446067 59827095 60206711 60583335 60955381 61321390 61680645 62032759 62376678 62711799
1252.3 62711799 63037854 63355148 63664925 63967985 64264649 64555407 64841115 65122485 65400016 65674418
1272.7 65674418 65945846 66213751 66477603 66736907 66991830 67243218 67490965 67734438 67972738 68205649
1293.1 68205649 68433744 68658501 68881464 69101298 69316751 69529891 69741881 69951928 70159686 70365030
1313.5 70365030 70567966 70767915 70963323 71152174 71336901 71524477 71715128 71903878 72088164 72267783
1333.9 72267783 72445112 72621888 72796977 72969157 73134893 73291951 73448950 73610932 73771554 73927915
1354.3 73927915 74080443 74229914 74379408 74528140 74674141 74816203 74946326 75055259 75153697 75257927
1374.7 75257927 75363028 75466377 75582558 75713241 75853348 76000595 76148295 76301330 76464897 76628375
1395.1 76628375 76784188 76928055 77047592 77146304 77257627 77385926 77511847 77634072 77758491 77888316
1415.5 77888316 78022408 78142393 78250152 78371316 78499764 78622383 78735703 78836638 78930736 79033983
1435.9 79033983 79151636 79253221 79342580 79459816 79592657 79716945 79830897 79943031 80059624 80175430
1456.3 80175430 80290365 80417633 80555588 80697298 80841845 80981821 81099892 81192434 81304282 81464279
1476.7 81464279 81621188 81746900 81870532 82008111 82136816 82236409 82324064 82455194 82622099 82789731
1497.1 82789731 82937640 83063352 83172625 83274686 83398026 83542228 83677912 83804053 83927703 84038907
1517.5 84038907 84134287 84198970 84233892 84307969 84423274 84543341 84652168 84747648 84835267 84916997 84998679
1539.9 84998679 85059220 85119301 85216087 85317093 85403246 85474312 85519296 85553062 85608518 85679317 85753322
1562.4 85753322 85819823 85862696 85881317 85878110 85855126 85822809 85820252 85845071 85852361 85838944 85813570 85787725
1586.8 85787725 85764778 85728264 85684007 85655320 85628510 85581070 85517174 85457659 85398656 85331053 85263085 85199815
1611.3 85199815 85141134 85084552 85014796 84922540 84843200 84799296 84781641 84777117 84767371 84766734 84816688 84902138
1635.8 84902138 84994352 85139525 85337961 85552186 85757691 85954422 86138785 86306578 86485761 86682159
1656.2 86682159 86865157 87025309 87175936 87336618 87494707 87620199 87768090 87976754 88186777 88369209
1676.6 88369209 88518882 88648981 88768148 88872367 88988298 89121717 89249527 89371783 89484948 89569801
1697 89569801 89619809 89660454 89736640 89829618 89907038 89958519 89979738 89984185 89986783 89987898 90008730 90047872 90090513
1723.5 90090513 90136689 90184134 90229285 90275407 90337187 90434945 90554643 90666932 90764230 90846717 90912491
1745.9 90912491 90969604 91022336 91079354 91132838 91170591 91212195 91265863 91317862 91363287 91409963 91464353 91520548
1770.4 91520548 91567850 91602308 91629928 91665125 91710937 91752046 91783053 91815341 91858703 91915262 91971970 92019057
1794.9 92019057 92062426 92106056 92146194 92182124 92212820 92235482 92260283 92298263 92339897 92383933 92438203 92499751
1819.4 92499751 92559975 92615044 92663795 92707008 92754257 92808861 92863786 92915243 92961043 92999822 93035334 93071902
1843.8 93071902 93110394 93153471 93195581 93229413 93264174 93307042 93350893 93393457 93443602 93500191 93553644 93601668
1868.3 93601668 93644661 93682128 93717223 93753278 93788695 93822747 93856466 93893152 93938333 93988109 94033647 94074690
1892.8 94074690 94115466 94157553 94198519 94235659 94271642 94310373 94354135 94403207 94453806 94503754 94552004 94596934
1917.3 94596934 94638819 94678140 94714522 94748414 94783700 94822538 94861609 94899678 94940382 94984251 95029205 95075196
1941.7 95075196 95120347 95163119 95204109 95243245 95281523 95320398 95359284 95398062 95439804 95484841 95529664 95572937
1966.2 95572937 95615178 95656639 95697397 95737427 95777512 95819062 95861292 95903015 95945162 95987725 96028727 96067750
1990.7 96067750 96105838 96143258 96179438 96213806 96246862 96280134 96314883 96351409 96388876 96423632 96452904 96478814
2015.2 96478814 96504122 96529597 96555322 96581316 96607608 96634483 96662277 96691185 96721733 96754026 96787333 96819955
2039.6 96819955 96849173 96873307 96894938 96917123 96940368 96964234 96987945 97010833 97033250 97056144 97079438 97102195
2064.1 97102195 97123873 97144949 97166038 97187173 97208196 97229308 97250497 97271818 97293955 97316879 97339720 97362161
2088.6 97362161 97384447 97406799 97429419 97452247 97475082 97497922 97520888 97544426 97569025 97594559 97620070 97644860
2113.1 97644860 97668976 97692686 97716516 97740889 97765434 97789580 97813582 97838026 97862977 97888350 97913927 97939402
2137.5 97939402 97964829 97990155 98015237 98040038 98064780 98089784 98115373 98140985 98165560 98188967 98212385 98236662
2162 98236662 98261571 98286551 98311484 98336446 98361778 98387414 98413157 98438913 98464835 98491061 98516881 98541182
2186.5 98541182 98563898 98586142 98608661 98631388 98654014 98676592 98699135 98721498 98743796 98766118 98788381 98810524
2211 98810524 98832440 98853952 98874968 98895609 98915941 98935854 98955154 98973829 98992354 99010897 99029005 99046564
2235.4 99046564 99063855 99080926 99097651 99114299 99131143 99148101 99164957 99181205 99196488 99211317 99226540 99242312
2259.9 99242312 99258304 99273890 99288940 99304038 99319750 99336278 99353582 99370909 99386859 99400550 99412286 99422646
2284.4 99422646 99431688 99439502 99445635 99449432 99450994 99450785 99449027 99446017 99441457 99434519 99424577 99412233 99398512 99383348
2312.9 99383348 99366206 99348009 99330348 99314064 99299258 99285173 99269730 99251604 99236655 99233252 99242300 99257398
2337.4 99257398 99272096 99283379 99289888 99291003 99287492 99281317 99273390 99264330 99256206 99251193 99251205 99260676 99287325 99333578
2366 99333578 99393553 99459541 99527061 99593794 99657542 99716026 99766791 99808455 99841654 99868399 99890083 99906296
2390.4 99906296 99916357 99921149 99923289 99925613 99929619 99935037 99940562 99944985 99948400 99951559 99954855 99958384 99961883 99964708
2419 99964708 99966615 99968129 99970198 99973154 99976420 99978918 99980497 99982041 99984246 99986833 99989200 99990743 99991155 99991155 99991506 99992543
2451.6 99992543 99994165 99995786 99996930 99997795 99998558 99998999 99999321 99999809 99999809 99999458 99999648 99999231 99999237 99999666 99999404 99999738 99998957 99998236 99998420
2490.4 99998420 99999392 99999082 99999696 99998939 99998248 99997908 99998367 99999380 99999028 99999648 99998665 99997884 99997973 99998778 99999654 99999213 99999559 99998719 99998337
2529.1 99998337 99998480 99998564 99998403 99998331 99998552 99999076 99999672 99999619 99999946 99999636 99999201 99998772 99998546 99998415 99998128 99997979 99998212 99998593 99998927 99999285
2569.9 99999285 99999696 99999636 99999940 99999321 99998266 99996966 99995637 99994993 99995559 99996895 99998236 99999022 99998903 99998391 99998301 99998772 99999511 99999326
2606.6 99999326 99999815 99999046 99998176 99997872 99998420 99999380 99999326 99999946 99999422 99998635 99997878 99997604 99997771 99998122 99998635 99999177 99999613 99999857 99999857 99999541
2647.4 99999541 99999690 99999040 99998683 99998742 99998826 99998611 99998194 99998063 99998641 99999565 99999183 99999619 99999076 99999011 99999338 99999583 99999732 99999964 99999899 99999291
2688.2 99999291 99998719 99998856 99999511 99999261 99999750 99998564 99996847 99995750 99996156 99997461 99998260 99998140 99997741 99997383 99997067 99996626 99995935 99994910
2724.9 99994910 99993676 99992853 99992883 99993539 99994195 99994731 99995458 99996531 99997818 99998993 99999791 99999404 99999613 99998915 99998385 99998331 99998820 99999535 99999535 99999261
2765.7 99999261 99999726 99999487 99999398 99999070 99998260 99997020 99995840 99995154 99994868 99994397 99993330 99991441 99988580 99985170 99981916 99978441 99974096
2800.4 99974096 99968797 99962729 99956721 99951530 99946821 99941987 99936867 99931479 99925613 99919438 99913287 99906981 99900216 99892539
2828.9 99892539 99882841 99869996 99853241 99831873 99805659 99774790 99740297 99704850 99671394 99641252 99614871 99593031
2853.4 99593031 99576497 99565321 99558932 99556428 99556482 99557042 99556136 99552774 99547225 99540132 99532515 99525774 99519998 99513769 99506485
2884 99506485 99498296 99489129 99478561 99466306 99452597 99437922 99422705 99407387 99391574 99373907 99353355 99329835
2908.5 99329835 99303931 99275744 99245650 99215174 99185842 99159485 99138230 99124044 99118227 99121392 99133945 99154854
2933 99154854 99181157 99210060 99239492 99267006 99290013 99307007 99317908 99323463 99324638 99322820 99319422 99315399 99312103
2959.5 99312103 99311006 99312782 99317586 99325854 99337852 99353361 99371260 99390602 99411464 99434352 99459517 99486089
2984 99486089 99512130 99535692 99555570 99571097 99582100 99589479 99595022 99599373 99601984 99602664 99601465 99598986 99596369 99593574
3012.5 99593574 99589378 99583101 99575114 99566078 99555749 99543732 99531168 99520111 99511015 99502599 99493688 99483460 99471301
3039 99471301 99457526 99442786 99426478 99408174 99389154 99371177 99354559 99338126 99320960 99303138 99284959 99267161
3063.5 99267161 99250627 99234885 99218225 99199796 99180663 99162233 99144155 99125189 99104995 99084306 99063909 99043381
3088 99043381 99021178 98996753 98971105 98945349 98919261 98892319 98865461 98840171 98816782 98794067 98770064 98743993
3112.4 98743993 98716199 98687196 98657197 98625010 98589873 98553556 98516977 98478925 98439103 98398829 98359567 98322052
3136.9 98322052 98285764 98249078 98210967 98171216 98129964 98087287 98042786 97996300 97949147 97902143 97854060 97803658
3161.4 97803658 97751176 97697431 97643399 97589898 97536713 97482842 97427481 97370410 97312009 97252822 97193009 97132528
3185.9 97132528 97071183 97008353 96943778 96877760 96810621 96742320 96672845 96602827 96533334 96464431 96394998 96324039
3210.3 96324039 96251786 96179372 96107888 96037805 95968920 95900506 95831877 95762664 95692933 95623583 95555776 95489293
3234.8 95489293 95422995 95356387 95289510 95222700 95156664 95091838 95028615 94967169 94906706 94846803 94788194 94731718
3259.3 94731718 94677389 94624954 94573230 94520289 94465125 94408000 94349176 94289041 94228017 94165701 94101614 94036067
3283.8 94036067 93968636 93898749 93827909 93757838 93688172 93617386 93543434 93464231 93378776 93287200 93190694 93090904
3308.2 93090904 92989069 92884725 92776400 92663485 92545652 92423677 92300624 92178506 92056137 91931504
3328.6 91931504 91802669 91668367 91529959 91389710 91247833 91103637 90956968 90807706 90655160 90498632
3349 90498632 90339625 90181643 90026891 89874208 89720809 89565676 89409173 89252555 89097613 88944495
3369.4 88944495 88791955 88639802 88490468 88347214 88209510 88074791 87944520 87822700 87709844 87601966
3389.8 87601966 87495399 87389565 87285388 87183136 87081796 86979997 86878228 86779058 86684370 86593705
3410.2 86593705 86505318 86419648 86339295 86266673 86202455 86145449 86094177 86047769 86005557 85967606 85935509 85909379
3434.7 85909379 85888100 85871339 85858226 85848725 85844934 85848427 85857946 85873324 85897708 85932124 85972756 86016309
3459.2 86016309 86062235 86111474 86166131 86225861 86287469 86349440 86412996 86478776 86545706 86613184 86682326 86754829
3483.6 86754829 86831439 86913580 87002039 87093353 87184870 87278539 87376958 87479138 87581283 87681669 87780702
3506.1 87780702 87879324 87979227 88082314 88190252 88302153 88415688 88532466 88653558 88774246 88891709
3526.5 88891709 89007872 89126968 89251953 89379346 89506459 89636016 89769447 89904231 90039217 90175307
3546.9 90175307 90307635 90434176 90568781 90717906 90870726 91018575 91163737 91312325 91465616 91618437
3567.3 91618437 91766304 91911644 92063934 92224211 92385751 92546690 92708558 92877120 93062067 93255979
3587.7 93255979 93441087 93612486 93779641 93948233 94119072 94292396 94462633 94637376 94832534 95036292
3608.1 95036292 95226449 95396638 95566118 95748675 95935553 96115518 96280205 96430892 96577018 96718317
3628.5 96718317 96846926 96964180 97092980 97251582 97424650 97585648 97729951 97866136 98009795 98155260
3648.8 98155260 98279208 98374689 98455018 98528880 98591113 98651588 98718852 98796713 98894525 98993057 99062485
3671.3 99062485 99111003 99168861 99233842 99288613 99324560 99338114 99337029 99343711 99359709 99373704 99393654 99422842
3695.8 99422842 99458539 99493712 99517304 99528837 99546295 99582273 99622476 99653351 99668103 99662834 99648011 99644035
3720.2 99644035 99654585 99669421 99680847 99695253 99728531 99768007 99799520 99836588 99885470 99933410 99969423 99992859
3744.7 99992859 99981844 99988985 99972612 99962014 99954677 99940902 99910593 99868250 99831426 99803740 99786752 99787116
3769.2 99787116 99794573 99795967 99792898 99790192 99782640 99770063 99757379 99748945 99758291 99779969 99799955 99821061 99845892
3795.7 99845892 99868035 99878782 99884337 99888194 99892473 99903983 99914843 99918634 99917489 99911034 99905497 99907786 99912214
3822.2 99912214 99925023 99948716 99969214 99977797 99977052 99969268 99947095 99934739 99953139 99977756 99989402 99983495 99968165
3848.7 99968165 99954122 99940187 99934214 99946594 99969071 99991179 99981570 99990386 99968535 99944329 99944395 99964505 99972814
3875.2 99972814 99968648 99962080 99953496 99938184 99917310 99905378 99912781 99932212 99949247 99953812 99951190 99945891 99937081
3901.8 99937081 99932063 99927574 99918741 99913186 99907440 99891257 99870759 99861091 99867523 99885362 99902540 99909383 99908549 99904329
3930.3 99904329 99898231 99895483 99898314 99901551 99902570 99903864 99904627 99903595 99904299 99907893 99910307 99909347 99905998 99903017 99903184
3960.9 99903184 99905241 99908018 99912894 99919289 99925375 99930817 99936259 99941683 99947238 99953073 99958175 99962920 99968618 99974716 99980700
3991.5 99980700 99987167 99993783 100000000
3997.6 100000000
##END=$$ End of the data block
