##TITLE=AD 08 $$ Begin of the data block
##JCAMP-DX=5.00 $$ ACD/SpecManager v 10.08
##SPECTROMETER/DATA SYSTEM=Alpha
##DATE=17 Dec 2014 10:47:54
##DATA TYPE=INFRARED SPECTRUM
##DATA CLASS=XYDATA
##ORIGIN=
##OWNER=
##NPOINTS=1765
##FIRSTX=399.76428223
##LASTX=3997.64306641
##MAXX=3997.64306641
##MINX=399.76428223
##MAXY=1.00000000
##MINY=0.39453056
##XFACTOR=1.0000000000
##YFACTOR=0.000000010000000
##FIRSTY=1.00000000
##DELTAX=2.03961372
##XUNITS=1/CM
##YUNITS=ARBITRARY UNITS
##XYDATA=(X++(Y..Y))
399.8A00000000r78923r86683j019442j037967j054812j094276j132220j138180j120609
418.1I0436888j096845j075804j058185j031715r96911r61262r23396q82947q61687
436.5H1548136q45950q01725p55488p21664o83462o32340n76168n22077m67647m06748
456.9G5134867l38482k72811k11853j49870q7916l0059K4199P3779J11967J42527J78093
479.3G4574441K19410K55323K82293L09652L39485L66997L96157M30762M68821N03379
499.7G8146720N33235N72515O26122O77932P20209P70425Q32218Q88133R32450R77301
520.1H5677260J024127J060993J083165J090139J083243J058143J012791R56016Q89248
538.5I4935125Q04794P05093O05357N11557M19509L31062K53678J91247J44058J09160
$$ plain form
399.8 100000000 99021077 98034394 97014952 95976985 94922173 93827897 92695677 91557497 90436888
418.1 90436888 89340043 88264239 87206054 86174339 85177428 84216166 83292770 82409823 81548136
436.5 81548136 80702186 79900461 79144973 78423309 77739847 77107507 76531339 76009262 75541615 75134867
456.9 75134867 74796385 74523574 74311721 74161851 74073935 74043876 74068075 74141854 74253821 74396348 74574441
479.3 74574441 74793851 75049174 75331467 75641119 75980604 76347601 76743758 77174520 77643341 78146720
499.7 78146720 78679955 79252470 79878592 80556524 81276733 82047158 82879376 83767509 84699959 85677260
520.1 85677260 86701387 87762380 88845545 89935684 91018927 92077070 93089861 94045877 94935125
538.5 94935125 95739919 96445012 97050369 97561926 97981435 98312497 98566175 98757422 98901480 99010640
558.9I9010640Q2356O3717N5385N5719O0814O8456P7784Q6194R0111Q9127Q3983P4553
583.3I9898839N9342L5996%sj2398N823l2204m8196o0249o7496p2730p9906q6027q9157
626.2I9451637r3209j00077j09762j21426j33759j45608j56874j68180j77854j86783
646.6I8058105j96076j99532k04421k20179k34950k43288k49833k56562k64174k70551
667I5718539k72411k71458k71487k73490k75779k77567k79992k84178k97170l13557
687.3I2901450l20112l22175l24852l25125l23445l22181l20762l19219l21138l28475
707.7H9673966l38423l48663l60996l76850l92956m04638m12899m21477m31937m41926
728.1H5743201m49491m55981m63182m70656m76188m77755m77236m77100m73916m63444
$$ plain form
558.9 99010640 99092996 99156713 99212098 99267817 99328631 99397087 99474871 99561065 99651176 99740303 99824286 99898839
583.3 99898839 99958181 99994177 99994177 99994177 99994177 99994177 99994177 99994177 99994177 99994177 99994177 99981779 99987602 99955398 99907202 99846953 99779457 99706727 99626821 99540794 99451637
626.2 99451637 99358428 99258351 99148589 99027163 98893404 98747796 98590922 98422742 98244888 98058105
646.6 98058105 97862029 97662497 97458076 97237897 97002947 96759659 96509826 96253264 95989090 95718539
667 95718539 95446128 95174670 94903183 94629693 94353914 94076347 93796355 93512177 93215007 92901450
687.3 92901450 92581338 92259163 91934311 91609186 91285741 90963560 90642798 90323579 90002441 89673966
707.7 89673966 89335543 88986880 88625884 88249034 87856078 87451440 87038541 86617064 86185127 85743201
728.1 85743201 85293710 84837729 84374547 83903891 83427703 82949948 82472712 81995612 81521696 81058252
748.5H1058252m47875m30835m10318l83347l52508l21597k89983k53379k11483j67591
768.9G7789336j22410p4434k5391K1493O5368J06162J44285J78909K10083K39885K69687
791.4G8802973K97844L23230L46113L66622L82972L90541L85893L68720L39204K93845
811.8H2297957K30050J51205O1715l5888j39123k45482l50446m49013n40108o23321
832.2H0357546o96350p55596p99453q29536q48794q59981q64077q62247q57633q52126
852.6G2131753q44580q35323q27051q21548q16429q08304p96950p83384p67696p49213
873F4081275p29024p10165o92785o74141o54256o35505o18934o03688n88256n72956
893.4E7601565n58102n42092n23818n04345m85384m68153m52488m38053m25833m16351
$$ plain form
748.5 81058252 80610377 80179542 79769224 79385877 79033369 78711772 78421789 78168410 77956927 77789336
768.9 77789336 77666926 77592492 77567101 77588594 77653962 77760124 77904409 78083318 78293401 78533286 78802973
791.4 78802973 79100817 79424047 79770160 80136782 80519754 80910295 81296188 81664908 82004112 82297957
811.8 82297957 82528007 82679212 82740927 82705039 82565916 82320434 81969988 81520975 80980867 80357546
832.2 80357546 79661196 78905600 78106147 77276611 76427817 75567836 74703759 73841512 72983879 72131753
852.6 72131753 71287173 70451850 69624799 68803251 67986822 67178518 66381568 65598184 64830488 64081275
873 64081275 63352251 62642086 61949301 61275160 60620904 59985399 59366465 58762777 58174521 57601565
893.4 57601565 57043463 56501371 55977553 55473208 54987824 54519671 54067183 53629130 53203297 52786946
913.7E2786946m09138m03017l98862l97849l99155m01741m04987m08583m12426m15489
934.1D8735699m16228m15224m13555m10515m04715l96240l86712l77223l67174l55103
954.5D4793010l41496l28165l16009l04181k91577k78726k66540k54637k42314k30813
974.9D1938552k21216k11958k01508j90529j80206j70493j60289j49408j39597j31088
995.3D0182260j21880j11234j00476q9877p8846o7767n6398m4519l2362j9741o104
1017.8C9453056Q095K2378L6842N1403O5610P9232R2531J05953J19892J32972J44118
1040.2D0312082J54346J64571J74055J81782J88109J94094J99550K02841K03767K03476
1060.6D2178673K02816K00969J97405J93590J90720J87978J84774J82173J80641J80167
$$ plain form
913.7 52786946 52377808 51974791 51575929 51178080 50778925 50377184 49972197 49563614 49151188 48735699
934.1 48735699 48319471 47904247 47490692 47080177 46675462 46279222 45892510 45515287 45148113 44793010
954.5 44793010 44451514 44123349 43807340 43503159 43211582 42932856 42666316 42411679 42169365 41938552
974.9 41938552 41717336 41505378 41303870 41113341 40933135 40762642 40602353 40452945 40313348 40182260
995.3 40182260 40060380 39949146 39848670 39758793 39679947 39612180 39555782 39511263 39478901 39459160 39453056
1017.8 39453056 39461151 39483529 39520371 39571774 39637384 39716616 39809147 39915100 40034992 40167964 40312082
1040.2 40312082 40466428 40630999 40805054 40986836 41174945 41369039 41568589 41771430 41975197 42178673
1060.6 42178673 42381489 42582458 42779863 42973453 43164173 43352151 43536925 43719098 43899739 44079906
1081D4079906J80185J80494J81470J83025J84822J86908J89182J90640J91557J92675
1101.4D5940864J94031J95471J97115J98367J98353J96889J94320J92120J90658J89453
1121.8D7887641J89150J90216J91295J92103J93757J96629K00197K03807K07391K11209
1142.2D9863395K15170K17712K18928K20644K22939K24966K27326K30688K35152K40577
1162.6E2117497K45779K50710K56592K63267K70236K77382K84237K90143K95288L00025
1183E4851156L04956L10576L17245L23975L30276L36921L44229L52007L59619L66669
1203.4E8197629L73787L81106L87389L92264L96389M00352M03905M05991M06236M05097
1223.8F2150145M03320M00669L96842L92633L88718L84092L78126L71647L65066L57748
$$ plain form
1081 44079906 44260091 44440585 44622055 44805080 44989902 45176810 45365992 45556632 45748189 45940864
1101.4 45940864 46134895 46330366 46527481 46725848 46924201 47121090 47315410 47507530 47698188 47887641
1121.8 47887641 48076791 48267007 48458302 48650405 48844162 49040791 49240988 49444795 49652186 49863395
1142.2 49863395 50078565 50296277 50515205 50735849 50958788 51183754 51411080 51641768 51876920 52117497
1162.6 52117497 52363276 52613986 52870578 53133845 53404081 53681463 53965700 54255843 54551131 54851156
1183 54851156 55156112 55466688 55783933 56107908 56438184 56775105 57119334 57471341 57830960 58197629
1203.4 58197629 58571416 58952522 59339911 59732175 60128564 60528916 60932821 61338812 61745048 62150145
1223.8 62150145 62553465 62954134 63350976 63743609 64132327 64516419 64894545 65266192 65631258 65989006
1244.2F5989006L49187L40313L31956L24112L15565L05778K96337K88379K81542K75231
1264.6F9097406K69544K64537K60198K55829K50739K45482K40612K35701K30372K25335
1285G1575755K20317K15375K10601K06035K02114J99151J96624J93447J89203J85197
1305.4G3593819J82969J81287J78921J76287J74510J73343J72126J69843J64479J57512
1325.8G5325096J52397J49208J46753J44207J41061J38658J37406J37282J38259J36912
1346.2G6747239J31827J28031J26380J22970J17612J12033J07622J05518J05441J04153
1366.6G7908826R7406Q5121P4709P5358Q4233R1386R4628R9296J05726J14280J22249
1389G8953218J25856J29527J35391J39046J36960J28215J13827J04696J07139J10841
$$ plain form
1244.2 65989006 66338193 66678506 67010462 67334574 67650139 67955917 68252254 68540633 68822175 69097406
1264.6 69097406 69366950 69631487 69891685 70147514 70398253 70643735 70884347 71120048 71350420 71575755
1285 71575755 71796072 72011447 72222048 72428083 72630197 72829348 73025972 73219419 73408622 73593819
1305.4 73593819 73776788 73958075 74136996 74313283 74487793 74661136 74833262 75003105 75167584 75325096
1325.8 75325096 75477493 75626701 75773454 75917661 76058722 76197380 76334786 76472068 76610327 76747239
1346.2 76747239 76879066 77007097 77133477 77256447 77374059 77486092 77593714 77699232 77804673 77908826
1366.6 77908826 78006232 78091353 78166062 78241420 78325653 78417039 78511667 78610963 78716689 78830969 78953218
1389 78953218 79079074 79208601 79343992 79483038 79619998 79748213 79862040 79966736 80073875 80184716
1409.4H0184716J10877J08003J03378J02163J04433J01614R8658J02156J08463J15066
1429.8H1239527J19383J18088J13416J14191J18506J10256R8562R6161R7298R8759
1450.2H2324147J01900J07861J16283J21790J26791J35064J44637J54274J66446J77002
1470.6H3676195J74076J53070J40465J44565J44744J35618J30272J32149J33306J22571
1491H5087031J02192R3597R7102J05256J11884J14477J09398R7907R5248R8580J00362
1513.4H6213034J04744J12557J20604J28877J23865J00296Q7250Q5944R0134R2661
1533.8H7259966R1970Q9800Q9628R2864P9751O9225P2771P7778Q3310Q6945Q0079O7210
1558.3H8241297O0934N7000N7930O1047O2066O1625N7966M4679J9914Q232M387l863
$$ plain form
1409.4 80184716 80295593 80403596 80506974 80609137 80713570 80815184 80913842 81015998 81124461 81239527
1429.8 81239527 81358910 81476998 81590414 81704605 81823111 81933367 82031929 82128090 82225388 82324147
1450.2 82324147 82426047 82533908 82650191 82771981 82898772 83033836 83178473 83332747 83499193 83676195
1470.6 83676195 83850271 84003341 84143806 84288371 84433115 84568733 84699005 84831154 84964460 85087031
1491 85087031 85189223 85282820 85379922 85485178 85597062 85711539 85820937 85918844 86014092 86112672 86213034
1513.4 86213034 86317778 86430335 86550939 86679816 86803681 86903977 86991227 87077171 87167305 87259966
1533.8 87259966 87351936 87441736 87531364 87624228 87703979 87773204 87845975 87923753 88007063 88094008 88174087 88241297
1558.3 88241297 88302231 88359231 88417161 88478208 88540274 88601899 88659865 88704544 88724458 88732690 88737077 88733214
1582.8H8733214j5312l0518m4101n4080o9606q8656r8461j00994j08087j24282j35678
1605.2H7863439j40971j46210j48380j47676j44613j36727j29414j23196j04446p2866
1625.6H6568940l2395J0567M3977P2837J03193J27793J52248J82795K13880K35724
1646H7679559K47389K57963K62398K57271K56693K58482K52771K38955K22797K14374
1666.4I0148652J92672J52480J33395J30171J27763J26045J21421J14370R7936P5388
1686.8I1420293O3169N6761N1350N4377O2037O3812M9353K8962K4885K9838L8022M4882
1711.3I1987741M3648L6711K6178J5104J4937J9986K8043M1521N6410O6411O4767N6940
1735.7I2458397O2335P6878Q7636R4355R5367Q8805P8863O9028O6698O1619M8333L9459
$$ plain form
1582.8 88733214 88717902 88687384 88643283 88589203 88519597 88430941 88332480 88231486 88123399 87999117 87863439
1605.2 87863439 87722468 87576258 87427878 87280202 87135589 86998862 86869448 86746252 86641806 86568940
1625.6 86568940 86536545 86547112 86591089 86663926 86767119 86894912 87047160 87229955 87443835 87679559
1646 87679559 87926948 88184911 88447309 88704580 88961273 89219755 89472526 89711481 89934278 90148652
1666.4 90148652 90341324 90493804 90627199 90757370 90885133 91011178 91132599 91246969 91344905 91420293
1686.8 91420293 91483462 91540223 91591573 91645950 91707987 91771799 91821152 91850114 91874999 91904837 91942859 91987741
1711.3 91987741 92031389 92068100 92094278 92109382 92124319 92144305 92172348 92213869 92270279 92336690 92401457 92458397
1735.7 92458397 92520732 92597610 92685246 92779601 92874968 92963773 93042636 93111664 93178362 93239981 93288314 93327773
1760.2I3327773L7890L6496L1352K7436L0738L8445M4918M5163L9691L8325M3923M6516
1784.7I3788666M1329L3230K9004L3706L9613M0835M1575M5114M9407N4353N7352N2947
1809.2I4307131M7558M6206M1139L4165L1871L4588L8708M2557M3273L8952L5483L5470
1833.6I4777101L7253M0865M3929M3350M0758L7688L5345L8147M0764L5971L0864L0225
1858.1I5232260K8205K2936K1309K3889K6757K9289L1442L1567L0970L1549L1948L1280
1882.6I5573401K7526K1946K1470K5725K9081K9606K9790L1865L3987L3629L1882K8718
1907.1I5918626K5719K5237K5946K7740L0267L2443L4648L7235L8320L6668L5501L6031
1931.5I6304381L5572L3981L3736L3408L2735L4243L6728L8714L9839L9518L9113L9702
$$ plain form
1760.2 93327773 93365663 93402159 93433511 93460947 93491685 93530130 93575048 93620211 93659902 93698227 93742150 93788666
1784.7 93788666 93829995 93863225 93892229 93925935 93965548 94006383 94047958 94093072 94142479 94196832 94254184 94307131
1809.2 94307131 94354689 94400895 94442034 94476199 94508070 94542658 94581366 94623923 94667196 94706148 94741631 94777101
1833.6 94777101 94814354 94855219 94899148 94942498 94983256 95020944 95056289 95094436 95135200 95171171 95202035 95232260
1858.1 95232260 95260465 95283401 95304710 95328599 95355356 95384645 95416087 95447654 95478624 95510173 95542121 95573401
1882.6 95573401 95600927 95622873 95644343 95670068 95699149 95728755 95758545 95790410 95824397 95858026 95889908 95918626
1907.1 95918626 95944345 95969582 95995528 96023268 96053535 96085978 96120626 96157861 96196181 96232849 96268350 96304381
1931.5 96304381 96339953 96373934 96407670 96441078 96473813 96508056 96544784 96583498 96623337 96662855 96701968 96741670
1956I6741670L9018L6436L4875L5446L6496L7390L7897L8201L8904L8480L6395L4952
1980.5I7186160L4481L3564L2592L2365L2818L3558L3837L3516L3492L3897L3784L2872
2005I7586936L1280K7681K1463J6141J4323J4991J6999J9544K2018K4039K6059K8610
2029.4I7850084L0929L2038L2538L2973L1746K7227K0999J8364J9783K0909K0736K0749
2053.9I8159075K1016K0916K0563K0325K0296K0325K0242K0188K0546K1028K1184K1410
2078.4I8407114K1994K2888K3597K3651K3348K3484K3705K3335K2793K2816K3139K2805
2102.9I8684669K1839K1255K1428K1708K1618K1118K0611K0564K0528J9985J9563K0003
2127.3I8934889K0492K0182J9527J9264J9485J9520J9217J9204J9580J9479J8966J8800
$$ plain form
1956 96741670 96780688 96817124 96851999 96887445 96923941 96961331 96999228 97037429 97076333 97114813 97151208 97186160
1980.5 97186160 97220641 97254205 97286797 97319162 97351980 97385538 97419375 97452891 97486383 97520280 97554064 97586936
2005 97586936 97618216 97645897 97667360 97683501 97697824 97712815 97729814 97749358 97771376 97795415 97821474 97850084
2029.4 97850084 97881013 97913051 97945589 97978562 98010308 98037535 98058534 98076898 98096681 98117590 98138326 98159075
2053.9 98159075 98180091 98201007 98221570 98241895 98262191 98282516 98302758 98322946 98343492 98364520 98385704 98407114
2078.4 98407114 98429108 98451996 98475593 98499244 98522592 98546076 98569781 98593116 98615909 98638725 98661864 98684669
2102.9 98684669 98706508 98727763 98749191 98770899 98792517 98813635 98834246 98854810 98875338 98895323 98914886 98934889
2127.3 98934889 98955381 98975563 98995090 99014354 99033839 99053359 99072576 99091780 99111360 99130839 99149805 99168605
2151.8I9168605J8221J6629J4919J4049J4061J4520J4722J4860J5848J7685J9807K1451
2176.3I9365377K2328K2900K3759K3967K2292K0301J9795TJ8894J7459J6492J6010
2200.8I9609369J5318J4425J4210J4364J3709J2404J1575J1337J1039J0782J0926J1188
2225.2I9760646J1092J0312R226Q727R125R531R346Q845Q595Q524P802O777O574O980
2253.8I9882102O789N722M834M798N132N382N454N406N627N621N018M220L505K605
2282.3I9952215J073r90k431k867l350m775o693p749q166r012j0258j1766j3697j6028
2310.9I9855506j8495k0313k1058k0791j9872j9282j9801k1481k3943k4170j9103r787
2335.4I9617410j705J562K116K092J180l82k235l904n317o729p230o193k921M918J7232
$$ plain form
2151.8 99168605 99186826 99203455 99218374 99232423 99246484 99261004 99275726 99290586 99306434 99324119 99343926 99365377
2176.3 99365377 99387705 99410605 99434364 99458331 99480623 99500924 99520719 99540514 99559408 99576867 99593359 99609369
2200.8 99609369 99624687 99639112 99653322 99667686 99681395 99693799 99705374 99716711 99727750 99738532 99749458 99760646
2225.2 99760646 99771738 99782050 99791276 99800003 99809128 99818659 99828005 99836850 99845445 99853969 99861771 99868548 99875122 99882102
2253.8 99882102 99888891 99894613 99899447 99904245 99909377 99914759 99920213 99925619 99931246 99936867 99941885 99946105 99949610 99952215
2282.3 99952215 99953288 99952298 99949867 99947000 99943650 99938875 99932182 99924433 99916267 99907255 99896997 99885231 99871534 99855506
2310.9 99855506 99837011 99816698 99795640 99774849 99754977 99735695 99715894 99694413 99670470 99646300 99627197 99617410
2335.4 99617410 99615705 99617267 99619383 99621475 99622655 99622273 99620038 99616134 99610817 99604088 99596858 99590665 99587744 99592662 99609894
2366I9609894K9593L7891M2516M5234M5222M2474L8338L2699K5708J9097J4269J0449
2390.4I9993384N799k372Q17l314l571l641k909j776j377k164l308l916l940l761l797
2421I9960154l868l594l481l839l987l636l177l016l350l791m106m560n061m917m119
2451.6I9901652l743m113m535m656m494m631n370o080o199o080o193o574o604o169
2480.2I9826211n961o193o425o360o610p242p415p325p481p808p981p701p272p605
2508.7I9726832q226q082p665p659q029q279q172p671p188p362p700p415p171p498
2537.3I9618715q023q338q125p659p790q035p587p260p487p617p469p945q750r143
2565.8I9507487r346r644r996j0186r972r603r411r209r072r084q934q637q720q941
$$ plain form
2366 99609894 99639487 99677378 99719894 99765128 99810350 99852824 99891162 99923861 99949569 99968666 99982935 99993384
2390.4 99993384 99999183 99996811 99997628 99994314 99990743 99987102 99984193 99982417 99981040 99978876 99975568 99971652 99967712 99963951 99960154
2421 99960154 99956286 99952692 99949211 99945372 99941385 99937749 99934572 99931556 99928206 99924415 99920309 99915749 99910688 99905771 99901652
2451.6 99901652 99897909 99893796 99889261 99884605 99880111 99875480 99870110 99864030 99857831 99851751 99845558 99838984 99832380 99826211
2480.2 99826211 99820250 99814057 99807632 99801272 99794662 99787420 99780005 99772680 99765199 99757391 99749410 99741709 99734437 99726832
2508.7 99726832 99718606 99710524 99702859 99695200 99687171 99678892 99670720 99663049 99655861 99648499 99640799 99633384 99626213 99618715
2537.3 99618715 99610692 99602354 99594229 99586570 99578780 99570745 99563158 99555898 99548411 99540794 99533325 99525380 99516630 99507487
2565.8 99507487 99498141 99488497 99478501 99468315 99458343 99448740 99439329 99430120 99421048 99411964 99403030 99394393 99385673 99376732
2594.4I9376732q935r095r716j0162j0127j0109j0264j0145r477q970r370r984r966
2620.9I9250412r340q833r162r805j0091j0252j0550j0854j1062j0932j0669j0663
2645.4I9128199j1224j1849j1641j1093j0836j0383r888r597r399r424r179q690q714
2671.9I8996282r162r375r346r680j0485j0800j0651j0318j0163j0526j0729j0633
2696.4I8874414j0967j1200j1092j0986j1175j1367j1146j0717j0765j0931j0491j0025
2720.9I8743552j0026j0275j0521j0699j0734j0717j0902j0973j0830j0544j0223r912
2745.3I8617196r489r108r363j0312j0884j0818j0789j1253j1825j1778j1564j2004
2769.8I8488009j2690j2475j1528j0991j1331j2034j2284j2028j2148j2529j2672j3250
$$ plain form
2594.4 99376732 99367797 99358702 99348986 99338824 99328697 99318588 99308324 99298179 99288702 99279732 99270362 99260378 99250412
2620.9 99250412 99241072 99232239 99223077 99213272 99203181 99192929 99182379 99171525 99160463 99149531 99138862 99128199
2645.4 99128199 99116975 99105126 99093485 99082392 99071556 99061173 99051285 99041688 99032289 99022865 99013686 99004996 98996282
2671.9 98996282 98987120 98977745 98968399 98958719 98948234 98937434 98926783 98916465 98906302 98895776 98885047 98874414
2696.4 98874414 98863447 98852247 98841155 98830169 98818994 98807627 98796481 98785764 98774999 98764068 98753577 98743552
2720.9 98743552 98733526 98723251 98712730 98702031 98691297 98680580 98669678 98658705 98647875 98637331 98627108 98617196
2745.3 98617196 98607707 98598599 98589236 98578924 98568040 98557222 98546433 98535180 98523355 98511577 98500013 98488009
2769.8 98488009 98475319 98462844 98451316 98440325 98428994 98416960 98404676 98392648 98380500 98367971 98355299 98342049
2794.3I8342049j4114j4723j5258j5706j6004j6266j6511j6755j6915j6946j6367j5474
2818.8I8151010j4978j4574j4418j4794j5432j6909k0105k4670k9809l4934l9935m4209
2843.2I7866243m6241m5312m2140l7825l2753k6739k0206j3929q887n609l576k909
2867.7I7580117l952n632p165q476r519j0049j0306j1247j3471j6093j7977j9300k0903
2894.2I7426027k2477k3299k3967k5595k8461l2127l6049m0036m3440m5067m4620m2874
2918.7I7018015l9720l4851k7657j7809o491M667J4221K0910K4622K5624K3687J9282
2943.2I7024500J4037R352M798l21m644o950p116n162j723K390O718J1092J5241J7965
2971.7I7080177J8585J8608J9294J9962J9664J8036J5384J2427R430O330L397J228
$$ plain form
2794.3 98342049 98327935 98313212 98297954 98282248 98266244 98249978 98233467 98216712 98199797 98182851 98166484 98151010
2818.8 98151010 98136032 98121458 98107040 98092246 98076814 98059905 98039800 98015130 97985321 97950387 97910452 97866243
2843.2 97866243 97820002 97774690 97732550 97694725 97661972 97635233 97615027 97601098 97592211 97586602 97583026 97580117
2867.7 97580117 97576165 97570533 97563368 97554892 97545373 97535324 97525018 97513771 97500300 97484207 97466230 97446930 97426027
2894.2 97426027 97403550 97380251 97356284 97330689 97302228 97270101 97234052 97194016 97150576 97105509 97060889 97018015
2918.7 97018015 96978295 96943444 96915787 96897978 96891487 96896154 96910375 96931285 96955907 96981531 97005218 97024500
2943.2 97024500 97038537 97047889 97052687 97052366 97047722 97040772 97033656 97028494 97026771 97029161 97035879 97046971 97062212 97080177
2971.7 97080177 97098762 97117370 97136664 97156626 97176290 97194326 97209710 97222137 97231567 97237897 97241294 97242522
2996.2I7242522K33J79r0j174k343k884l350m661o849r328j1176j2177j3423j4621
3024.7I7160858j4174j2118r674q004p374p396p946q964j0038j1623j4054j6213j6653
3051.3I7016627j5831j5581j5795j5736j5479j5092j4562j3816j2976j2910j3489j3435
3075.7I6841925j3500j4943j6767j7184j6737j7667k0307k2483k2351k0814k0004j9812
3100.2I6619356j9294j8245j6308j4448j5182j8501k1118k1785k2984k5892k8426k8365
3124.7I6368808k7079k7591k9403l0201k9821k8312k6554k6935k9272l1638l3069l4165
3149.2I6014768l6103l8147l9011l9255m0210m2134m3947m4942m5216m4906m4936m6241
3173.6I5509720m8363n0062n0676n1314n3161n5623n7721n9188o0022o0951o1959o2341
$$ plain form
2996.2 97242522 97242755 97242934 97242844 97241670 97239327 97236443 97233093 97228432 97221583 97212255 97201079 97188902 97175479 97160858
3024.7 97160858 97146684 97134566 97124892 97116888 97109514 97102118 97094172 97085208 97075170 97063547 97049493 97033280 97016627
3051.3 97016627 97000796 96985215 96969420 96953684 96938205 96923113 96908551 96894735 96881759 96868849 96855360 96841925
3075.7 96841925 96828425 96813482 96796715 96779531 96762794 96745127 96724820 96702337 96679986 96659172 96639168 96619356
3100.2 96619356 96600062 96581817 96565509 96551061 96535879 96517378 96496260 96474475 96451491 96425599 96397173 96368808
3124.7 96368808 96341729 96314138 96284735 96254534 96224713 96196401 96169847 96142912 96113640 96082002 96048933 96014768
3149.2 96014768 95978665 95940518 95901507 95862252 95822042 95779908 95735961 95691019 95645803 95600897 95555961 95509720
3173.6 95509720 95461357 95411295 95360619 95309305 95256144 95200521 95142800 95083612 95023590 94962639 94900680 94838339
3198.1I4838339o2591o3085o3080o2370o1858o2066o3098o5034o6853o7460o7443o7717
3222.6I4065684o8086o8927p0745p2205p1853p0334o9314o8915o8074o7032o6554o5953
3247.1I3237692o4236o1607n9235n6881n3567n0640m8995m7815m6491m5741m6319m7761
3271.5I2608404m9358n0837n1832n2983n4890n7512o0595o2972o4128o4785o5809o8587
3296I1904116p3755q0645q8430r6017j02895j08332j11830j15365j20586j27303j34922
3318.4I0744036j41495j44082j43779j44893j49041j55419j63001j69307j73324j77247
3338.8H9182448j82241j87397j93280k00438k07955k14827k19309k19798k19363k21980
3359.2H7115860k26384k30349k32392k31069k28709k28125k27344k22194k12038k01410
$$ plain form
3198.1 94838339 94775748 94712663 94649583 94587213 94525355 94463289 94400191 94335157 94268304 94200844 94133401 94065684
3222.6 94065684 93997598 93928671 93857926 93785721 93713868 93643534 93574220 93505305 93437231 93370199 93303645 93237692
3247.1 93237692 93173456 93111849 93052614 92995733 92942166 92891526 92842531 92794716 92748225 92702484 92656165 92608404
3271.5 92608404 92559046 92508209 92456377 92403394 92348504 92290992 92230397 92167425 92103297 92038512 91972703 91904116
3296 91904116 91830361 91749716 91661286 91565269 91462374 91354042 91242212 91126847 91006261 90878958 90744036
3318.4 90744036 90602541 90458459 90314680 90169787 90020746 89865327 89702326 89533019 89359695 89182448
3338.8 89182448 89000207 88812810 88619530 88419092 88211137 87996310 87777001 87557203 87337840 87115860
3359.2 87115860 86889476 86659127 86426735 86195666 85966957 85738832 85511488 85289294 85077256 84875846
3379.6H4875846j93602j85072j71090j55144j45054j40775j36655j31279j26839j24306
3400H3366030j23202j21934j19233j14852j09839j06055j02091r4330q2147o8885n7417
3422.5H2266045m7666l8839l0398k2423j5193q226j174O109J3703K2030L1674M1390
3446.9H2217032M9555N8389P0578Q3404R1344R3693R4163R5451R7782R9426R9767J00338
3471.4H3250922J01495J02347J02305J00494R9528J02835J08511J12503J13315J12545
3491.8H4306800J12182J13261J16050J19484J22696J25617J27327J28687J31142J33031
3512.2H5536277J33974J35696J37740J39350J41221J43379J45614J48380J51390J53732
3532.6H6966753J54620J53882J53058J53709J54161J53101J54191J57476J53112J42831
$$ plain form
3379.6 84875846 84682244 84497172 84326082 84170938 84025884 83885109 83748454 83617175 83490336 83366030
3400 83366030 83242828 83120894 83001661 82886809 82776970 82670915 82568824 82474494 82392347 82323462 82266045
3422.5 82266045 82218379 82179540 82149142 82126719 82111526 82103300 82102126 82108235 82121938 82143968 82175642 82217032
3446.9 82217032 82266587 82324976 82395554 82478958 82570302 82663995 82758158 82853609 82951391 83050817 83150584 83250922
3471.4 83250922 83352417 83454764 83557069 83657563 83757091 83859926 83968437 84080940 84194255 84306800
3491.8 84306800 84418982 84532243 84648293 84767777 84890473 85016090 85143417 85272104 85403246 85536277
3512.2 85536277 85670251 85805947 85943687 86083037 86224258 86367637 86513251 86661631 86813021 86966753
3532.6 86966753 87121373 87275255 87428313 87582022 87736183 87889284 88043475 88200951 88354063 88496894
3553H8496894J40696J46521J52915J57398J60772J65850J74480J83684J87463J87564
3573.4I0154237J92749K01029K05439K03508J95909J92225K00885K12771K17306K15728
3593.8I2191786K13718K12616K14064K11340J97536J88541J94824K03448J99676J84220
3614.2I4211769J75583J75250J79130J82575J79881J75267J74511J72978J59419J30743
3634.6I5917106J10441J09011J09780J03569R2226Q3298Q9222J00106J04469R9367
3655I6918595R4706Q7827O9350M6623K1559N036J0384J9562J7959J6439K5952M1145
3679.4I7375137N8037P2777P5471O8611O8033O6030N6106M5234L5280L2860L5745L4505
3703.9I8023826K5803J6665J2988J4925K2346K8938K4348J1200O712J2832J6231N460
$$ plain form
3553 88496894 88637590 88784111 88937026 89094424 89255196 89421046 89595526 89779210 89966673 90154237
3573.4 90154237 90346986 90548015 90753454 90956962 91152871 91345096 91545981 91758752 91976058 92191786
3593.8 92191786 92405504 92618120 92832184 93043524 93241060 93429601 93624425 93827873 94027549 94211769
3614.2 94211769 94387352 94562602 94741732 94924307 95104188 95279455 95453966 95626944 95786363 95917106
3634.6 95917106 96027547 96136558 96246338 96349907 96442133 96525431 96614653 96714759 96819228 96918595
3655 96918595 97013301 97101128 97170478 97217101 97238660 97243696 97254080 97273642 97291601 97308040 97333992 97375137
3679.4 97375137 97433174 97505951 97581422 97650033 97718066 97784096 97840202 97885436 97920716 97953576 97989321 98023826
3703.9 98023826 98049629 98066294 98079282 98094207 98116553 98145491 98169839 98181039 98187751 98200583 98216814 98222274
3728.4I8222274m769J651N573k467o175k110L028J0520K3108L1233K8450K3353K7507
3754.9I8361176L9464M7869M5210L8964L4737K3592J1557J1325J4651J5175J7911K3395
3779.4I8685026K4021K0200J0288k391o783q481j0544q279j330L773M352M649M88j448
3807.9I8713541L976R048J2302J4019J0359P218N383j133k604L832J2058J9646K8270
3834.4I8835915K6334M35j4556q011M089J3787J5771J5396J4830O336l898o092L070
3861I8903406K0468L3545L5364K0629o91K425J5814K0790K2787K5421K8145K4253J0258
3887.5I9162614k771m709L445J2261J5807J8334J8370J8216K2608K3466K2113K7234
3912I9336988L1566K4701J0925O74q83O336J4651J9050K1917K2685J9640J6713J5503
$$ plain form
3728.4 98222274 98217505 98219156 98224729 98222262 98216087 98213977 98217005 98227525 98250633 98281866 98310316 98333669 98361176
3754.9 98361176 98400640 98448509 98493719 98532683 98567420 98591012 98602569 98613894 98628545 98643720 98661631 98685026
3779.4 98685026 98709047 98729247 98739535 98737144 98730361 98721880 98711336 98703057 98701727 98705500 98709852 98714501 98714989 98713541
3807.9 98713541 98717517 98726565 98738867 98752886 98763245 98770463 98775846 98774713 98772109 98775941 98787999 98807645 98835915
3834.4 98835915 98862249 98862684 98848128 98840117 98844206 98857993 98873764 98889160 98903990 98910326 98906428 98900336 98903406
3861 98903406 98923874 98957419 98992783 99013412 99012721 99015146 99030960 99051750 99074537 99099958 99128103 99152356 99162614
3887.5 99162614 99159843 99155134 99158579 99170840 99186647 99204981 99223351 99241567 99264175 99287641 99309754 99336988
3912 99336988 99368554 99393255 99404180 99404854 99403971 99410307 99424958 99444008 99465925 99488610 99508250 99524963 99540466
3938.5I9540466J4037J3983J6415J6660J3435J2850J6672K0230K1660K0438J8043J7565
3962.9I9742454J7000J4859J3810J4365J5533J6940J7267J6457J5676J5128J4519J4240
3987.4I9928248J4561J4675J4430J4216J3870
3997.6A00000000
$$ plain form
3938.5 99540466 99554503 99568486 99584901 99601561 99614996 99627846 99644518 99664748 99686408 99706846 99724889 99742454
3962.9 99742454 99759454 99774313 99788123 99802488 99818021 99834961 99852228 99868685 99884361 99899489 99914008 99928248
3987.4 99928248 99942809 99957484 99971914 99986130 100000000
3997.6 100000000
##END=$$ End of the data block
