##TITLE=AD 07 $$ Begin of the data block
##JCAMP-DX=5.00 $$ ACD/SpecManager v 10.08
##SPECTROMETER/DATA SYSTEM=Alpha
##DATE=17 Dec 2014 10:47:54
##DATA TYPE=INFRARED SPECTRUM
##DATA CLASS=XYDATA
##ORIGIN=
##OWNER=
##NPOINTS=1765
##FIRSTX=399.76428223
##LASTX=3997.64306641
##MAXX=3997.64306641
##MINX=399.76428223
##MAXY=1.00000000
##MINY=0.73008627
##XFACTOR=1.0000000000
##YFACTOR=0.000000010000000
##FIRSTY=1.00000000
##DELTAX=2.03961372
##XUNITS=1/CM
##YUNITS=ARBITRARY UNITS
##XYDATA=(X++(Y..Y))
399.8A00000000l41684l05938l06452l39263l78192m02605m12530m27473m62365m54414
420.2I6169084l84241l47704l84837m27401l97164l20291k83814l24291l70157l27199
440.6I2601985k50417k37584k78581k87991k27207j59806j60492k01994j95825j25802
461I0476286o7061q0555j24258j14006m4507O491j2678n2196k8061M3404P8082M4745
485.4I0125686R280M1199J11371J34355R6315O9136J05184J65123J71733J26332J07461
507.9I1263175J59770K28679K35326J92791J82891K41142L06702L08460K69097K69431
528.3I3657464L28976L77100L54559K97975K91389L40802L64864L12435K35325K15286
548.7I6776175K48898K55549J92821J18893J10429J54323J66237J12486N7983P2515
$$ plain form
399.8 100000000 99658316 99352378 99045926 98706663 98328471 97925866 97513336 97085863 96623498 96169084
420.2 96169084 95784843 95437139 95052302 94624901 94227737 93907446 93623632 93299341 92929184 92601985
440.6 92601985 92351568 92113984 91835403 91547412 91320205 91160399 90999907 90797913 90602088 90476286
461 90476286 90409225 90328670 90204412 90090406 90045899 90052390 90039712 89987516 89959455 90002859 90080941 90125686
485.4 90125686 90134966 90176165 90287536 90421891 90518206 90587342 90692526 90857649 91029382 91155714 91263175
507.9 91263175 91422945 91651624 91886950 92079741 92262632 92503774 92810476 93118936 93388033 93657464
528.3 93657464 93986440 94363540 94718099 95016074 95307463 95648265 96013129 96325564 96560889 96776175
548.7 96776175 97025073 97280622 97473443 97592336 97702765 97857088 98023325 98135811 98193794 98266309
569.1I8266309J30708J48475J02526O4462R5916J58989J71632J21289Q1134J05548
589.4I9446988J53285J46562P9078K6494L8707O8099j7786M0781l7873j752L9053m5747
613.9I9935889J8358p4875m1705l338k1923p7635r8222o0559k3645m7171j05643j23727
638.4I9275804q5330n2762p6980j26797j36447q8691m7255q3590j40649j48272j06114
660.8I8182917p8762j08290j56182j58447j16974r5373j28305j73646j71847j28787
681.2I6866304j04457j41293k01744j98436j54751j37926j69617k02995j88446j43027
701.6I5223612j27250j60683j93524j78999j40375j36494j78993k15858k04212j69670
722I3517554j69242k09927k40070k23321j88046j85710k19810k41799k17658j77187
$$ plain form
569.1 98266309 98397017 98545492 98648018 98712480 98808396 98967385 99139017 99260306 99341440 99446988
589.4 99446988 99600273 99746835 99825913 99852407 99891114 99959213 99941427 99982208 99944335 99942583 99981636 99935889
613.9 99935889 99954247 99879372 99837667 99834329 99812406 99734771 99636549 99575990 99552345 99505174 99399531 99275804
638.4 99275804 99190474 99137712 99060732 98933935 98797488 98708797 98661542 98577952 98437303 98289031 98182917
660.8 98182917 98104155 97995865 97839683 97681236 97564262 97468889 97340584 97166938 96995091 96866304
681.2 96866304 96761847 96620554 96418810 96220374 96065623 95927697 95758080 95555085 95366639 95223612
701.6 95223612 95096362 94935679 94742155 94563156 94422781 94286287 94107294 93891436 93687224 93517554
722 93517554 93348312 93138385 92898315 92674994 92486948 92301238 92081428 91839629 91621971 91444784
742.4I1444784j72501k02108k12842j76889j30480j21743j44827j49816j12123o5845
762.8H9955610n5712p4292p2831l1507J4395K3872N799P296M7147Q8060R0003O6400
787.3I0064240O3711R6834J28066J20109Q8299P7772R9790J15532R0295M0710R507
809.7I0994865O336m292n3483j23775j72222j88172k06345k56121l17598l49068l44688
832.2H8985437l39985l62158l93694l96967l68023l42643l47770l66050l60566l27337
852.6H5380244l01236l06785l24327l19361k90728k69943k76435k91902k86096k57915
873H2455516k37292k44075k60818k56461k29973k12234k22051k39885k36601k14105
893.4H0102021k00737k11269k27058k22897k01076j87993j98091k13784k09647j87635
$$ plain form
742.4 91444784 91272283 91070175 90857333 90680444 90549964 90428221 90283394 90133578 90021455 89955610
762.8 89955610 89899898 89825606 89752775 89721268 89735663 89759535 89765334 89772630 89819777 89907837 89997840 90064240
787.3 90064240 90127951 90224785 90352851 90472960 90561259 90639031 90738821 90854353 90944648 90985358 90994865
809.7 90994865 91001201 90996909 90943426 90819651 90647429 90459257 90252912 89996791 89679193 89330125 88985437
832.2 88985437 88645452 88283294 87889600 87492633 87124610 86781967 86434197 86068147 85707581 85380244
852.6 85380244 85079008 84772223 84447896 84128535 83837807 83567864 83291429 82999527 82713431 82455516
873 82455516 82218224 81974149 81713331 81456870 81226897 81014663 80792612 80552727 80316126 80102021
893.4 80102021 79901284 79690015 79462957 79240060 79038984 78850991 78652900 78439116 78229469 78041834
913.7G8041834j74684j84184j98263j93709j73289j61826j71280j84417j79124j58804
934.1G6262254j47492j56617j69272j63525j42461j30045j38355j50841j45775j25855
954.5G4792016j13696j20449j30207j22547j01304q8775r5278j05304r8467p7676o5232
977G3673081p1847q1873p5245n4741m1830m7028n5504m7958k7108j4961k2435l4088
1001.4G3098463k9469j1241j341r942k1506j6337J907J1593L171p176n49J8967K9844
1028G3066384K1886J0914J7881L9173N1289M4579L6162M5401O6888P7754O9219N8931
1052.4G3606461O6376Q5104R1904P8708O4039O8289Q5521R1559P8755O6668P4434R3985
1076.9G4551803J01006Q8769P7498Q5837J04171J07884R1660P6848Q1426R5320R4831
$$ plain form
913.7 78041834 77867150 77682966 77484703 77290994 77117705 76955879 76784599 76600182 76421058 76262254
934.1 76262254 76114762 75958145 75788873 75625348 75482887 75352842 75214487 75063646 74917871 74792016
954.5 74792016 74678320 74557871 74427664 74305117 74203813 74115038 74019760 73914456 73815989 73738313 73673081
977 73673081 73601234 73519361 73444116 73389375 73347545 73300517 73245013 73197055 73169947 73154986 73132551 73098463
1001.4 73098463 73068994 73057753 73056412 73046470 73024964 73008627 73010534 73022127 73025298 73018122 73017573 73036540 73066384
1028 73066384 73088270 73099184 73117065 73156238 73207527 73252106 73288268 73333669 73400557 73478311 73547530 73606461
1052.4 73606461 73672837 73757941 73849845 73928553 73992592 74060881 74146402 74237961 74316716 74383384 74457818 74551803
1076.9 74551803 74652809 74741578 74819076 74904913 75009084 75116968 75208628 75285476 75366902 75462222 75557053
1099.4G5557053P6258O1327O7133Q2368Q2868O5327N1921N9259P5436P6622O1506N3465
1123.8G6370543O7109Q7768R2208Q0544P5698R1159J11747J15043J02007R5314J06865
1146.3G7396005J21433J18399J00833R2065J03140J17809J15948J01024R4879J07861
1166.7G8469396J24049J23441J10567J07079J20873J34921J31607J16950J11860J23137
1187.1G9673880J34582J30343J16342J12105J23817J36041J33133J21230J19329J32519
1207.5H0933321J45101J42169J30284J27673J38253J46461J39600J25366J20592J28591
1227.9H2277411J35195J28180J14185J08939J15723J21426J14447R9927R3049R7776
1248.2H3406258J01232R2667P8303P2527P8517Q4400P9924P0113O8474P7975Q7309
$$ plain form
1099.4 75557053 75633311 75694638 75761771 75844139 75927007 75992334 76044255 76103514 76178950 76255572 76317078 76370543
1123.8 76370543 76437652 76525420 76617628 76698172 76773870 76865029 76976776 77091819 77193826 77289140 77396005
1146.3 77396005 77517438 77635837 77736670 77828735 77931875 78049684 78165632 78266656 78361535 78469396
1166.7 78469396 78593445 78716886 78827453 78934532 79055405 79190326 79321933 79438883 79550743 79673880
1187.1 79673880 79808462 79938805 80055147 80167252 80291069 80427110 80560243 80681473 80800802 80933321
1207.5 80933321 81078422 81220591 81350875 81478548 81616801 81763262 81902862 82028228 82148820 82277411
1227.9 82277411 82412606 82540786 82654971 82763910 82879633 83001059 83115506 83215433 83308482 83406258
1248.2 83406258 83507490 83600157 83678460 83750987 83829504 83913904 83993828 84063941 84132415 84210390 84297699
1270.7H4297699Q5830P7510P5025Q2713R0092Q6368P5656P0953P6813Q3619Q1170P3105
1295.2H5256553P2306Q2994R4443R4837Q6969Q4687R3078J01960R9653Q8656Q2338
1317.6H6238474Q6522R1934Q5723O9857O0332O4331P0590O5780N2267M5091N0854N8383
1342.1H7040138N6219M6432M0174M4066N0467M6325L3378K6047K9880L5125L0786J6719
1366.6H7495756L654O91K736j85l802J770J6874L2824L8636L7253M3267N8246O9993
1393.1H7797713O9833N9909N0473N0455N4288M6700L4547L2777M1622M8846M1801K6679
1417.5H8355643K4211L4809L8761L2347K3055K2585L5679M7749M2957K7997K8747M3029
1442H8757569M4119L3730K1738J9407K9201L9214L9774L6877M1556N7006P2551P4870
$$ plain form
1270.7 84297699 84383529 84461039 84536064 84618777 84708869 84795237 84870893 84941846 85018659 85102278 85183448 85256553
1295.2 85256553 85328859 85411853 85506296 85601133 85688102 85772789 85865867 85967827 86067480 86156136 86238474
1317.6 86238474 86324996 86416930 86502653 86572510 86632842 86697173 86767763 86833543 86885810 86930901 86981755 87040138
1342.1 87040138 87096357 87142789 87182963 87227029 87277496 87323821 87357199 87383246 87413126 87448251 87479037 87495756
1366.6 87495756 87499410 87500101 87502837 87502652 87498850 87500620 87517494 87550318 87588954 87626207 87669474 87727720 87797713
1393.1 87797713 87867546 87927455 87977928 88028383 88082671 88129371 88163918 88196695 88238317 88287163 88328964 88355643
1417.5 88355643 88379854 88414663 88453424 88485771 88508826 88531411 88567090 88614839 88657796 88685793 88714540 88757569
1442 88757569 88801688 88835418 88857156 88876563 88905764 88944978 88984752 89021629 89063185 89120191 89192742 89267612
1466.5H9267612P0959P8702R9391J07443Q9419P5072P5424Q0794Q0043P3379O7574
1488.9I0165812O9469P0024O5082N6368M7636M8304O1321P4494O7383N0390M7332N4991
1513.4I0878606O0826N7507M8882N2154P0756P3088N5104L9709L6883M6259N4521M9710
1537.9I1524005L4523L5667M8918M2206K9623J8085J6087L1811M3982L5048J7738R936
1562.4I1887629J2654J7572J1122r36j925R638P039j9342l7902m4263m1037m3309o2269
1588.9I1694671q0603q9020r5439j03015j11925j24091j38378j41043j35940j41603
1609.3I0533614j52355j52928j43319j30093j21200j17755j02479p1180l7223r065
1629.7H9496017J4513L9786P3636J14775J38676J50972J70243J97357K15107K19524
$$ plain form
1466.5 89267612 89338571 89417273 89516664 89624107 89713526 89788598 89864022 89944816 90024859 90098238 90165812
1488.9 90165812 90235281 90305305 90370387 90426755 90474391 90522695 90584016 90658510 90725893 90776283 90823615 90878606
1513.4 90878606 90939432 90996939 91045821 91097975 91168731 91241819 91296923 91336632 91373515 91419774 91474295 91524005
1537.9 91524005 91558528 91594195 91643113 91685319 91714942 91733027 91749114 91780925 91824907 91859955 91877693 91887629
1562.4 91887629 91900283 91917855 91928977 91928041 91926116 91935754 91942793 91923451 91885549 91841286 91800249 91756940 91694671
1588.9 91694671 91614068 91525048 91429609 91326594 91214669 91090578 90952200 90811157 90675217 90533614
1609.3 90533614 90381259 90228331 90085012 89954919 89833719 89715964 89613485 89542305 89505082 89496017
1629.7 89496017 89510530 89550316 89623952 89738727 89877403 90028375 90198618 90395975 90611082 90830606
1650.1I0830606K17736K14422K15310K14940K03198J81979J64342J63811J69141J47652
1670.5I2723137J12707R7256R5600R6482Q6314P0816O4451N6982M6605L3611J6290
1692.9I3500251P814J4740K7168K6917N371o295m29O581O419M59R48J3792J7637J3834
1721.5I3635207J3709K2144M1669O1828P3457P7027P7224Q3232R1093Q7178P6676P4404
1745.9I4414848P7945P7349O1578M3374M0871M2796L8403K9654K2012K2315K8992L2145
1770.4I4932282K8121K3520K7454L5167L6007L1305K6363K7096L3689L4338K7209K1756
1794.9I5284307K3663L2431L8767L3527K5529K9689M0561M2254L4958K6160K3783L0106
1819.4I5665735L4839K9582K2459K5844L4893L5930K7138J7380J9139L1436L8522L1966
$$ plain form
1650.1 90830606 91048342 91262764 91478074 91693014 91896212 92078191 92242533 92406344 92575485 92723137
1670.5 92723137 92835844 92933100 93028700 93125182 93211496 93282312 93346763 93403745 93450350 93483961 93500251
1692.9 93500251 93508065 93522805 93549973 93576890 93582261 93575966 93575537 93582118 93588537 93588996 93589944 93603736 93621373 93635207
1721.5 93635207 93648916 93671060 93712729 93774557 93848014 93925041 94002265 94085497 94176590 94263768 94340444 94414848
1745.9 94414848 94492793 94570142 94631720 94675094 94715965 94758761 94797164 94826818 94848830 94871145 94900137 94932282
1770.4 94932282 94960403 94983923 95011377 95046544 95082551 95113856 95140219 95167315 95201004 95235342 95262551 95284307
1794.9 95284307 95307970 95340401 95379168 95412695 95438224 95467913 95508474 95550728 95585686 95611846 95635629 95665735
1819.4 95665735 95700574 95730156 95752615 95778459 95813352 95849282 95876420 95893800 95912939 95944375 95982897 96014863
1843.8I6014863K2012K0415K9504L7915L1823K0128K1279L2413L4350K3353J4460J6922
1868.3I6319437K7448L3754K7770J7977J8769K8730L4082K7525J6451J6075K6685L2753
1892.8I6627456K6542J8167K0320L1125L6073K9021J9569J9228K7090L0184K3055J5825
1917.3I6923655J8835K8593L3366K8474K1421K2883L1703L5256K7407J8877K0813K8503
1941.7I7239786L0744K4271J7697K0784K9671L2318K6023J9640K1005K7716K9790K3342
1966.2I7542787J7386K0576K8723L0977K4056J6767J8787K6304K7323J9628J3381J6033
1990.7I7802728K3193K4658J8096J2416J5670K3544K5218J8406R942N502N483M387
2015.2I7989243j144m500J180J1653J6784J4228J2708J9443K9569L2557K6410J9509
$$ plain form
1843.8 96014863 96036875 96057290 96086794 96124709 96156532 96176660 96197939 96230352 96264702 96288055 96302515 96319437
1868.3 96319437 96346885 96380639 96408409 96426386 96445155 96473885 96507967 96535492 96551943 96568018 96594703 96627456
1892.8 96627456 96653998 96672165 96692485 96723610 96759683 96788704 96808273 96827501 96854591 96884775 96907830 96923655
1917.3 96923655 96942490 96971083 97004449 97032923 97054344 97077227 97108930 97144186 97171593 97190470 97211283 97239786
1941.7 97239786 97270530 97294801 97312498 97333282 97362953 97395271 97421294 97440934 97461939 97489655 97519445 97542787
1966.2 97542787 97560173 97580749 97609472 97640449 97664505 97681272 97700059 97726363 97753686 97773314 97786695 97802728
1990.7 97802728 97825921 97850579 97868675 97881091 97896761 97920305 97945523 97963929 97973871 97979373 97984856 97989243
2015.2 97989243 97988099 97983599 97984779 97996432 98013216 98027444 98040152 98059595 98089164 98121721 98148131 98167640
2039.6I8167640J7649J7571J5086R942O551J0008J7023J8638J3024Q571J1933J8501
2064.1I8332137J9210J3423R567J3566K0450K1428J6010J2499J6070K2053K2602J7363
2088.6I8536378J3983J7620K3382K3401J7917J4604J8173K3872K3979J8543J5366J8435
2113.1I8765653K2883K2304J7422J5044J8579K3019K2149J6976J4430J7864K2363K1452
2137.5I9000138J6260J3799J7249K1601K0820J6272J4347J7208K0218J8549J3929J2428
2162I9202818J6337K0713K0063J6278J5664K0075K4628K4236K0384J9026K2114K4896
2186.5I9447232K3115J8895J7589K0528K2841K0247J5485J4043J6624J8472J6242J2457
2211I9663770J1808J4526J6438J4419J0586R834J2702J4454J2154Q845R078J2159J3489
$$ plain form
2039.6 98167640 98185289 98202860 98217946 98227888 98234439 98244447 98261470 98280108 98293132 98301703 98313636 98332137
2064.1 98332137 98351347 98364770 98374337 98387903 98408353 98429781 98445791 98458290 98474360 98496413 98519015 98536378
2088.6 98536378 98550361 98567981 98591363 98614764 98632681 98647285 98665458 98689330 98713309 98731852 98747218 98765653
2113.1 98765653 98788536 98810840 98828262 98843306 98861885 98884904 98907053 98924029 98938459 98956323 98978686 99000138
2137.5 99000138 99016398 99030197 99047446 99069047 99089867 99106139 99120486 99137694 99157912 99176461 99190390 99202818
2162 99202818 99219155 99239868 99259931 99276209 99291873 99311948 99336576 99360812 99381196 99400222 99422336 99447232
2186.5 99447232 99470347 99489242 99506831 99527359 99550200 99570447 99585932 99599975 99616599 99635071 99651313 99663770
2211 99663770 99675578 99690104 99706542 99720961 99731547 99741381 99754083 99768537 99780691 99789536 99798614 99810773 99824262
2237.5I9824262J1152Q130Q231J0842J1802R119N705N501P981Q714N919L052L481N925
2266I9929816O830N388M024N132P480P683M745J687J269K188J335k027n448o562o950
2296.6I9956590q994j1582j2618j2731j3775j7327k1833k4683k5779k7263k9260l0577
2321.1I9720168l0166k8008k6405k9296l2806k7364j2869J734Q667Q655O574L302l827
2347.6I9558359j3142j9634k2066k2155k1803k2060k0266r322J2684L6907N4407O3456
2372.1I9575365O7830O9016O5809N8067M8816M0657L2687K3287J3257N078%Tj449J32
2400.6I9998552r00P33J269l81L46p8L40p27J19j425j096l0M89J66p1N07J215j19R72
2439.4I9999881n25J31%p92N12j031k26M11J49l64j84N72O73k20p10j01P39O56r0m29
$$ plain form
2237.5 99824262 99835414 99843544 99851775 99862617 99874419 99883538 99889243 99894744 99902725 99911439 99917358 99920410 99923891 99929816
2266 99929816 99936646 99942034 99946058 99951190 99958670 99966353 99971098 99972785 99974054 99976242 99977577 99975550 99970102 99963540 99956590
2296.6 99956590 99947596 99936014 99923396 99910665 99896890 99879563 99857730 99833047 99807268 99780005 99750745 99720168
2321.1 99720168 99690002 99661994 99635589 99606293 99573487 99546123 99533254 99534988 99543655 99552310 99558884 99562186 99558359
2347.6 99558359 99545217 99525583 99503517 99481362 99459559 99437499 99417233 99407911 99420595 99457502 99511909 99575365
2372.1 99575365 99643195 99712211 99778020 99836087 99884903 99925560 99958247 99981534 99994791 99999869 99999869 99999869 99998420 99998552
2400.6 99998552 99997652 99998385 99999654 99999273 99999619 99999541 99999881 99999154 99999273 99997848 99996752 99996722 99997211 99997377 99997306 99997813 99999028 99998909 99999881
2439.4 99999881 99999356 99999487 99999487 99998695 99999207 99998176 99997950 99998361 99998510 99998146 99997962 99998534 99999207 99998987 99998277 99998176 99998915 99999571 99999481 99999052
2480.2I9999052%N61%n31L93n12k39m47j216j370k98P63O79L6P1R06J383%l04P69%
2523I9999696%r72L04j263l22M23N4n31k68O62J323o0Q94k86P8J07k80n42l76P8K56
2565.8I9998975l82j079p39K75P92O26M23M35M48%j38K27q9j2l04m47j73l0j13l82
2606.6I9998313r06j079n24oo6k20j97J85N30M00L28J013J496m05P33r54j121j233
2643.4I9996287j383k092k820k563j406m18j49k9Q34K152K587K074J699J907K044%
2676I9998724r29J275r59l64l87j055j574j246k50L34K4o0N30Q94N13O6M94J526J782
2714.7I9999338n96O62p93n3O61N13m23r78m05j13p63q35L88J770%j079J621j007l10
2753.5I9997598k4n48r78l22Q65J251L34n96l22P45J323l33O73l45L21m41L58p21m2
$$ plain form
2480.2 99999052 99999052 99999613 99999613 99999082 99999475 99998963 99998724 99998277 99997061 99995691 99995393 99996156 99996835 99996871 99996942 99997848 99999231 99999231 99998927 99999696 99999696
2523 99999696 99999696 99998724 99999028 99997765 99997443 99997866 99997920 99997389 99997121 99997783 99999106 99999046 99999940 99999654 99999732 99999839 99999559 99999017 99998641 99998719 99998975
2565.8 99998975 99998593 99997514 99996775 99997050 99997842 99998468 99998891 99999326 99999774 99999774 99999636 99999863 99999774 99999762 99999458 99999011 99998838 99998808 99998695 99998313
2606.6 99998313 99997407 99996328 99995804 99995798 99995732 99995512 99995315 99995500 99996030 99996430 99996758 99997771 99999267 99998862 99999595 99998641 99997520 99996287
2643.4 99996287 99994904 99992812 99989992 99987429 99986023 99985605 99985456 99985427 99986261 99988413 99991000 99993074 99994773 99996680 99998724 99998724
2676 99998724 99997795 99999070 99998111 99997747 99997360 99996305 99994731 99993485 99993235 99993569 99993593 99993533 99994063 99994957 99995470 99995536 99996030 99997556 99999338
2714.7 99999338 99998742 99999404 99998611 99998558 99999219 99999732 99999309 99998331 99997926 99997813 99997050 99996215 99996603 99998373 99998373 99997294 99998915 99997908 99997598
2753.5 99997598 99997574 99997026 99996048 99995726 99996591 99997842 99998176 99997580 99997258 99998003 99999326 99998993 99999666 99999321 99999642 99999201 99999559 99998838 99998796
2792.2I9998796L22q11k968m745n340n305n460n966o449o521n979n507n490m875l147
2822.8I9930555j622j931m065o616q738j1611j6427k1964k6524k9558l0977l1114k9957
2849.3I9709451k6750k2102j7863j4067j0031o080k682l70K50L6N13J359J496P87K32
2879.9I9614179P51Q23j633n883q953j0377j2338j5116j6838j6433j4806j4133j6051
2906.5I9483192k0379k4766k7263k8223k9134k9856k8426k4181j8585j2577m756O193
2930.9I9241239J7780K5642K8473K7686K4027J7857R996J860n365j0728j3459j3769
2955.4I9351239j1790o401K986J5086K6846L5715M1795M5693M6360M3720L9739L5661
2979.9I9666649L1889K8520K4051J8406J3667J0550P940O091N472N221M792M685M226
$$ plain form
2792.2 99998796 99999118 99998307 99995339 99990594 99985254 99979949 99974489 99968523 99962074 99955553 99949574 99944067 99938577 99933702 99930555
2822.8 99930555 99928933 99927002 99922937 99916321 99907583 99895972 99879545 99857581 99831057 99801499 99770522 99739408 99709451
2849.3 99709451 99682701 99660599 99642736 99628669 99618638 99612558 99609876 99609506 99609756 99609792 99610305 99611664 99613160 99613947 99614179
2879.9 99614179 99614930 99615753 99614120 99608237 99599284 99588907 99576569 99561453 99544615 99528182 99513376 99499243 99483192
2906.5 99483192 99462813 99438047 99410784 99382561 99353427 99323571 99295145 99270964 99252379 99239802 99235046 99241239
2930.9 99241239 99259019 99284661 99313134 99340820 99364847 99382704 99392700 99394560 99389195 99378467 99365008 99351239
2955.4 99351239 99339449 99333048 99336034 99351120 99377966 99413681 99455476 99501169 99547529 99591249 99630988 99666649
2979.9 99666649 99698538 99727058 99751109 99769515 99783182 99793732 99801672 99807763 99813235 99818456 99823248 99827933 99832159
3006.4I9832159K861J759R65n9j914m357n901o783p891q434p087m328k169j210r54
3037I9786657k301m619o080p629j0258j2761j3036j1408j0425j0669j1206j1218j0055
3063.5I9664992q500p373o485o103o038n966p260r960j2148j2427j1730j2708j5891
3090I9542403j8972j9324j7696j6672j6212j4663j2004r436q440r918j2708j4883j6320
3116.5I9355155j8477k1935k4956k5618k4683k4223k4712k5696k6577k5004k1828k1308
3141I9070138k3616k5969k7663k9653l2151l4076l4654l4392l4439l5692l8260m1264
3165.5I8678309m2290m0328l8660m0215m3440m5413m6164m7314m9078n0694n1922n2809
3189.9I8129982n3537n4717n6195n7018n7143n7245n7649n8067n8150n8127n8824o0582
$$ plain form
3006.4 99832159 99835020 99836779 99837744 99837685 99835771 99831414 99825513 99818730 99810839 99802405 99795318 99790990 99788821 99787611 99786657
3037 99786657 99784356 99779737 99773657 99766028 99755770 99743009 99729973 99718565 99708140 99697471 99686265 99675047 99664992
3063.5 99664992 99656492 99649119 99642634 99636531 99630493 99624527 99617267 99607307 99595159 99582732 99571002 99558294 99542403
3090 99542403 99523431 99504107 99486411 99469739 99453527 99438864 99426860 99417424 99408984 99399066 99386358 99371475 99355155
3116.5 99355155 99336678 99314743 99289787 99264169 99239486 99215263 99190551 99164855 99138278 99113274 99091446 99070138
3141 99070138 99046522 99020553 98992890 98963237 98931086 98897010 98862356 98827964 98793525 98757833 98719573 98678309
3165.5 98678309 98636019 98595691 98557031 98516816 98473376 98427963 98381799 98334485 98285407 98234713 98182791 98129982
3189.9 98129982 98076445 98021728 97965533 97908515 97851372 97794127 97736478 97678411 97620261 97562134 97503310 97442728
3214.4I7442728o2149o1930o0773o0826o2210o3848o5291o5803o4898o4015o4373o4552
3238.9I6682060o3819o3413o3235o1989n9586n6804n5074n3794n0878m7106m4274m2444
3263.4I6019644m1509m2278m4024m5240m6813m9240n0628n0687n1439n4282n8544o1667
3287.8I5423293o2448o2078o2179o4558p0125p7433q4757r1815r8753j04767j08242
3310.3I4536138j10537j15055j22458j30552j36429j37860j36399j36524j40298j46716
3330.7I3223310j54180j59812j62834j66696j73110j79553j84941j91581k00099k07573
3351.1I1442931k10601k09189k08384k11858k16896k20889k22802k21306k18409k17235
3371.5H9285362k16407k11626k02072j92529j85626j76687j61695j45835j37514j35499
$$ plain form
3214.4 97442728 97380579 97318649 97257876 97197050 97134840 97070992 97005701 96939898 96875000 96810985 96746612 96682060
3238.9 96682060 96618241 96554828 96491593 96429604 96370018 96313214 96258140 96204346 96153468 96106362 96062088 96019644
3263.4 96019644 95978135 95935857 95891833 95846593 95799780 95750540 95699912 95649225 95597786 95543504 95484960 95423293
3287.8 95423293 95360845 95298767 95236588 95172030 95101905 95024472 94939715 94847900 94749147 94644380 94536138
3310.3 94536138 94425601 94310546 94188088 94057536 93921107 93783247 93646848 93510324 93370026 93223310
3330.7 93223310 93069130 92909318 92746484 92579788 92406678 92227125 92042184 91850603 91650504 91442931
3351.1 91442931 91232330 91023141 90814757 90602899 90386003 90165114 89942312 89721006 89502597 89285362
3371.5 89285362 89068955 88857329 88655257 88462728 88277102 88100415 87938720 87792885 87655371 87519872
3391.9H7519872j33186j29074j24794j21636j20204j19478j17868j13922j08862j05507
3412.3H6325341j01023r1923q0281o9386n9885n0306m0537l1781k3818j5957r179l653
3436.7H5747612J978P975J3882K1828L2383M1061M8090N9574P4226Q4096Q7238Q7291
3461.2H6307234Q8393R1970R4253R3216R1785R1183R0796R1344R1219R0533R3234R9236
3485.7H7414396J04326J05882J04886J03617J04254J07133J09512J10161J11026J12164
3506.1H8487357J13875J16837J19632J22243J25087J26844J28067J29747J30510J30588
3526.5H9730787J31733J34301J36870J37901J37609J37085J37466J37848J37508J39266
3546.9I1098374J42270J40214J35398J35941J40190J44213J47081J48999J51408J56307
$$ plain form
3391.9 87519872 87386686 87257612 87132818 87011182 86890978 86771500 86653632 86539710 86430848 86325341
3412.3 86325341 86224318 86132395 86052114 85982728 85922843 85872537 85832000 85800219 85776401 85760444 85751265 85747612
3436.7 85747612 85749590 85757565 85771447 85793275 85825658 85866719 85914809 85974383 86048609 86132705 86219943 86307234
3461.2 86307234 86395627 86487597 86581850 86675066 86766851 86858034 86948830 87040174 87131393 87221926 87315160 87414396
3485.7 87414396 87518722 87624604 87729490 87833107 87937361 88044494 88154006 88264167 88375193 88487357
3506.1 88487357 88601232 88718069 88837701 88959944 89085031 89211875 89339942 89469689 89600199 89730787
3526.5 89730787 89862520 89996821 90133691 90271592 90409201 90546286 90683752 90821600 90959108 91098374
3546.9 91098374 91240644 91380858 91516256 91652197 91792387 91936600 92083681 92232680 92384088 92540395
3567.3I2540395J62548J66160J67608J71721J78331J83726J84339J80531J79970J86330
3587.7I4301659J92618J93507J91360J90008J90163J92773J93316J86950J81633J83171
3608.1I6197158J85591J81079J70052J63329J60974J59186J55634J48880J42509J39594
3628.5I7803986J37711J30385J15073J04594J03551J01817R5284Q6277P8434P7343
3648.8I8834455P8005P5507O9457O4981O0511N0324L6716K0677R614J1224J4174J2052
3673.3I9337697J2451J8365K5600L3796M2152M5735M4864M5425M3267L6257K8777K2382
3697.8I9736768K0254K0694J9378J6075J3012J0055Q071Q917J0973R757M137R83M298
3724.3I9883372Q553N185k98K093L922j38k527j055l51o62K283O252O396L362L498
$$ plain form
3567.3 92540395 92702943 92869103 93036711 93208432 93386763 93570489 93754828 93935359 94115329 94301659
3587.7 94301659 94494277 94687784 94879144 95069152 95259315 95452088 95645404 95832354 96013987 96197158
3608.1 96197158 96382749 96563828 96733880 96897209 97058183 97217369 97373003 97521883 97664392 97803986
3628.5 97803986 97941697 98072082 98187155 98291749 98395300 98497117 98592401 98678678 98757112 98834455
3648.8 98834455 98912460 98987967 99057424 99122405 99182916 99233240 99269956 99290633 99300247 99311471 99325645 99337697
3673.3 99337697 99350148 99368513 99394113 99427909 99470061 99515796 99560660 99606085 99649352 99685609 99714386 99736768
3697.8 99736768 99757022 99777716 99797094 99813169 99826181 99836236 99844307 99853224 99864197 99873954 99878091 99879074 99883372
3724.3 99883372 99891925 99897110 99896812 99898905 99902827 99902689 99900162 99899107 99898756 99898094 99900377 99906629 99913025 99916387 99919885
3754.9I9919885R323J4686J3578R811Q255M411q9K56J544N84R65M125O312N949n800
3785.5I9993795M05n382m422p022q869o563k682n06p87n210p361m571k385j853k629
3816.1I9933958n138l528L39k068n698m477l57M119R220R460l267j2308j1253p940
3844.6I9901062n167m232j854J311j442p642j0174n889K718R084J0651M953m899m125
3873.2I9884355J431K902L547N096O974M697k593p987p636l898j949k414j210O14K456
3903.8I9884385M643L749K259N216Q750O687O92l225k891K74J860J091J943L725L350
3934.4I9922508K128J776J645K331L832L338O62M95L719N776M482J484L28K271L445
3965I9960220K038P99J282L021M441L630J758J425K509L094K789K551K867L380K843
$$ plain form
3754.9 99919885 99929208 99943894 99957472 99967283 99975538 99979949 99979860 99980116 99981660 99982244 99983209 99987334 99993646 99999595 99993795
3785.5 99993795 99994200 99988818 99984396 99977374 99968505 99961942 99959260 99958754 99957967 99952757 99945396 99940825 99938440 99936587 99933958
3816.1 99933958 99928820 99925292 99925631 99923563 99917865 99913388 99913031 99917150 99926370 99935830 99932563 99920255 99909002 99901062
3844.6 99901062 99895895 99891663 99889809 99891120 99889678 99882036 99871862 99865973 99868691 99877775 99888426 99893379 99888480 99884355
3873.2 99884355 99885786 99888688 99892235 99897331 99904305 99909002 99906409 99898422 99890786 99886888 99884939 99882525 99881315 99881929 99884385
3903.8 99884385 99889028 99892777 99895036 99900252 99909002 99915689 99916381 99913156 99910265 99910539 99912399 99913490 99915433 99919158 99922508
3934.4 99922508 99924636 99926412 99928057 99930388 99934220 99937558 99938220 99938715 99942434 99948210 99952692 99954176 99954504 99956775 99960220
3965 99960220 99962258 99963057 99964339 99967360 99971801 99975431 99977189 99978614 99981123 99984217 99987006 99989557 99992424 99995804 99998647
3995.6I9998647J353
3997.6A00000000
$$ plain form
3995.6 99998647 100000000
3997.6 100000000
##END=$$ End of the data block
