##TITLE=AD 06 $$ Begin of the data block
##JCAMP-DX=5.00 $$ ACD/SpecManager v 10.08
##SPECTROMETER/DATA SYSTEM=Alpha
##DATE=17 Dec 2014 10:47:54
##DATA TYPE=INFRARED SPECTRUM
##DATA CLASS=XYDATA
##ORIGIN=
##OWNER=
##NPOINTS=1765
##FIRSTX=399.76428223
##LASTX=3997.64306641
##MAXX=3997.64306641
##MINX=399.76428223
##MAXY=1.00000000
##MINY=0.42838719
##XFACTOR=1.0000000000
##YFACTOR=0.000000010000000
##FIRSTY=1.00000000
##DELTAX=2.03961372
##XUNITS=1/CM
##YUNITS=ARBITRARY UNITS
##XYDATA=(X++(Y..Y))
399.8A00000000r02879q95089r13620r36467r55498r77176r95648j002932r96899r82392
420.2I0441400r68039r51725r25887r02450q89969q69501q34202q08472p90268p57486
440.6H1743401p25311o97356o66881o31094n86229n36973m89998m39465l80843l21579
461G6267672k62148j98161j34951p7373k5064K0206N7483R3281J29170J59782J85746
483.4G6215643K09933K31630K47007K56247K67303K81220K90955K90018K88647L03197
503.8G8881800L24041L35365L44110L66521L96943M21584M41163M67635N00947N28580
524.2H3008689N48595N68950N93460O12378O23333O39284O59281O68102O64324O62500
544.6H9248896O66344O65211O52683O39540O36292O32226O16163N96923N85532N75894
$$ plain form
399.8 100000000 99097121 98202032 97288412 96351945 95396447 94419271 93423623 92420691 91423792 90441400
420.2 90441400 89473361 88521636 87595749 86693299 85803330 84933829 84099627 83291155 82500887 81743401
440.6 81743401 81018090 80320734 79653853 79022759 78436530 77899557 77409559 76970094 76589251 76267672
461 76267672 76005524 75807363 75672412 75595039 75569975 75590181 75647664 75740945 75870115 76029897 76215643
483.4 76215643 76425576 76657206 76904213 77160460 77427763 77708983 77999938 78289956 78578603 78881800
503.8 78881800 79205841 79541206 79885316 80251837 80648780 81070364 81511527 81979162 82480109 83008689
524.2 83008689 83557284 84126234 84719694 85332072 85955405 86594689 87253970 87922072 88586396 89248896
544.6 89248896 89915240 90580451 91233134 91872674 92508966 93141192 93757355 94354278 94939810 95515704
565I5515704N55968N27657N00810M74620M40150L96007L53366L15667K71821K19381
585.4I9571151J70731J29175Q6570M1580%S1j341P93j848J335%Tj687J854j6409l8165
636.4I9943739n8555p1431q1688r4759j08117j15478j15323j26767j59985j81294j88559
658.8I8641783j95533k04343k10285k12705k17193k23530k26032k24907k25305k28310
679.2I6473640k29889k33185k53785k81411k84589k76625k68787k61974k54560k45589
699.6I3883246k37435k32816k31337k31064k33227k41303k53409k64603k73973k82824
720I1401255k91347k97827l02821l08508l15046l20858l25817l32367l40158l46172
740.4H8220334l49617l51995l52776l49993l42566l31711l18426l01659k80875k57433
$$ plain form
565 95515704 96071672 96599329 97100139 97574759 98014909 98410916 98764282 99079949 99351770 99571151
585.4 99571151 99741882 99871057 99957627 99999207 99999207 99999207 99999207 99999207 99999207 99999207 99999207 99999207 99999207 99999207 99999207 99997866 99998659 99996811 99998146 99998146 99998146 99996459 99998313 99981904 99943739
636.4 99943739 99885184 99813753 99732065 99637306 99529189 99413711 99298388 99171621 99011636 98830342 98641783
658.8 98641783 98446250 98241907 98031622 97818917 97601724 97378194 97152162 96927255 96701950 96473640
679.2 96473640 96243751 96010566 95756781 95475370 95190781 94914156 94645369 94383395 94128835 93883246
699.6 93883246 93645811 93412995 93181658 92950594 92717367 92476064 92222655 91958052 91684079 91401255
720 91401255 91109908 90812081 90509260 90200752 89885706 89564848 89239031 88906664 88566506 88220334
740.4 88220334 87870717 87518722 87165946 86815953 86473387 86141676 85823250 85521591 85240716 84983283
760.8H4983283k32988k06060j74039j35881r2715m6521J007M9073R5921J39177J80060
783.2H4560317K20859K60228K96473L32302L69913M06867M40568M71621N01293N25171
803.6H8385612N34653N26184N02551M62097L98451L11816K10589R9885k2691j55598
824I1253549k89124m14992n33569o44785p40748q15458q72743r16159r42826r51719
844.4H4131426r49014r42218r31370r14288q96090q82578q71688q59147q46672q37309
864.8G5201052q29094q18485q06314p96157p89422p83694p77882p74360p73549p72261
885.2F7279834p69216p66784p66468p65437p59381p48611p37017p25448p10804o92796
905.6E9837872o75082o59180o42461o22672o01214n80728n60719n39183n17392m97562
$$ plain form
760.8 84983283 84750295 84544235 84370196 84234315 84141600 84095079 84096086 84145159 84241080 84380257 84560317
783.2 84560317 84781176 85041404 85337877 85670179 86040092 86446959 86887527 87359148 87860441 88385612
803.6 88385612 88920265 89446449 89949000 90411097 90809548 91121364 91331953 91431838 91409147 91253549
824 91253549 90964425 90549433 90015864 89371079 88630331 87814873 86942130 86025971 85083145 84131426
844.4 84131426 83182412 82240194 81308824 80394536 79498446 78615868 77744180 76885033 76038361 75201052
864.8 75201052 74371958 73553473 72747159 71951002 71161580 70377886 69600004 68825644 68052095 67279834
885.2 67279834 66510618 65743834 64977366 64211929 63452548 62703937 61966920 61241472 60530668 59837872
905.6 59837872 59162790 58503610 57861149 57238477 56637263 56056535 55495816 54956633 54439241 53941679
926E3941679m79090m60404m42195m26448m12643l98814l84862l72910l63410l54421
946.4D9846482l44869l35968l28612l21335l13195l04792k97227k90376k83048k75436
966.8D6751624k68429k62210k55781k48403k40925k33784k25481k15108k03755j92532
987.2D4405216j80998j68270j55297j43653j33497j23444j13011j03351r4670q5518
1007.6D3103507p5033o3494n1460l8927k5255j0619M814K0492L5953N1221O6281Q0865
1032D3098345R4492J07142J18765J29658J40363J50606J59487J67212J74505J81642
1052.4D4522217J89206J96540K02385K06363K08527K08953K08458K08053K07803K07686
1072.8D6566191K08101K08992K09871K11370K13656K16624K20486K24331K26429K26462
$$ plain form
926 53941679 53462589 53002185 52559990 52133542 51720899 51322085 50937223 50564313 50200903 49846482
946.4 49846482 49501613 49165645 48837033 48515698 48202503 47897711 47600484 47310108 47027060 46751624
966.8 46751624 46483195 46220985 45965204 45716801 45475876 45242092 45016611 44801503 44597748 44405216
987.2 44405216 44224218 44055948 43900651 43756998 43623501 43500057 43387046 43283695 43189025 43103507
1007.6 43103507 43028474 42964980 42913520 42874593 42849338 42838719 42843533 42864025 42899978 42951199 43017480 43098345
1032 43098345 43192837 43299979 43418744 43548402 43688765 43839371 43998858 44166070 44340575 44522217
1052.4 44522217 44711423 44907963 45110348 45316711 45525238 45734191 45942649 46150702 46358505 46566191
1072.8 46566191 46774292 46983284 47193155 47404525 47618181 47834805 48055291 48279622 48506051 48732513
1093.2D8732513K25255K23643K22465K21688K21336K21508K22320K23392K23827K23297
1113.6E0961244K22468K22785K24465K26378K27893K29639K31587K33341K34723K35605
1134E3250128K36410K36928K36571K35713K35080K34062K32297K30539K29609K29824
1154.4E5587161K31343K34270K38896K45338K52617K60180K68364K77305K86978K96831
1174.8E8179283L05474L11935L16465L19868L22646L24988L27367L30067L33196L36968
1195.2F1408257L41535L47275L53592L60042L66831L73274L78406L82751L86805L89880
1215.6F5088648L90356L87663L83401L78656L73131L66682L60191L54213L47966L41099
1236F8772006L34090L27480L21275L14987L08221L00974K93118K85023K77454K70843
$$ plain form
1093.2 48732513 48957768 49181411 49403876 49625564 49846900 50068408 50290728 50514120 50737947 50961244
1113.6 50961244 51183712 51406497 51630962 51857340 52085233 52314872 52546459 52779800 53014523 53250128
1134 53250128 53486538 53723466 53960037 54195750 54430830 54664892 54897189 55127728 55357337 55587161
1154.4 55587161 55818504 56052774 56291670 56537008 56789625 57049805 57318169 57595474 57882452 58179283
1174.8 58179283 58484757 58796692 59113157 59433025 59755671 60080659 60408026 60738093 61071289 61408257
1195.2 61408257 61749792 62097067 62450659 62810701 63177532 63550806 63929212 64311963 64698768 65088648
1215.6 65088648 65479004 65866667 66250068 66628724 67001855 67368537 67728728 68082941 68430907 68772006
1236 68772006 69106096 69433576 69754851 70069838 70378059 70679033 70972151 71257174 71534628 71805471
1256.4G1805471K64901K59310K54113K49642K46197K43240K39998K36595K33972K31874
1276.8G4265313K29168K25705K22266K18916K14588K09236K03705J98651J93673J88285
1297.2G6369506J83159J78546J74230J70404J67519J65832J65129J64771J64514J64164
1317.6G8067774J63394J61516J58710J55920J52862J49351J45602J41502J37490J33907
1338G9568028J30177J26731J24056J21730J19346J15514J10126J04052R7310R0260
1358.4H0707330Q2993P5871O9809O1249M4269K2399Q834P814J2588K0641L1460M2444
1382.9H1187701N2524O1309O8796P5865Q0907Q2588Q0055O9183N1046L8343M0132M7130
1407.3H1935579N1152N3311N4705N5599N4973N2554N2744N6481N8735N9587O0373O2221
$$ plain form
1256.4 71805471 72070372 72329682 72583795 72833437 73079634 73322874 73562872 73799467 74033439 74265313
1276.8 74265313 74494481 74720186 74942452 75161368 75375956 75585192 75788897 75987548 76181221 76369506
1297.2 76369506 76552665 76731211 76905441 77075845 77243364 77409196 77574325 77739096 77903610 78067774
1317.6 78067774 78231168 78392684 78551394 78707314 78860176 79009527 79155129 79296631 79434121 79568028
1338 79568028 79698205 79824936 79948992 80070722 80190068 80305582 80415708 80519760 80617070 80707330
1358.4 80707330 80790323 80866194 80936003 80997252 81041521 81063920 81072754 81080568 81093156 81113797 81145257 81187701
1382.9 81187701 81240225 81301534 81370330 81446195 81527102 81609690 81689745 81758928 81809974 81848317 81888449 81935579
1407.3 81935579 81986731 82040042 82094747 82150346 82205319 82257873 82310617 82367098 82425833 82485420 82545793 82608014
1431.8H2608014O6966P3576P8219P8142Q0192Q6480Q9491Q9431R0742R4545R8723J02144
1456.3H3636665J09756J22261J33759J42443J48946J52857J53374J53220J59520J67233
1476.7H5080034J64037J55294J51098J48434J41871J33705J32090J40303J44118J40303
1497.1H6531287J33056J26916J23698J23220J26404J27542J23352J18857J14745J08898
1517.5H7757975J03170R6255R3013J02556J08498J06514J01161R5367R1559Q8471Q5425
1539.9H8829964Q0711Q2642Q6373Q2165P5442O9528O4147O2525O5178O4593N9742N1266
1564.4H9674276M0203K8694J8203J0634O598N663k313j7059l1334m4656n6571o8533
1588.9H9563805q1056r0683r9313j10734j20127j25313j34438j45477j51754j53625
$$ plain form
1431.8 82608014 82674980 82748556 82826775 82904917 82985109 83071589 83161080 83250511 83341253 83435798 83534521 83636665
1456.3 83636665 83746421 83868682 84002441 84144884 84293830 84446687 84600061 84753281 84912801 85080034
1476.7 85080034 85244071 85399365 85550463 85698897 85840768 85974473 86106563 86246866 86390984 86531287
1497.1 86531287 86664343 86791259 86914957 87038177 87164581 87292123 87415475 87534332 87649077 87757975
1517.5 87757975 87861145 87957400 88050413 88152969 88261467 88367981 88469142 88564509 88656068 88744539 88829964
1539.9 88829964 88910675 88993317 89079690 89161855 89237297 89306825 89370972 89433497 89498675 89563268 89623010 89674276
1564.4 89674276 89714479 89743173 89761376 89772010 89778608 89784271 89781958 89764899 89733565 89688909 89632338 89563805
1588.9 89563805 89482749 89392066 89292753 89182019 89061892 88936579 88802141 88656664 88504910 88351285
1609.3H8351285j52969j50943j51920j56426j58227j43516j13958q0025m5592j2469
1629.7H7185240K7162P5340J10972J40869J87088K28428K52277K60854K60710K59197
1650.1H8988137K58583K63596K66319K58666K45965K31856K20126K08789J91188J82545
1670.5I1315770J83016J69665J50096J33282J22541J13452J02919R6327R0599Q2010
1690.9I2559677P4339O6334N5850M7153M5997N1063M9508M2558L5399K9206K4617K0504
1715.3I3102205J8608K2972K8479L2175L6889M3547N2273O3402P7617R2709J01948
1737.8I3672824J04284J02651R8521R2619Q6356P9417P3016O5249N6851N1868M8256
1760.2I4531912M4524M2188M1867M2158M1390L9243L6437L5077L6460L7623L6013L4320
$$ plain form
1609.3 88351285 88198316 88047373 87895453 87739027 87580800 87437284 87323326 87243301 87197709 87185240
1629.7 87185240 87212402 87287742 87398714 87539583 87726671 87955099 88207376 88468230 88728940 88988137
1650.1 88988137 89246720 89510316 89776635 90035301 90281266 90513122 90733248 90942037 91133225 91315770
1670.5 91315770 91498786 91668451 91818547 91951829 92074370 92187822 92290741 92387068 92477667 92559677
1690.9 92559677 92634016 92700350 92756200 92803353 92849350 92900413 92949921 92992479 93027878 93057084 93081701 93102205
1715.3 93102205 93120813 93143785 93172264 93204439 93241328 93284875 93337148 93400550 93478167 93570876 93672824
1737.8 93672824 93777108 93879759 93978280 94070899 94157255 94236672 94309688 94374937 94431788 94483656 94531912
1760.2 94531912 94576436 94618624 94660491 94702649 94744039 94783282 94819719 94854796 94891256 94928879 94964892 94999212
1784.7I4999212L5316L7843L9255L8195L7074L7414L7259L5804L4738L3981L3092L3867
1809.2I5433050L5930L6526L7432L8558L8409L7551L6699L5649L4773L5555L6788L6823
1833.6I5873743L5739L3975L2306L1250L0381K9492K9284K7913K5958K5916K7001K6959
1858.1I6229917K6721K7877K8807K8419K7138K5350K3907K3604K3401K2536K2340K3395
1882.6I6533412K5129K6780K7037K6107K5588K5571K5355K4516K3466K3210K3782K4695
1907.1I6834648K5314K5183K4932K4808K4336K3735K2918K1857K1249K1559K1714K1243
1931.5I7113496K1422K2352K2465K1934K1923K1893K1505K0713J9967K0057K0331J9992
1956I7368050J9973K1041K1624K1041K0325K0116K0194K0183K0110K0260K0545K0415
$$ plain form
1784.7 94999212 95034528 95072371 95111626 95149821 95186895 95224309 95261568 95297372 95332110 95366091 95399183 95433050
1809.2 95433050 95468980 95505506 95542938 95581496 95619905 95657456 95694155 95729804 95764577 95800132 95836920 95873743
1833.6 95873743 95909482 95943457 95975763 96007013 96037394 96066886 96096170 96124083 96150041 96175957 96202958 96229917
1858.1 96229917 96256638 96284515 96313322 96341741 96368879 96394229 96418136 96441740 96465141 96487677 96510017 96533412
1882.6 96533412 96558541 96585321 96612358 96638465 96664053 96689624 96714979 96739495 96762961 96786171 96809953 96834648
1907.1 96834648 96859962 96885145 96910077 96934885 96959221 96982956 97005874 97027731 97048980 97070539 97092253 97113496
1931.5 97113496 97134918 97157270 97179735 97201669 97223592 97245485 97266990 97287703 97307670 97327727 97348058 97368050
1956 97368050 97388023 97409064 97430688 97451729 97472054 97492170 97512364 97532547 97552657 97572917 97593462 97613877
1980.5I7613877K0415K0933K1159K0439J9532J8865J8197J7357J6463J6320J7178J8024
2005I7838759J8138J6809J2922Q529O712O860P677R180J1271J3214J5050J7041J9247
2031.5I8001409K1523K3585K4367K3311K0200J6052J3971J4555J5426J5736J6111J6343
2056I8222589J6237J6039J5951J5980J5974J6170J6755J7453J7702J7339J7178J7887
2080.4I8423254J8722J9121J9366J9544J9449J8961J8751J9515K0253K0242J9992J9812
2104.9I8656982J9419J8829J8639J9294K0021K0230K0051J9860J9813J9711J9687J9736
2129.4I8892272J9615J9145J8704J8573J8799J8949J8668J8477J9056J9807J9604J8096
2153.9I9119765J6695J6481J6605J6344J6487J7291J7726J7375J7315J8078J8365J7821
$$ plain form
1980.5 97613877 97634292 97655225 97676384 97696823 97716355 97735220 97753417 97770774 97787237 97803557 97820735 97838759
2005 97838759 97856897 97873706 97886628 97895157 97901869 97908729 97916406 97925586 97936857 97950071 97965121 97982162 98001409
2031.5 98001409 98022932 98046517 98070884 98094195 98114395 98130447 98144418 98158973 98174399 98190135 98206246 98222589
2056 98222589 98238826 98254865 98270816 98286796 98302770 98318940 98335695 98353148 98370850 98388189 98405367 98423254
2080.4 98423254 98441976 98461097 98480463 98500007 98519456 98538417 98557168 98576683 98596936 98617178 98637170 98656982
2104.9 98656982 98676401 98695230 98713869 98733163 98753184 98773414 98793465 98813325 98833138 98852849 98872536 98892272
2129.4 98892272 98911887 98931032 98949736 98968309 98987108 99006057 99024725 99043202 99062258 99082065 99101669 99119765
2153.9 99119765 99136460 99152941 99169546 99185890 99202377 99219668 99237394 99254769 99272084 99290162 99308527 99326348
2178.3I9326348J7351J7178J6594J5205J4145J4513J5289J5336J4848J4847J5247J5312
2202.8I9512213J5057J4972J4663J4013J3042J2439J2702J2696J1921J1330J1266J1176
2227.3I9667490J0681J0252J0192J0210R686R012Q875Q727Q136P772P820P725P319
2253.8I9783897O676O163O122O270O223O169O664P480P927P880P433O604N329L278
2282.3I9874115Q40j353l212n096p481j0478j3924j6928j8775k0224k2602k6262l0661
2308.9I9697959l4713l7694m0233m2147m2307m1056m0197m0537m2415m5562m3136l0046
2333.3I9217916j1075M804J1754J1045O181j222j0407j9681k5988k8682k9200k6691
2357.8I9098754j9819p104J5848M6796P6044R5963J04743J05238J00464R2119Q0228
$$ plain form
2178.3 99326348 99343699 99360877 99377471 99392676 99406821 99421334 99436623 99451959 99466807 99481654 99496901 99512213
2202.8 99512213 99527270 99542242 99556905 99570918 99583960 99596399 99609101 99621797 99633718 99645048 99656314 99667490
2227.3 99667490 99678171 99688423 99698615 99708825 99718511 99727523 99736398 99745125 99753261 99761033 99768853 99776578 99783897
2253.8 99783897 99790573 99796736 99802858 99809128 99815351 99821520 99828184 99835664 99843591 99851471 99858904 99865508 99870837 99874115
2282.3 99874115 99874955 99873602 99870390 99865294 99857813 99847335 99833411 99816483 99797708 99777484 99754882 99728620 99697959
2308.9 99697959 99663246 99625552 99585319 99543172 99500865 99459809 99419612 99379075 99336660 99291098 99247962 99217916
2333.3 99217916 99206841 99211645 99223399 99234444 99240625 99239403 99228996 99209315 99183327 99154645 99125445 99098754
2357.8 99098754 99078935 99071831 99087679 99134475 99210519 99306482 99411225 99516463 99616927 99709046 99789274
2380.2I9789274O5410N0992L8743K7781J7685Q744j848J371j257K80J460%Vl46J365
2414.9I9999654q04p10m05m23o08q23m77L22M24K02P04J424J252%Ul34K68n18Q3N54
2457.8I9999785O0o08o26l34j90j25L81R78%o38O73o85k51J02M89P15p33K74j365q41
2498.5I9997061Q4J91o0N4L0p87j663j276k02M47M88K33M05P99M83J07P63J460J109
2537.3I9999726l76K74p21q82r95r96n84j31l0L0K98J91Q3Q76J634J299l87L04l04
2576I9999309J25M1l15j49M88j55N01k74J67%l16K56p15p03o26Tk27M41P93P81N78
2618.9I9999374M29k38J97o56q82j109j442j610j478j335j055n01P8K32m47r71l88
2653.5I9988198L04K63J37N60J198J484J109O61Q35J377J180N66N01P51N54P2k63j90
$$ plain form
2380.2 99789274 99854684 99905676 99944419 99972200 99989885 99998629 99996781 99998152 99996895 99997175 99998635 99998635 99998635 99998635 99998635 99998289 99999654
2414.9 99999654 99998850 99998140 99997735 99997312 99996704 99995881 99995404 99995726 99996150 99996352 99997056 99998480 99999732 99999732 99999732 99999732 99999398 99999666 99999148 99999231 99999785
2457.8 99999785 99999845 99999237 99998611 99998277 99998087 99997962 99998343 99999321 99999321 99998683 99999356 99998671 99998420 99998522 99999011 99999726 99998993 99999267 99997902 99997061
2498.5 99997061 99997145 99997336 99997276 99997330 99997360 99996573 99994910 99993634 99993432 99993879 99994367 99994600 99995005 99995804 99996287 99996394 99997157 99998617 99999726
2537.3 99999726 99999350 99999624 99998903 99998021 99997026 99996030 99995446 99995315 99995285 99995315 99995613 99995804 99995887 99996763 99998397 99999696 99999309 99999613 99999309
2576 99999309 99999434 99999475 99999160 99999011 99999499 99999344 99999845 99999571 99999738 99999738 99999422 99999678 99998963 99998260 99997634 99997008 99996781 99997222 99998015 99998796 99999374
2618.9 99999374 99999803 99999565 99999762 99999106 99998224 99997115 99995673 99994063 99992585 99991250 99990195 99989694 99989772 99990004 99989557 99988586 99988198
2653.5 99988198 99988502 99988765 99988902 99989462 99990660 99992144 99993253 99993914 99994749 99996126 99997306 99997872 99998373 99999124 99999678 99999750 99999487 99999297
2690.3I9999297M7J91K80j91J85n18m89l22n60r12o08O5L28L6l10j13L34L75L0r5L93
2733.1I9997443Q17K74n13m65K4J67L40Q76R77o79O0m30L16O32%Tl04J61j067j126
2773.9I9997503n73m17r77j562j818k122k652k849k712k879l738n078o312p111p582
2804.5I9949121p706p391p248p868r036r763r567r185r143r078q661r197j2064j6397
2833I9816817k0921k6494l3278l9589m3839m5503m5114m2260l6418k8569k0033j1551
2857.5I9423248l958J883N561P087O587M273J443j192l809n734o688p534r101j0914
2886.1I9401152j2028j3089j4836j6403j6809j6492j7017j9539k3281k7699l2925l7742
2910.5I9153292m0400m0662l9429l6621l1030k2811j3041k563Q631K0152K9665L5173
$$ plain form
2690.3 99999297 99999344 99999535 99999815 99999624 99999809 99999291 99998802 99998480 99997920 99997008 99996400 99996465 99996793 99996829 99996519 99996406 99996740 99997115 99997145 99997050 99997443
2733.1 99997443 99998260 99998534 99998021 99997556 99997580 99997747 99998087 99998963 99999940 99999261 99999321 99998891 99999207 99999839 99999839 99999839 99999535 99999696 99998629 99997503
2773.9 99997503 99996930 99996513 99995536 99993974 99992156 99990034 99987382 99984533 99981821 99978942 99975204 99970126 99963814 99956703 99949121
2804.5 99949121 99941415 99934024 99926776 99918908 99909872 99900109 99890542 99881357 99872214 99863136 99854475 99845278 99833214 99816817
2833 99816817 99795896 99769402 99736124 99696535 99652696 99607193 99562079 99519819 99483401 99454832 99434799 99423248
2857.5 99423248 99419290 99421173 99426734 99433821 99440408 99444681 99446124 99444932 99441123 99435389 99428701 99421167 99412066 99401152
2886.1 99401152 99389124 99376035 99361199 99344796 99327987 99311495 99294478 99274939 99251658 99223959 99191034 99153292
2910.5 99153292 99112892 99072230 99032801 98996180 98965150 98942339 98929298 98926735 98935366 98955518 98985183 99020356
2935I9020356L7843L8934L7807L4720L0863K6894K2923J9467J7107J5968J6093J7530
2959.5I9336505K0319K4218K8139L1173L3128L3832L2830L0488K7662K4713K2053J9282
2984I9664342J5653J1557Q023N448L558K569K783L481L755L011J466N66L81j114l982
3014.5I9721497o801q475r329j0591j1862j1503r346p069o301o598p343q315r006j0205
3043.1I9598753j2666j5330j6880j6487j4835j4085j4382j4413j3983j3542j3447j3226
3067.6I9425477j2535j2267j2713j3471j4728j6362j7696j7673j6618j7017j9568k2018
3092.1I9232811k2674k2042k1761k1780k1177k0194j9110j8942k0868k3597k5493k6405
3116.5I8968768k7346k9582l2002l2806l2717l3081l3790l4380l4874l4118l2121l1734
$$ plain form
2935 99020356 99058199 99097133 99134940 99169660 99200523 99227417 99250340 99269807 99286914 99302882 99318975 99336505
2959.5 99336505 99356824 99381042 99409181 99440354 99473482 99507314 99540144 99570632 99598294 99623007 99645060 99664342
2984 99664342 99679995 99691552 99699575 99705023 99708581 99711150 99713933 99717414 99721169 99724180 99725646 99726212 99726593 99725479 99721497
3014.5 99721497 99714696 99706221 99696892 99686301 99674439 99662936 99653590 99646521 99640220 99633622 99626279 99617964 99608958 99598753
3043.1 99598753 99586087 99570757 99553877 99537390 99522555 99508470 99494088 99479675 99465692 99452150 99438703 99425477
3067.6 99425477 99412942 99400675 99387962 99374491 99359763 99343401 99325705 99308032 99291414 99274397 99254829 99232811
3092.1 99232811 99210137 99188095 99166334 99144554 99123377 99103183 99084073 99065131 99044263 99020666 98995173 98968768
3116.5 98968768 98941422 98911840 98879838 98847032 98814315 98781234 98747444 98713064 98678190 98644072 98611951 98580217
3141I8580217l3700l6150l8183m0102m2027m3750m4859m5466m6605m8578n0753n2905
3165.5I8057139n4085n3501n2804n3638n5552n7667n9641o1279o2555o3897o5535o7401
3189.9I7349584o8980p0048p0977p1937p2431p2825p3219p3129p3224p4059p5221p6651
3214.4I6476883p7558p6878p6252p7480p9471q0979q2171q2749q2350q1718q1491q1522
3238.9I5516264q1175q0282p8934p7045p4089p0434o8099o6679o4266o1256n8234n5617
3263.4I4680154n4466n5117n6898n8616n9831o1214o2406o3318o4796o7109o9976p2592
3287.8I3933815p4286p5221p6550q0645q7666r5785j03897j11431j18029j23489j27691
3310.3I2859125j32000j37562j43921j50627j56731j60139j61732j64759j70254j77122
$$ plain form
3141 98580217 98546517 98510367 98472184 98432082 98390055 98346305 98301446 98255980 98209375 98160797 98110044 98057139
3165.5 98057139 98003054 97949553 97896749 97843111 97787559 97729892 97670251 97608972 97546417 97482520 97416985 97349584
3189.9 97349584 97280604 97210556 97139579 97067642 96995211 96922386 96849167 96776038 96702814 96628755 96553534 96476883
3214.4 96476883 96399325 96322447 96246195 96168715 96089244 96008265 95926094 95843345 95760995 95679277 95597786 95516264
3238.9 95516264 95435089 95354807 95275873 95198828 95124739 95054305 94986206 94919527 94855261 94794005 94735771 94680154
3263.4 94680154 94625688 94570571 94513673 94455057 94395226 94334012 94271606 94208288 94143492 94076383 94006407 93933815
3287.8 93933815 93859529 93784308 93707758 93627113 93539447 93443662 93339765 93228334 93110305 92986816 92859125
3310.3 92859125 92727125 92589563 92445642 92295015 92138284 91978145 91816413 91651654 91481400 91304278
3330.7I1304278j84476j90967j95694k00135k05707k12181k18952k26104k33811k41005
3351.1H9195246k45065k45780k47192k51329k55627k58374k59489k58702k57045k55817
3371.5H6660826k53951k48170k37775k26563k16812k05547j90168j74553j64759j59973
3391.9H4582555j55514j50222j45411j41901j40089j38539j35040j28895j22184j17159
3412.3H3207601j11365j02210r0462p8225o7258n7650m8357l8737k8443j7757q153
3434.7H2558984M64R138J7381K5224L4362M4829N4139O3211P5400Q8560R7001J00410
3459.2H3169103J02216J05291J09780J12271J11789J11425J11866J12098J12152J11837
3479.6H4269828J12158J15084J19937J24675J27405J27601J27060J28024J30672J33150
$$ plain form
3330.7 91304278 91119802 90928835 90733141 90533006 90327299 90115118 89896166 89670062 89436251 89195246
3351.1 89195246 88950181 88704401 88457209 88205880 87950253 87691879 87432390 87173688 86916643 86660826
3371.5 86660826 86406875 86158705 85920930 85694367 85477555 85272008 85081840 84907287 84742528 84582555
3391.9 84582555 84427041 84276819 84131408 83989507 83849418 83710879 83575839 83446944 83324760 83207601
3412.3 83207601 83096236 82994026 82903564 82825339 82758081 82700431 82652074 82613337 82584894 82567137 82558984
3434.7 82558984 82559448 82568586 82585967 82611191 82645553 82690382 82744521 82807732 82883132 82971692 83068693 83169103
3459.2 83169103 83271319 83376610 83486390 83598661 83710450 83821875 83933741 84045839 84157991 84269828
3479.6 84269828 84381986 84497070 84617007 84741682 84869087 84996688 85123748 85251772 85382444 85515594
3500H5515594J34379J35136J35630J36906J39642J42741J46085J49059J50884J53613
3520.4H6939669J57189J58083J57297J58584J63186J68168J69462J68556J69230J71143
3540.8H8580567J71423J70612J70416J68794J65421J66905J72656J75924J77782J81759
3561.1I0302259J86956J90824J93703J96660J99550K04182K10660K15811K18558K19912
3581.5I2339075K22653K30080K37292K38663K35963K33793K32434K31516K32017K29788
3601.9I4663274K26915K30301K32660K26117K13336K05243K03961K01160J95438J86997
3622.3I6785402J77115J69212J61880J52076J40643J36018J41018J43397J34307J20747
3642.7I8261815J09762J05971J03528R3943Q1300P1883O5136N5469M6068L8934L4797
$$ plain form
3500 85515594 85649973 85785109 85920739 86057645 86197287 86340028 86486113 86635172 86786056 86939669
3520.4 86939669 87096858 87254941 87412238 87570822 87734008 87902176 88071638 88240194 88409424 88580567
3540.8 88580567 88751990 88922602 89093018 89261812 89427233 89594138 89766794 89942718 90120500 90302259
3561.1 90302259 90489215 90680039 90873742 91070402 91269952 91474134 91684794 91900605 92119163 92339075
3581.5 92339075 92561728 92791808 93029100 93267763 93503726 93737519 93969953 94201469 94433486 94663274
3601.9 94663274 94890189 95120490 95353150 95579267 95792603 95997846 96201807 96402967 96598405 96785402
3622.3 96785402 96962517 97131729 97293609 97445685 97586328 97722346 97863364 98006761 98141068 98261815
3642.7 98261815 98371577 98477548 98581076 98675019 98756319 98828202 98893338 98948807 98994875 99033809 99068606
3665.2I9068606L8379L9018K7704J8960K4879L3468L7009L7616L5667L3743L8015M2797
3689.6I9475861M0632L7485L5012L3027L0494K4730J9133K0420K6155K6596K2965J7214
3714.1I9809724Q434J455L033Q834J1742J0192P350J1372J5682J4305J4806J8239J8638
3740.6I9953806J5521J2470P879R60k193R59N263o97N329p779q195n824m667j710J102
3771.2I9972224R96P33J406m59k992l397l225Q41M911M518M089M834M685J442j73m05
3803.9I9990028j097P34J025r54j663k599l260j270m1K539O497O461L087%n000N06
3836.5I9994993p713r12K540O91k986n800n901o359m894J133N650P004M577k02m483
3867.1I9977338q052m030L732L653J467J168k4l230o485n246k92K945K640n06k355
$$ plain form
3665.2 99068606 99106985 99146003 99173707 99192667 99217546 99251014 99288023 99325639 99361306 99395049 99433064 99475861
3689.6 99475861 99516493 99553978 99588990 99622017 99652511 99677241 99696374 99716794 99742949 99769545 99792510 99809724
3714.1 99809724 99818158 99819613 99822646 99831480 99843222 99853414 99860764 99872136 99887818 99902123 99916929 99935168 99953806
3740.6 99953806 99969327 99981797 99989676 99990636 99988443 99989402 99994665 99993968 99999297 99991518 99983323 99977499 99972832 99971122 99972224
3771.2 99972224 99973220 99973953 99975359 99974900 99971908 99968511 99965286 99966127 99971038 99975556 99979645 99984479 99989164 99990606 99990433 99990028
3803.9 99990028 99988931 99989665 99990690 99989736 99988073 99985474 99982214 99980944 99980903 99983442 99989939 99996400 99999487 99999487 99994487 99994993
3836.5 99994993 99987280 99986368 99988908 99989599 99986613 99980813 99974912 99968553 99963659 99964792 99970442 99977446 99982023 99981821 99977338
3867.1 99977338 99969286 99965256 99968988 99972641 99974108 99975276 99975252 99972022 99965537 99960291 99959999 99962944 99965584 99965078 99962723
3897.7I9962723k569l010r36K69j228m77R48j478m453k760J645M483M029J591P2l82
3930.3I9958467j299j395Q4P75K68P27K241K903L028M113M386K796J132P04J198Q16
3962.9I9980944m76n43J079K319K569K521K587K682K527K134J353l22L04j37L99%O0
3997.6A00000000
$$ plain form
3897.7 99962723 99960154 99957144 99956208 99956477 99955249 99954772 99955720 99954242 99949789 99947029 99948674 99953157 99957186 99958777 99958849 99958467
3930.3 99958467 99957168 99955773 99955857 99956632 99956900 99957627 99959868 99962771 99965799 99969912 99974298 99977094 99978226 99978930 99980128 99980944
3962.9 99980944 99980468 99979925 99981004 99983323 99985892 99988413 99991000 99993682 99996209 99998343 99999696 99999374 99999678 99999541 99999940 99999940 100000000
3997.6 100000000
##END=$$ End of the data block
