##TITLE=AD 05 $$ Begin of the data block
##JCAMP-DX=5.00 $$ ACD/SpecManager v 10.08
##SPECTROMETER/DATA SYSTEM=Alpha
##DATE=16 Dec 2014 10:37:32
##DATA TYPE=INFRARED SPECTRUM
##DATA CLASS=XYDATA
##ORIGIN=
##OWNER=
##NPOINTS=1765
##FIRSTX=399.76428223
##LASTX=3997.64306641
##MAXX=3997.64306641
##MINX=399.76428223
##MAXY=1.00000000
##MINY=0.28232414
##XFACTOR=1.0000000000
##YFACTOR=0.000000010000000
##FIRSTY=1.00000000
##DELTAX=2.03961372
##XUNITS=1/CM
##YUNITS=ARBITRARY UNITS
##XYDATA=(X++(Y..Y))
$$ plain form
399.8 100000000 98443520 96907675 95362800 93796384 92204720 90583825 88941145 87292570
416.1 87292570 85651535 84028363 82431549 80868179 79350066 77884048 76470298 75109977 73811960
434.4 73811960 72574008 71374601 70212120 69093895 68020910 66986173 65982491 65013564 64091331
452.8 64091331 63228184 62435806 61721724 61083907 60527641 60068083 59714705 59467059 59318310 59267557
473.2 59267557 59317034 59453082 59651691 59896004 60182047 60510898 60880554 61285275 61719489 62185937
493.6 62185937 62691379 63236159 63811815 64415842 65064454 65778029 66557240 67388535 68273062 69226241
514 69226241 70267183 71408492 72648817 73982537 75415528 76958537 78603697 80324000 82089561
532.3 82089561 83886355 85707694 87522662 89275223 90921921 92449319 93850929 95108080 96192688
$$ packed form
399.8A00000000j556480j535845j544875j566416j591664j620895j642680j648575
416.1H7292570j641035j623172j596814j563370j518113j466018j413750j360321j298017
434.4G3811960j237952j199407j162481j118225j072985j034737j003682r68927r22233
452.8F4091331q63147p92378p14082o37817n56266m59558l53378k47646j48749n0753
473.2E9267557M9477J36048J98609K44313K86043L28851L69656M04721M34214M66448
493.6F2185937N05442N44780N75656O04027O48612P13575P79211Q31295Q84527R53179
514F9226241J040942J141309J240325J333720J432991J543009J645160J720303J765561
532.3H2089561J796794J821339J814968J752561J646698J527398J401610J257151J084608
$$ plain form
550.7 96192688 97089350 97816229 98409140 98886931 99250656 99506915 99682838 99815720 99921727 99987310
571.1 99987310 99977040 99989730 99991095 99991095 99991095 99987966 99996871 99996394 99996394 99996394 99996394 99996394 99996394 99996394 99983704 99987310 99948692 99920166 99916857 99921423 99914229
613.9 99914229 99904466 99917048 99955076 99991530 99982625 99991095 99990708 99990708 99965698 99974990 99928176 99887007 99859941 99825913
642.5 99825913 99760276 99664170 99558198 99455750 99343032 99189818 99001932 98808008 98621690 98429108
662.9 98429108 98212153 97975862 97741938 97517776 97285783 97023028 96725774 96408933 96082366 95740819
683.3 95740819 95369267 94965309 94556785 94157708 93755239 93328059 92870009 92393196 91906321 91397178
703.7 91397178 90841568 90224749 89550257 88823587 88038659 87188667 86283910 85353118 84423113 83502448
724.1 83502448 82587403 81680143 80797297 79957336 79162538 78399450 77655578 76932168 76237196 75567549
$$ packed form
550.7I6192688Q96662P26879N92911M77791L63725K56259J75923J32882J06007O5583
571.1I9987310j0270J2690J365%Tl129Q905m77%Xj2690L606l8618k8526l309M566p194
613.9I9914229r763J2582L8028L6454q905Q470l87%k5010R292m6814m1169k7066l4028
642.5I9825913o5637r6106j05972j02448j12718j53214j87886j93924j86318j92582
662.9I8429108k16955k36291k33924k24162k31993k62755k97254l16841l26567l41547
683.3I5740819l71552m03958m08524l99077m02469m27180m58050m76813m86875n09143
703.7I1397178n55610o16819o74492p26670p84928q49992r04757r30792r30005r20665
724.1H3502448r15045r07260q82846q39961p94798p63088p43872p23410o94972o69647
$$ plain form
744.5 75567549 74911118 74264586 73642588 73066431 72546148 72078031 71657407 71288514 70979559 70732915
764.9 70732915 70544434 70414686 70355308 70383054 70505381 70713294 70992124 71334559 71741658 72214079
785.3 72214079 72746086 73329592 73965681 74664927 75435174 76273566 77172065 78126496 79135233 80187821
805.6 80187821 81254297 82290655 83255732 84119886 84857643 85438126 85828286 86006701 85971183 85727632
826 85727632 85275847 84611231 83740026 82686162 81482852 80158693 78734285 77233350 75690341
844.4 75690341 74140543 72605026 71090066 69601583 68153781 66758835 65415299 64110518 62833637
862.8 62833637 61584979 60371965 59198499 58061570 56957507 55888999 54862547 53878516 52929270
881.1 52929270 52007639 51113206 50247467 49405491 48577216 47755405 46941802 46144617 45370093 44619438
$$ packed form
744.5G5567549o56431o46532o21998n76157n20283m68117m20624l68893l08955k46644
764.9G0732915j88481j29748n9378K7746J22327K07913K78830L42435M07099M72421
785.3G2214079N32007N83506O36089O99246P70247Q38392Q98499R54431J008737J052588
805.6H0187821J066476J036358R65077Q64154P37757N80483L90160J78415l5518k43551
826H5727632m51785o64616q71205j053864j203310j324159j424408j500935j543009
844.4G5690341j549798j535517j514960j488483j447802j394946j343536j304781j276881
862.8F2833637j248658j213014j173466j136929j104063j068508j026452r84031r49246
881.1E2929270r21631q94433q65739q41976q28275q21811q13603p97185p74524p50655
$$ plain form
901.5 44619438 43893147 43194687 42528960 41898179 41299507 40728843 40185395 39671412 39187822 38731217
921.9 38731217 38295892 37878403 37479374 37100098 36738983 36392897 36061138 35745242 35446179 35162815
942.3 35162815 34892523 34633231 34384698 34147781 33921754 33703604 33490676 33283469 33084202 32893097
962.7 32893097 32707679 32525435 32346362 32172623 32005790 31845090 31689101 31537667 31391820 31252211
983.1 31252211 31117401 30984962 30853805 30724347 30595836 30466187 30334240 30200356 30066547 29935926
1003.5 29935926 29810122 29689151 29573542 29463664 29358822 29257196 29156864 29056540 28955925 28855228
1023.9 28855228 28755090 28657398 28564826 28480017 28405344 28342927 28293884 28258952 28238603 28232414 28238851 28256711
1048.4 28256711 28285992 28325951 28375363 28433815 28501096 28576252 28657898 28744161 28833723 28926975 29024953 29128546
$$ packed form
901.5D4619438p26291o98460o65727o30781n98672n70664n43448n13983m83590m56605
921.9C8731217m35325m17489l99029l79276l61115l46086l31759l15896k99063k83364
942.3C5162815k70292k59292k48533k36917k26027k18150k12928k07207j99267j91105
962.7C2893097j85418j82244j79073j73739j66833j60700j55989j51434j45847j39609
983.1C1252211j34810j32439j31157j29458j28511j29649j31947j33884j33809j30621
1003.5B9935926j25804j20971j15609j09878j04842j01626j00332j00324j00615j00697
1023.9B8855228j00138r7692r2572q4809p4673o2417m9043l4932k0349o189O437J7860
1048.4B8256711K9281L9959M9412N8452O7281P5156Q1646Q6263Q9562R3252R7978J03593
$$ plain form
1072.8 29128546 29238614 29356188 29482558 29619870 29769430 29930574 30102548 30286065 30481139 30685940
1093.2 30685940 30898076 31115431 31337187 31563061 31792107 32023093 32255578 32490200 32728207 32970023
1113.6 32970023 33214656 33461344 33710998 33965546 34225202 34488136 34752262 35016575 35280499 35542580
1134 35542580 35800761 36053553 36301190 36545685 36789468 37032697 37273717 37512290 37750953 37992242
1154.4 37992242 38236594 38484082 38736212 38995841 39265001 39544141 39833194 40133011 40446007 40774804
1174.8 40774804 41119438 41476375 41841924 42215678 42599323 42992595 43393448 43800569 44214767 44637540
1195.2 44637540 45068645 45505905 45946789 46390700 46838313 47288960 47739327 48185787 48627076 49064285
1215.6 49064285 49497780 49925193 50343734 50753087 51155621 51553130 51944262 52326435 52699459 53066123
$$ packed form
1072.8B9128546J10068J17574J26370J37312J49560J61144J71974J83517J95074K04801
1093.2C0685940K12136K17355K21756K25874K29046K30986K32485K34622K38007K41816
1113.6C2970023K44633K46688K49654K54548K59656K62934K64126K64313K63924K62081
1134C5542580K58181K52792K47637K44495K43783K43229K41020K38573K38663K41289
1154.4C7992242K44352K47488K52130K59629K69160K79140K89053K99817L12996L28797
1174.8D0774804L44634L56937L65549L73754L83645L93272M00853M07121M14198M22773
1195.2D4637540M31105M37260M40884M43911M47613M50647M50367M46460M41289M37209
1215.6D9064285M33495M27413M18541M09353M02534L97509L91132L82173L73024L66664
$$ plain form
1236 53066123 53428805 53786558 54136884 54480177 54820317 55161440 55504233 55847281 56191045 56539279
1256.4 56539279 56895643 57259327 57625991 57993037 58361661 58733052 59105390 59474009 59835202 60189486
1276.8 60189486 60539240 60883808 61219203 61542827 61856222 62163085 62464637 62758750 63043517 63321143
1297.2 63321143 63596624 63872033 64145613 64415067 64680666 64945257 65210944 65475619 65735489 65989608
1317.6 65989608 66240442 66489905 66736633 66978019 67212814 67443174 67672247 67899293 68120521 68334413
1338 68334413 68543464 68751794 68959999 69164389 69362795 69556063 69744873 69927025 70097983 70255446
1358.4 70255446 70402688 70544767 70684189 70817518 70936936 71040606 71139395 71244836 71357232 71473861
1378.8 71473861 71596700 71727914 71865773 72005898 72144735 72284091 72427833 72574729 72717714 72846431
$$ packed form
1236E3066123L62682L57753L50326L43293L40140L41123L42793L43048L43764L48234
1256.4E6539279L56364L63684L66664L67046L68624L71391L72338L68619L61193L54284
1276.8F0189486L49754L44568L35395L23624L13395L06863L01552K94113K84767K77626
1297.2F3321143K75481K75409K73580K69454K65599K64591K65687K64675K59870K54119
1317.6F5989608K50834K49463K46728K41386K34795K30360K29073K27046K21228K13892
1338F8334413K09051K08330K08205K04390J98406J93268J88810J82152J70958J57463
1358.4G0255446J47242J42079J39422J33329J19418J03670R8789J05441J12396J16629
1378.8G1473861J22839J31214J37859J40125J38837J39356J43742J46896J42985J28717
$$ plain form
1399.2 72846431 72955430 73053056 73153669 73258340 73359400 73454171 73545355 73633850 73715186 73784631 73842973
1421.6 73842973 73894906 73941183 73979628 74008024 74027860 74047744 74078006 74122339 74177283 74247432 74343359 74464387
1446.1 74464387 74603730 74756211 74919027 75089091 75263917 75445497 75633806 75824273 76014900 76207429
1466.5 76207429 76403368 76601565 76803350 77019012 77253181 77493304 77731574 77970552 78208423 78438973
1486.9 78438973 78660315 78879160 79099810 79310846 79502797 79674339 79830092 79978096 80127424 80289048
1507.3 80289048 80464721 80647439 80835044 81027204 81220239 81412339 81600249 81784040 81973368 82160521
1527.7 82160521 82333869 82490873 82634509 82769698 82897830 83020073 83136892 83257186 83379769 83493662
1548.1 83493662 83595228 83686441 83769697 83850664 83937919 84027243 84110570 84182817 84240806 84284186 84313959
$$ packed form
1399.2G2846431J08999R7626J00613J04671J01060R4771R1184Q8495Q1336O9445N8342
1421.6G3842973N1933M6277L8445K8396J9836J9884L0262M4333N4944P0149R5927J21028
1446.1G4464387J39343J52481J62816J70064J74826J81580J88309J90467J90627J92529
1466.5G6207429J95939J98197K01785K15662K34169K40123K38270K38978K37871K30550
1486.9G8438973K21342K18845K20650K11036J91951J71542J55753J48004J49328J61624
1507.3H0289048J75673J82718J87605J92160J93035J92100J87910J83791J89328J87153
1527.7H2160521J73348J57004J43636J35189J28132J22243J16819J20294J22583J13893
1548.1H3493662J01566R1213Q3256Q0967Q7255Q9324Q3327P2247N7989M3380K9773
$$ plain form
1570.5 84313959 84334773 84355283 84381938 84403008 84408396 84398454 84377098 84347558 84307265 84252816 84186065 84107327
1595 84107327 84011781 83900571 83778173 83643401 83497590 83348489 83202261 83060968 82925004 82793927
1615.4 82793927 82669061 82555532 82464331 82400137 82362092 82350218 82364756 82412118 82500482 82620531 82771331
1637.8 82771331 82971495 83212423 83474481 83745694 84023768 84309053 84598684 84891319 85182333 85463905
1658.2 85463905 85732919 85988188 86230111 86459017 86674088 86889619 87111902 87317902 87498397 87658972
1678.6 87658972 87809563 87953532 88086665 88212401 88337022 88458574 88572431 88671702 88752019 88820702
1699 88820702 88894033 88975197 89045876 89095718 89125472 89138585 89138049 89124179 89098173 89064193 89021498 88968623
1723.5 88968623 88902342 88820195 88727874 88637644 88560343 88492441 88423777 88355410 88293028 88241297 88201827 88178152
$$ packed form
1570.5H4313959K0814K0510K6655K1070N388r942k1356k9540m0293n4449o6751p8738
1595H4107327r5546j11210j22398j34772j45811j49101j46228j41293j35964j31077
1615.4H2793927j24866j13529r1201o4194l8045j1874J4538M7362Q8364J20049J50800
1637.8H2771331K00164K40928K62058K71213K78074K85285K89631K92635K91014K81572
1658.2H5463905K69014K55269K41923K28906K15071K15531K22283K06000J80495J60575
1678.6H7658972J50591J43969J33133J25736J24621J21552J13857R9271Q0317O8683
1699H8820702P3331Q1164P0679M9842K9754J3113n36j3870k6006l3980m2695n2875
1723.5H8968623o6281q2147r2321r0230p7301o7902o8664o8367o2382n1731l9470k3675
$$ plain form
1748 88178152 88175833 88196200 88240415 88312536 88414514 88545501 88704038 88888872 89096260 89315468 89534956
1770.4 89534956 89749467 89956439 90153205 90335274 90498263 90640467 90765643 90880746 90988111 91087508
1790.8 91087508 91179442 91267186 91354388 91439468 91518068 91590136 91660041 91731369 91804552 91877317 91948324 92020780
1815.3 92020780 92097199 92174411 92246765 92312694 92376137 92442054 92510992 92578012 92639631 92697740 92755842 92813820
1839.8 92813820 92868966 92920434 92970818 93022346 93073428 93121529 93166471 93210721 93257737 93309331 93363053 93413919
1864.2 93413919 93460906 93507522 93556100 93604255 93649191 93691605 93735015 93782091 93831873 93881387 93929774 93979234
1888.7 93979234 94031602 94085574 94137418 94185698 94233161 94283819 94337690 94390893 94441444 94492012 94546205 94603288
1913.2 94603288 94657743 94705945 94750816 94797325 94846159 94893748 94937873 94981033 95027441 95078248 95129228 95175815
$$ packed form
1748H8178152k319K0367M4215P2121J01978J30987J58537J84834K07388K19208K19488
1770.4H9534956K14511K06972J96766J82069J62989J42204J25176J15103J07365R9397
1790.8I1087508R1934Q7744Q7202Q5080P8600P2068O9905P1328P3183P2765P1007P2456
1815.3I2020780P6419P7212P2354O5929O3443O5917O8938O7020O1619N8109N8102N7978
1839.8I2813820N5146N1468N0384N1528N1082M8101M4942M4250M7016N1594N3722N0866
1864.2I3413919M6987M6616M8578M8155M4936M2414M3410M7076M9782M9514M8387M9460
1888.7I3979234N2368N3972N1844M8280M7463N0658N3871N3203N0551N0568N4193N7083
1913.2I4603288N4455M8202M4871M6509M8834M7589M4125M3160M6408N0807N0980M6587
$$ plain form
1937.7 95175815 95219523 95265830 95316386 95366615 95411438 95451653 95492750 95537674 95583308 95625335 95664346 95704859
1962.1 95704859 95749354 95794886 95836127 95872408 95908898 95950055 95994210 96035570 96071506 96106255 96144980 96186280
1986.6 96186280 96223885 96255028 96283704 96315271 96349692 96381766 96408546 96433824 96463335 96497935 96531278 96554869
2011.1 96554869 96569234 96583641 96602935 96623588 96640986 96656537 96676069 96702272 96731341 96758223 96783292 96811599
2035.6 96811599 96845222 96879143 96905255 96921158 96934587 96953511 96976578 96997333 97013497 97029412 97049898 97073781
2060 97073781 97095644 97113073 97129941 97151411 97176611 97199851 97218078 97235125 97256804 97283334 97309226 97330290
2084.5 97330290 97348946 97370833 97397250 97423816 97446579 97467160 97490537 97518319 97546351 97570300 97591609 97615862
2109 97615862 97645330 97675741 97701925 97724134 97747445 97775060 97804171 97829849 97851837 97874498 97900933 97929090
$$ packed form
1937.7I5175815M3708M6307N0556N0229M4823M0215M1097M4924M5634M2027L9011M0513
1962.1I5704859M4495M5532M1241L6281L6490M1157M4155M1360L5936L4749L8725M1300
1986.6I6186280L7605L1143K8676L1567L4421L2074K6780K5278K9511L4600L3343K3591
2011.1I6554869J4365J4407J9294K0653J7398J5551J9532K6203K9069K6882K5069K8307
2035.6I6811599L3623L3921K6112J5903J3429J8924K3067K0755J6164J5915K0486K3883
2060I7073781K1863J7429J6868K1470K5200K3240J8227J7047K1679K6530K5892K1064
2084.5I7330290J8656K1887K6417K6566K2763K0581K3377K7782K8032K3949K1309K4253
2109I7615862K9468L0411K6184K2209K3311K7615K9111K5678K1988K2661K6435K8157
$$ plain form
2133.5 97929090 97954458 97976130 97998399 98025113 98054564 98081797 98105204 98128474 98155618 98185050 98211199 98232162
2157.9 98232162 98251933 98275131 98301619 98327279 98349535 98371017 98396075 98425138 98454398 98480964 98506379 98534149
2182.4 98534149 98564410 98593003 98616809 98637986 98660851 98686922 98713285 98736364 98756373 98777002 98800451 98824698
2206.9 98824698 98846346 98865187 98884165 98905569 98928177 98948950 98967028 98984832 99004662 99025619 99044412 99058795
2231.4 99058795 99069715 99079627 99089134 99096400 99100530 99103892 99109781 99119467 99131751 99145246 99160683 99180245 99204248
2257.9 99204248 99230146 99254644 99276292 99295974 99315143 99333656 99350190 99364167 99376810 99389613 99402755 99414980
2282.3 99414980 99425489 99435401 99446565 99459195 99471116 99480301 99487138 99493814 99502081 99511415 99519438 99525285 99530685
2308.9 99530685 99537295 99544680 99551439 99557775 99565053 99573988 99583375 99591315 99597448 99602175 99605823 99609411 99612534 99613547
$$ packed form
2133.5I7929090K5368K1672K2269K6714K9451K7233K3407K3270K7144K9432K6149K0963
2157.9I8232162J9771K3198K6488K5660K2256K1482K5058K9063K9260K6566K5415K7770
2182.4I8534149L0261K8593K3806K1177K2865K6071K6363K3079K0009K0629K3449K4247
2206.9I8824698K1648J8841J8978K1404K2608K0773J8078J7804J9830K0957J8793J4383
2231.4I9058795J0920R912R507P266M130L362N889R686J2284J3495J5437J9562K4003
2257.9I9204248K5898K4498K1648J9682J9169J8513J6534J3977J2643J2803J3142J2225
2282.3I9414980J0509R912J1164J2630J1921R185O837O676Q267R334Q023N847N400
2308.9I9530685O610P385O759O336P278Q935R387P940O133M727L648L588L123J013
$$ plain form
2337.4 99613547 99613321 99615705 99622995 99633509 99645060 99658304 99674475 99692672 99710429 99725699 99737608 99745429 99749529
2363.9 99749529 99751663 99752176 99751151 99751246 99755621 99764299 99774551 99785095 99797177 99811608 99827141 99841613 99853426
2390.4 99853426 99862754 99870718 99878192 99884790 99889505 99892884 99897003 99902970 99909574 99914819 99917930 99920636 99925387 99931955
2419 99931955 99937683 99941337 99944818 99950266 99957120 99962479 99964875 99966270 99969542 99974769 99978948 99979937 99978960 99979615 99983269 99986976
2451.6 99986976 99987584 99986136 99986261 99989504 99993205 99993861 99992067 99991506 99993896 99996793 99996972 99994737 99993563 99995947 99999601 99995965
2484.3 99995965 99996358 99992788 99992758 99994719 99993843 99988592 99982804 99980235 99979883 99977499 99971384 99964976 99962717 99964041 99964041 99960089
2516.9 99960089 99955225 99954170 99957144 99959648 99958384 99955636 99955958 99959737 99962479 99960512 99956012 99954206 99956483 99958348 99955499
2547.5 99955499 99949437 99945420 99945974 99947929 99946576 99942040 99938887 99939424 99940127 99936748 99930084 99924749 99923354 99922866 99918485
$$ packed form
2337.4I9613547k26K384P290J0514J1551J3244J6171J8197J7757J5270J1909P821M100
2363.9I9749529K134N13j025R5M375Q678J0252J0544J2082J4431J5533J4472J1813
2390.4I9853426R328P964P474O598M715L379M119N967O604N245L111K706M751O568
2419I9931955N728L654L481N448O854N359K396J395L272N227M179R89r77O55L654L707
2451.6I9986976O08j448J25L243L701O56j794n61K390K897J79k235j174K384L654l636
2484.3I9995965L93l570l0J961q76n251n788k569l52k384o115o408k259J324%l952
2516.9I9960089m864j055K974K504j264k748L22L779K742j967m500j806K277J865k849
2547.5I9955499o062m017N54J955j353m536l153N37P03l379o664n335j395m88m381
$$ plain form
2578.1 99918485 99910164 99902678 99899483 99898440 99894577 99886733 99879235 99875891 99874842 99871236 99863744 99855810 99851030 99848473
2606.6 99848473 99843597 99834532 99824846 99818563 99815196 99810767 99802804 99793714 99787796 99785399 99782580 99776322 99768102 99761701
2635.2 99761701 99758148 99754024 99745935 99735224 99726236 99720442 99714929 99706542 99695742 99685967 99679369 99674147 99667048 99657393
2663.7 99657393 99647993 99641401 99636340 99629295 99619502 99610019 99603492 99598575 99591845 99582350 99572706 99565607 99560457 99554271
2692.3 99554271 99545318 99535102 99526453 99519849 99512935 99503917 99493808 99484831 99476916 99467605 99455363 99441808 99430346
2718.8 99430346 99422163 99414992 99406087 99395716 99386549 99379867 99373746 99365556 99354982 99344039 99334556 99325883 99315882
2745.3 99315882 99304336 99293399 99284959 99278158 99270380 99260354 99249732 99240851 99233663 99225390 99213904 99200684 99188840
2771.8 99188840 99179053 99168897 99156320 99142236 99128944 99117208 99105692 99092674 99078417 99064803 99052995 99041837
$$ packed form
2578.1I9918485q321p486l195j043l863p844p498l344j049l606p492p934m780k557
2606.6I9848473m876r065r686o283l367m429p963r090n918k397k819o258q220o401
2635.2I9761701l553m124q089j0711q988n794n513q387j0800r775o598n222p099r655
2663.7I9657393r400o592n061p045r793r483o527m917o730r495r644p099n150o186
2692.3I9554271q953j0216q649o604o914r018j0109q977p915r311j2242j3555j1462
2718.8I9430346q183p171q905j0371r167o682o121q190j0574j0943r483q673j0001
2745.3I9315882j1546j0937q440o801p778j0026j0622q881p188q273j1486j3220j1844
2771.8I9188840r787j0156j2577j4084j3292j1736j1516j3018j4257j3614j1808j1158
$$ plain form
2796.3 99041837 99028963 99013865 98998725 98985082 98971564 98955804 98937613 98919070 98901916 98885888 98869318 98851174
2820.8 98851174 98831993 98812509 98792464 98770005 98742950 98710734 98673624 98630655 98579752 98520386 98455793 98391032
2845.3 98391032 98329741 98273641 98223746 98181289 98147184 98121345 98101866 98085785 98071617 98059726 98049760 98039377
2869.7 98039377 98026294 98010916 97995740 97982568 97970927 97958887 97945130 97929662 97912252 97891122 97864431 97832590
2894.2 97832590 97798276 97763968 97729564 97692567 97651219 97606331 97559476 97511017 97459853 97405535 97350430 97298402
2918.7 97298402 97251731 97211105 97177804 97154164 97142148 97141945 97151458 97167313 97187287 97210425 97234923 97257113
2943.2 97257113 97272927 97280329 97280884 97277552 97272021 97265047 97257912 97253036 97253180 97259659 97271657 97287822 97307307 97329247
2971.7 97329247 97351784 97372144 97388196 97399920 97409004 97416341 97421843 97425359 97427320 97429466 97433680 97439933 97447348
$$ packed form
2796.3I9041837j2874j5098j5140j3643j3518j5760j8191j8543j7154j6028j6570j8144
2820.8I8851174j9181j9484k0045k2459k7055l2216l7110m2969n0903n9366o4593o4761
2845.3I8391032o1291n6100m9895m2457l4105k5839j9479j6081j4168j1891r966j0383
2869.7I8039377j3083j5378j5176j3172j1641j2040j3757j5468j7410k1130k6691l1841
2894.2I7832590l4314l4308l4404l6997m1348m4888m6855m8459n1164n4318n5105n2028
2918.7I7298402m6671m0626l3301k3640j2016k03R513J5855J9974K3138K4498K2190
2943.2I7257113J5814P402N55l332n531o974p135m876J44O479J1998J6165J9485K1940
2971.7I7329247K2537K0360J6052J1724R084P337N502L516J961K146M214O253P415
$$ plain form
2998.2 97447348 97455734 97465378 97476381 97488314 97500253 97511369 97521591 97531390 97540748 97548872 97554457 97557116 97558177
3024.7 97558177 97558767 97558212 97555643 97551244 97545832 97540200 97534269 97527117 97518373 97508913 97499764 97490674 97480237 97467661
3053.3 97467661 97454244 97441649 97429323 97415382 97399336 97382665 97366685 97351122 97334367 97315347 97295088 97275275
3077.8 97275275 97256231 97236967 97216421 97194839 97173744 97153586 97132802 97110099 97085971 97061813 97037870 97012901
3102.2 97012901 96985924 96957803 96930361 96904373 96878844 96851939 96822977 96793073 96763510 96733391 96701080 96666312
3126.7 96666312 96629995 96593469 96557105 96519697 96480584 96441114 96402544 96364343 96325111 96283644 96240443 96197128
3151.2 96197128 96153724 96108413 96060109 96009427 95957571 95905191 95851576 95795459 95737112 95678133 95618522 95557141
3175.7 95557141 95493370 95427382 95360422 95293480 95225656 95155275 95082182 95007759 94933009 94857633 94780928 94702810
$$ packed form
2998.2I7447348Q386R644J1003J1933J1939J1116J0222R799R358Q124N585K659J061
3024.7I7558177N90n55k569m399n412n632n931p152q744r460r149r090j0437j2576
3053.3I7467661j3417j2595j2326j3941j6046j6671j5980j5563j6755j9020k0259j9813
3077.8I7275275j9044j9264k0546k1582k1095k0158k0784k2703k4128k4158k3943k4969
3102.2I7012901k6977k8121k7442k5988k5529k6905k8962k9904k9563l0119l2311l4768
3126.7I6666312l6317l6526l6364l7408l9113l9470l8570l8201l9232m1467m3201m3315
3151.2I6197128m3404m5311m8304n0682n1856n2380n3615n6117n8347n8979n9611o1381
3175.7I5557141o3771o5988o6960o6942o7824p0381p3093p4423p4750p5376p6705p8118
$$ plain form
3200.1 94702810 94624060 94545341 94466668 94387591 94308090 94228750 94150060 94071406 93991262 93908900 93825239 93741852
3224.6 93741852 93658847 93574905 93489105 93401772 93313944 93226415 93139625 93053651 92969012 92886567 92806655 92728895
3249.1 92728895 92652971 92578828 92507368 92439824 92375839 92313349 92250979 92188889 92127448 92066348 92004567 91941226
3273.6 91941226 91876715 91812021 91746432 91678160 91605967 91529512 91449714 91367793 91283709 91196460 91105080 91009092
3298 91009092 90908080 90801376 90688163 90568793 90444827 90316957 90183800 90043551 89895838 89741397
3318.4 89741397 89581549 89417666 89249724 89076608 88897979 88714004 88524354 88329023 88128436 87922806
3338.8 87922806 87712210 87496370 87274194 87044734 86808640 86567777 86323875 86077368 85826856 85572076
3359.2 85572076 85315424 85058016 84799516 84541202 84284800 84031659 83783793 83543390 83311683 83088797
$$ packed form
3200.1I4702810p8750p8719p8673p9077p9501p9340p8690p8654q0144q2362q3661q3387
3224.6I3741852q3005q3942q5800q7333q7828q7529q6790q5974q4639q2445p9912p7760
3249.1I2728895p5924p4143p1460o7544o3985o2490o2370o2090o1441o1100o1781o3341
3273.6I1941226o4511o4694o5589o8272p2193p6455p9798q1921q4084q7249r1380r5988
3298I1009092j01012j06704j13213j19370j23966j27870j33157j40249j47713j54441
3318.4H9741397j59848j63883j67942j73116j78629j83975j89650j95331k00587k05630
3338.8H7922806k10596k15840k22176k29460k36094k40863k43902k46507k50512k54780
3359.2H5572076k56652k57408k58500k58314k56402k53141k47866k40403k31707k22886
$$ plain form
3379.6 83088797 82874739 82670921 82479143 82298523 82125783 81959480 81799936 81645852 81495690 81348914
3400 81348914 81205648 81067228 80934668 80807120 80683428 80563986 80451059 80347115 80253547 80170631
3420.4 80170631 80097944 80035377 79982686 79939055 79903954 79877990 79862493 79857653 79861552 79872429 79891616 79922098
3444.9 79922098 79964411 80015963 80075437 80144507 80224061 80312026 80405289 80501753 80601919 80708146 80820358
3467.3 80820358 80935240 81050444 81166738 81285995 81408852 81533593 81658137 81783205 81911933 82045996
3487.7 82045996 82183510 82321149 82458043 82596868 82739747 82885063 83029974 83174288 83319545 83467317
3508.1 83467317 83618617 83772522 83927763 84085089 84246141 84410936 84576964 84741563 84905428 85071588
3528.5 85071588 85241580 85414392 85588217 85763276 85941505 86123139 86305940 86487746 86669153 86852002
$$ packed form
3379.6H3088797k14058k03818j91778j80620j72740j66303j59544j54084j50162j46776
3400H1348914j43266j38420j32560j27548j23692j19442j12927j03944r3568q2916
3420.4H0170631p2687o2567n2691m3631l5101k5964j5497m840L899J0877J9187L0482
3444.9G9922098M2313N1552N9474O9070P9554Q7965R3263R6464J00166J06227J12212
3467.3H0820358J14882J15204J16294J19257J22857J24741J24544J25068J28728J34063
3487.7H2045996J37514J37639J36894J38825J42879J45316J44911J44314J45257J47772
3508.1H3467317J51300J53905J55241J57326J61052J64795J66028J64599J63865J66160
3528.5H5071588J69992J72812J73825J75059J78229J81634J82801J81806J81407J82849
$$ plain form
3548.9 86852002 87036157 87222207 87410766 87600279 87790704 87983865 88180590 88380438 88583827 88792127
3569.3 88792127 89005607 89224046 89447653 89675224 89906538 90142214 90381932 90626878 90876561 91126966
3589.7 91126966 91374999 91620988 91865802 92109758 92354506 92597550 92832512 93057805 93273199 93477547
3610.1 93477547 93671906 93862188 94056320 94255376 94458014 94662338 94865936 95068818 95271128 95471072
3630.5 95471072 95666814 95856512 96037865 96208310 96364284 96506822 96639138 96765357 96887541 97001618
3650.9 97001618 97105849 97201043 97289079 97370088 97445792 97519892 97593004 97665358 97734183 97794288 97846526
3673.3 97846526 97898018 97947669 97988337 98016387 98032498 98039430 98043877 98053461 98070121 98097861 98141259 98199302
3697.8 98199302 98270363 98353034 98445487 98547137 98655504 98761594 98856688 98935670 98996794 99044585 99087721
$$ packed form
3548.9H6852002J84155J86050J88559J89513J90425J93161J96725J99848K03389K08300
3569.3H8792127K13480K18439K23607K27571K31314K35676K39718K44946K49683K50405
3589.7I1126966K48033K45989K44814K43956K44748K43044K34962K25293K15394K04348
3610.1I3477547J94359J90282J94132J99056K02638K04324K03598K02882K02310J99944
3630.5I5471072J95742J89698J81353J70445J55974J42538J32316J26219J22184J14077
3650.9I7001618J04231R5194Q8036Q1009P5704P4100P3112P2354O8825O0105N2238
3673.3I7846526N1492M9651M0668K8050J6111O932M447R584J6660K7740M3398N8043
3697.8I8199302P1061Q2671R2453J01650J08367J06090R5094P8982O1124M7791M3136
$$ plain form
3720.2 99087721 99129575 99169195 99206442 99239373 99269783 99302137 99335319 99366850 99396133 99422288 99442893 99455720
3744.7 99455720 99459857 99456191 99450707 99448538 99447596 99444801 99437261 99424422 99414283 99413276 99417877 99423760 99430084 99436539
3773.3 99436539 99442434 99447161 99448812 99447650 99449730 99458045 99471694 99488807 99505061 99519670 99534559 99549121 99559569
3799.8 99559569 99566454 99574041 99582350 99590659 99596834 99598360 99598294 99600524 99604911 99611861 99620467 99629682 99641055 99652147 99658257
3830.4 99658257 99658400 99657661 99660146 99665773 99674916 99683762 99688548 99689859 99688751 99687308 99686682 99687421 99692595 99700630 99706674
3861 99706674 99707574 99703455 99700439 99701834 99706429 99713117 99717981 99720132 99722219 99724042 99724698 99725169 99728012 99735224 99744737 99752808
3893.6 99752808 99756026 99755198 99754763 99754477 99753249 99752063 99750441 99749601 99750572 99751365 99751472 99753791 99760383 99769980 99779642 99786210
3926.2 99786210 99789596 99792641 99796790 99801981 99807686 99813390 99819422 99826163 99833077 99838740 99843073 99848038 99854791 99861884
$$ packed form
3720.2I9087721M1854L9620L7247L2931L0410L2354L3182L1531K9283K6155K0605J2827
3744.7I9455720M137l666n484k169r42k795p540j2839j0139j007M601N883O324O455
3773.3I9436539N895M727J651j162K080Q315J3649J7113J6254J4609J4889J4562J0448
3799.8I9559569O885P587Q309TO175J526o6K230M387O950Q606R215J1373J1092O110
3830.4I9658257J43p39K485N627R143Q846M786J311j108j443o26P39N174Q035O044
3861I9706674R00m119l016J395M595O688M864K151K087J823O56M71K843P212R513Q071
3893.6I9752808L218q28m35k86j228j186j622q40R71P93J07K319O592R597R662O568
3926.2I9786210L386L045M149N191N705N704O032O741O914N663M333M965O753P093
$$ plain form
3954.8 99861884 99867439 99871820 99877340 99885041 99893373 99901056 99908370 99915922 99923921 99931633 99937439 99941003 99944043 99947667
3983.3 99947667 99951941 99957114 99962944 99970186 99979681 99990183 100000000
3997.6 100000000
$$ packed form
3954.8I9861884N555M381N520P701Q332P683P314P552P999P712N806L564L040L624
3983.3I9947667M274N173N830P242R495J0502R817
3997.6A00000000
##END=$$ End of the data block
