##TITLE=AD 04 $$ Begin of the data block
##JCAMP-DX=5.00 $$ ACD/SpecManager v 10.08
##SPECTROMETER/DATA SYSTEM=Alpha
##DATE=16 Dec 2014 10:37:32
##DATA TYPE=INFRARED SPECTRUM
##DATA CLASS=XYDATA
##ORIGIN=
##OWNER=
##NPOINTS=1765
##FIRSTX=399.76428223
##LASTX=3997.64306641
##MAXX=3997.64306641
##MINX=399.76428223
##MAXY=1.00000000
##MINY=0.36327130
##XFACTOR=1.0000000000
##YFACTOR=0.000000010000000
##FIRSTY=1.00000000
##DELTAX=2.03961372
##XUNITS=1/CM
##YUNITS=ARBITRARY UNITS
##XYDATA=(X++(Y..Y))
399.8A00000000j224345j216596j222557j189584j136982j123315j134646j126152
416.1I0625823j085347j055092j056230j050866j012158r55027r13018q89773q57871
434.4H1750441q09259p48038o84696o51527o27380n74679n08773m70012m52149m11552
454.8G5812376l43365k78675k33680j95450j43600p7176j8620J5026L7033P2908J20026
477.3G4766803J45960J42926J40786J66231K06304K28780K30736K40123K70903L06434
497.7G6845986L14933K97600K95955L24481L53927L56901L47149L61955M05103M39286
518.1H0343276M41307M32938M49133M89098N17941N17600N10389N32037N76556N98776
538.5H5409051N84561N70863N92697O31463O36465O02883N76019N86456O08158N93400
$$ y = [100000000, 98775655, 97559059, 96336502, 95146918, 94009936, 92886621, 91751975, 90625823, 89540476, 88485384, 87429154, 86378288, 85366130, 84411103, 83498085, 82608312, 81750441, 80941182, 80193144, 79508448, 78856921, 78229541, 77654862, 77146089, 76676077, 76223928, 75812376, 75469011, 75190336, 74956656, 74761206, 74617606, 74540430, 74521810, 74536836, 74573869, 74646777, 74766803, 74912763, 75055689, 75196475, 75362706, 75569010, 75797790, 76028526, 76268649, 76539552, 76845986, 77160919, 77458519, 77754474, 78078955, 78432882, 78789783, 79136932, 79498887, 79903990, 80343276, 80784583, 81217521, 81666654, 82155752, 82673693, 83191293, 83701682, 84233719, 84810275, 85409051, 85993612, 86564475, 87157172, 87788635, 88425100, 89027983, 89604002, 90190458, 90798616, 91392016]
558.9I1392016N51719N35673N58942N80269N59223N12558M89980N02527N09298M76235
579.3I6668440M21691L93730L98332L89392L36122K69383K42037K47609K29931J67358
599.6I9764025R8258O4719N3662%p266J9330j764%Tj4156R030j1295J1700m94J3756
630.2I9999505n954N251m4179J198j08075j47337j50740j60569k07025k59155k75212
652.7I8647708k85691l13443l59458m03577m15027m03267m07112m39334m72349m76187
673.1I4672263m57871m53663m75747m93270m79352m59618m77606n02824n03385m75425
693.5H9893502m39513m25470m30268m25511l98982l70389l64560l77440l84039l74323
713.9H5903007l66354l80683m07910m20774m11683m03046m15343m38697m48465m40735
$$ y = [91392016, 91943735, 92479408, 93038350, 93618619, 94177842, 94690400, 95180380, 95682907, 96192205, 96668440, 97090131, 97483861, 97882193, 98271585, 98607707, 98877090, 99119127, 99366736, 99596667, 99764025, 99862283, 99927002, 99980664, 99980664, 99973398, 99992728, 99990964, 99990964, 99990964, 99976808, 99985838, 99974543, 99986243, 99985749, 99999505, 99993551, 99998802, 99954623, 99955821, 99847746, 99700409, 99549669, 99389100, 99182075, 98922920, 98647708, 98362017, 98048574, 97689116, 97285539, 96870512, 96467245, 96060133, 95620799, 95148450, 94672263, 94214392, 93760729, 93284982, 92791712, 92312360, 91852742, 91375136, 90872312, 90368927, 89893502, 89453989, 89028519, 88598251, 88172740, 87773758, 87403369, 87038809, 86661369, 86277330, 85903007, 85536653, 85155970, 84748060, 84327286, 83915603, 83512557, 83097214, 82658517, 82210052, 81769317]
734.3H1769317m35483m48734m70292m77010m66627m58789m66210m76396m67252m39132
754.7G7163392m14651m04984l93951l63749l18492k77453k49023k20132j73872j16164
775.1G4230921o9755m1401j3286L1423Q4490J22684J40625J58149J89603K23505K39694
797.5G5296652K36762K31969K34550K31350K01893J46758Q6332L1054l3510j25366
817.9G6538444k39623l53098m54616n55265o63776p70878q57598r17411r63163j005852
838.3F9757164j037109j042533j024533j000326r80652r60010r28533q88920q54302
856.6F1040246q29303q06051p76887p44355p17837p00885o85817o64085o38759o19227
877E3857040o07287n95671n79501n62089n49347n40715n30112n15461m99960m87289
$$ y = [81769317, 81333834, 80885100, 80414808, 79937798, 79471171, 79012382, 78546172, 78069776, 77602524, 77163392, 76748741, 76343757, 75949806, 75586057, 75267565, 74990112, 74741089, 74520957, 74347085, 74230921, 74161166, 74119765, 74106479, 74137902, 74222392, 74345076, 74485701, 74643850, 74833453, 75056958, 75296652, 75533414, 75765383, 75999933, 76231283, 76433176, 76579934, 76666266, 76697320, 76663810, 76538444, 76298821, 75945723, 75491107, 74935842, 74272066, 73501188, 72643590, 71726179, 70763016, 69757164, 68720055, 67677522, 66652989, 65652663, 64672011, 63712001, 62783468, 61894548, 61040246, 60210943, 59404892, 58628005, 57883650, 57165813, 56464928, 55779111, 55115026, 54476267, 53857040, 53249753, 52654082, 52074581, 51512492, 50963145, 50422430, 49892318, 49376857, 48876897, 48389608]
897.4D8389608m76712m63671m45899m26921m11147l98663l86304l71954l56844l44044
917.8D4307449l33961l23648l11812l00953k93407k87765k80118k69187k58252k51347
938.2D1396999k47889k44221k38252k30766k24423k20174k15959k10014k03574j98310
958.6C9163417j94332j89734j82325j73130j65522j61043j56969j50502j41540j32757
979C7515563j26541j21373j14313j05360r6965r0727q5529p8476o8772n9178n3159
1001.4C6515170m9224m2969l3862k4855j8400j3101n629M389J3623J9971K5516L3603
1025.9C6424232M3919N3150N9348O4263P2029Q3390R4697J02940J10513J21179J33389
1048.4C7363049J42908J48800J54236J62080J70699J75536J75482J74260J75694J79264
$$ y = [48389608, 47912896, 47449225, 47003326, 46576405, 46165258, 45766595, 45380291, 45008337, 44651493, 44307449, 43973488, 43649840, 43338028, 43037075, 42743668, 42455903, 42175785, 41906598, 41648346, 41396999, 41149110, 40904889, 40666637, 40435871, 40211448, 39991274, 39775315, 39565301, 39361727, 39163417, 38969085, 38779351, 38597026, 38423896, 38258374, 38097331, 37940362, 37789860, 37648320, 37515563, 37389022, 37267649, 37153336, 37047976, 36951011, 36860284, 36774755, 36696279, 36627507, 36568329, 36515170, 36465946, 36422977, 36389115, 36364260, 36345860, 36332759, 36327130, 36331519, 36345142, 36365113, 36390629, 36424232, 36468151, 36521301, 36580649, 36644912, 36716941, 36800331, 36895028, 36997968, 37108481, 37229660, 37363049, 37505957, 37654757, 37808993, 37971073, 38141772, 38317308, 38492790, 38667050, 38842744, 39022008]
1068.8C9022008J81269J79723J77252J78403J81690J81392J76620J72898J73319J74925
1089.2D0799499J72582J65412J58530J55804J55174J51837J45534J40980J41457J43975
1109.6D2330784J42827J37514J33270J33822J35803J34563J30379J28347J31434J35315
1129.9D3674058J34963J31824J31536J36092J41102J41034J36986J34787J36986J39737
1150.3D5039105J38772J35431J34700J38658J43499J44744J43569J44810J49598J54263
1170.7D6467149J55455J54489J55613J60316J64780J64878J62703J63740J69525J75443
1191.1D8094091J77505J78138J81892J89022J95852K00247K03976K10700K20757K30271
1211.5E0082451K35868K39765K47288K58690K68471K72751K75004K80839K89429K94870
$$ y = [39022008, 39203277, 39383000, 39560252, 39738655, 39920345, 40101737, 40278357, 40451255, 40624574, 40799499, 40972081, 41137493, 41296023, 41451827, 41607001, 41758838, 41904372, 42045352, 42186809, 42330784, 42473611, 42611125, 42744395, 42878217, 43014020, 43148583, 43278962, 43407309, 43538743, 43674058, 43809021, 43940845, 44072381, 44208473, 44349575, 44490609, 44627595, 44762382, 44899368, 45039105, 45177877, 45313308, 45448008, 45586666, 45730165, 45874909, 46018478, 46163288, 46312886, 46467149, 46622604, 46777093, 46932706, 47093022, 47257802, 47422680, 47585383, 47749123, 47918648, 48094091, 48271596, 48449734, 48631626, 48820648, 49016500, 49216747, 49420723, 49631423, 49852180, 50082451, 50318319, 50558084, 50805372, 51064062, 51332533, 51605284, 51880288, 52161127, 52450556, 52745426]
1231.9E2745426K94810K93070K94215K98053K98935K93040K84773K80917K80416K77376
1252.3E5641031K69127K60174K56849K58291K57706K52038K46358K46179K49541K49440
1272.7E8186734K43389K36893K36225K38854K36946K29615K23375K23439K26987K26819
1293.1F0509276K21217K16073K16400K18684K15918K08121K02650K03240K05803K03043
1313.5F2620425J94687J88535J89448J91790J86151J73849J65117J63912J63919J57726
1333.9F4395559J46913J39749J39040J38754J32865J21271J10024J04213R9552Q7559
1354.3F5615499P0447N6952M8828M1074K9885J5957L105o539j4919k2095k4641k1791
1378.8F5791762j6332j0794q220n895J401J0789J7708K1845K4963K9021L3546L3915
$$ y = [52745426, 53040236, 53333306, 53627521, 53925574, 54224509, 54517549, 54802322, 55083239, 55363655, 55641031, 55910158, 56170332, 56427181, 56685472, 56943178, 57195216, 57441574, 57687753, 57937294, 58186734, 58430123, 58667016, 58903241, 59142095, 59379041, 59608656, 59832031, 60055470, 60282457, 60509276, 60730493, 60946566, 61162966, 61381650, 61597568, 61805689, 62008339, 62211579, 62417382, 62620425, 62815112, 63003647, 63193095, 63384885, 63571036, 63744885, 63910002, 64073914, 64237833, 64395559, 64542472, 64682221, 64821261, 64960015, 65092880, 65214151, 65324175, 65428388, 65527940, 65615499, 65685946, 65742898, 65791726, 65832800, 65862685, 65878642, 65881747, 65875208, 65860289, 65838194, 65813553, 65791762, 65775430, 65764636, 65756416, 65750521, 65751922, 65762711, 65780419, 65802264, 65827227, 65856248, 65889794, 65923709]
1403.3F5923709L1227L4403M4561N5671O1404O2031O4689P3564Q2463Q7595R2035R8944
1427.7F6712296J10030J21951J28091J27577J29235J37693J42366J41531J42038J45364
1448.1F8038172J53762J65861J76967J85692J94269K06745K21700K34651K44433K56270
1468.5G0078522K70599K78503K71904K64710K66642K69669K69979K68674K67166K65521
1488.9G2771889K60985K49612K40183K36499K38115K42770K46209K42167K30337K24345
1509.3G5183111K25038K27034K29853K31809K33227K36988K36547K21270K03931J94431
1529.7G7423239J93816J94454J90115J81049J73206J74057J68055J53977J46550J44267
1550.1G9142785J47581J52701J47248J32584J21987J17552J16915J15287J09977J06167
$$ y = [65923709, 65954936, 65989339, 66033900, 66089571, 66150975, 66213006, 66277695, 66351259, 66433722, 66521317, 66613352, 66712296, 66822326, 66944277, 67072368, 67199945, 67329180, 67466873, 67609239, 67750770, 67892808, 68038172, 68191934, 68357795, 68534762, 68720454, 68914723, 69121468, 69343168, 69577819, 69822252, 70078522, 70349121, 70627624, 70899528, 71164238, 71430880, 71700549, 71970528, 72239202, 72506368, 72771889, 73032874, 73282486, 73522669, 73759168, 73997283, 74240053, 74486262, 74728429, 74958766, 75183111, 75408149, 75635183, 75865036, 76096845, 76330072, 76567060, 76803607, 77024877, 77228808, 77423239, 77617055, 77811509, 78001624, 78182673, 78355879, 78529936, 78697991, 78851968, 78998518, 79142785, 79290366, 79443067, 79590315, 79722899, 79844886, 79962438, 80079353, 80194640, 80304617, 80410784]
1570.5H0410784J05370J00189P9733N8031M9055M3952L6532K0409K14j2260k2579l9911
1595H0829519n6809o5559p1568q4710r6154j03342j11694j14619j09470j01722r0593
1617.4G9823279p6818o4910m7075k1041Q917M2379P3826J00470J25998J50949J72079
1639.9H0288053J96838K27833K55298K71112K83831K94465K93815K87503K82199K73621
1660.3H2954568K59888K43544K33221K18136J83880J58310J51682J48588J45698J40047
1680.7H4837562J34790J28478J10489R2280Q2558P6687P6938Q2296Q6087P8738N9080
1703.1H5845983M9669N1462N6142O2114O4546O3252O0171M7559M0710M6145N6619O8176
1727.6H6512548P9262Q9127R3478Q7607Q5574R3252J00797J07050J11079J05977R5308
$$ y = [80410784, 80516154, 80616343, 80696076, 80754107, 80803162, 80847114, 80883646, 80904055, 80904269, 80892009, 80869430, 80829519, 80772710, 80707151, 80635583, 80550873, 80454719, 80351377, 80239683, 80125064, 80015594, 79913872, 79823279, 79746461, 79681551, 79634476, 79613435, 79622352, 79664731, 79738557, 79839027, 79965025, 80115974, 80288053, 80484891, 80712724, 80968022, 81239134, 81522965, 81817430, 82111245, 82398748, 82680947, 82954568, 83214456, 83458000, 83691221, 83909357, 84093237, 84251547, 84403229, 84551817, 84697515, 84837562, 84972352, 85100830, 85211319, 85303599, 85386157, 85462844, 85539782, 85622078, 85708165, 85786903, 85845983, 85895652, 85947114, 86003256, 86065370, 86129916, 86193168, 86253339, 86300898, 86341608, 86387753, 86444372, 86512548, 86591810, 86680937, 86774415, 86862022, 86947596, 87040848, 87141645, 87248695, 87359774, 87465751, 87561059]
1750H7561059Q2725P9012Q0258O9582N4181M8649N0795N1439M7523M5139M9340N8246
1774.5H8277948O4087N9438N2452N5277O2835O3551N6451M7130M6992N5116O0463O0624
1799H8962364O0547O2257O7776P4846P2783O3860O2090O2198N7709N2714N1463N4306
1823.4H9704913O0552O6138O3335N6708N4878N7793O2728O5839O4713O2793O2424O0255
1847.9I0443069N9867O2555O0165N5670N5737N5128M8608M4584M7243N0741N2309N2696
1872.4I1088372N2274N2219N3543N3436N1284M7683M2636M0960M3034M4549M4757M6307
1896.9I1661054M9233N0968M9430M7017M5138M2880M1240L9828M0573M4387M7821M8292
1921.3I2207861M8089N0044N1916N1957N1236M9418M7446M8542N0091M8388M7326M9430
$$ y = [87561059, 87643784, 87722796, 87803054, 87872636, 87926817, 87975466, 88026261, 88077700, 88125223, 88170362, 88219702, 88277948, 88342035, 88401473, 88453925, 88509202, 88572037, 88635588, 88692039, 88739169, 88786161, 88841277, 88901740, 88962364, 89022911, 89085168, 89152944, 89227790, 89300573, 89364433, 89426523, 89488721, 89546430, 89599144, 89650607, 89704913, 89765465, 89831603, 89894938, 89951646, 90006524, 90064317, 90127045, 90192884, 90257597, 90320390, 90382814, 90443069, 90502936, 90565491, 90625656, 90681326, 90737063, 90792191, 90840799, 90885383, 90932626, 90983367, 91035676, 91088372, 91140646, 91192865, 91246408, 91299844, 91351128, 91398811, 91441447, 91482407, 91525441, 91569990, 91614747, 91661054, 91710287, 91761255, 91810685, 91857702, 91902840, 91945720, 91986960, 92026788, 92067361, 92111748, 92159569, 92207861, 92255950, 92305994, 92357910, 92409867, 92461103, 92510521, 92557967, 92606509, 92656600, 92704988, 92752314, 92801744]
1945.8I2801744N3155N5975N4747N1486N2321N6112N6237N2357N0163N1951N6231N8830
1970.3I3451309N7245N4836N4902N5897N5653N3149M9573M9347N2971N4919N2625N0003
1994.8I4092429N1307N5230N6827N4318N1433N1665N0896M3637L4296L0566L3229L7921
2019.2I4643754M0257M0179M0740M4441M9669N2857N3024N2792N4306N4675M9329M0174
2043.7I5216197L6335L9947M3756M3004L9983L8570M0293M2391M1622L9273L8922M1133
2068.2I5701426M2933M2338M0668M0883M3571M5818M5085M2993M2837M4960M6724M5956
2092.7I6226192M3547M2903M5002M6622M5395M3321M3273M5204M6521M5693M3917M3613
2117.1I6761203M5109M6074M4787M2838M2510M3660M4507M3625M2021M2266M4357M5467
$$ y = [92801744, 92854899, 92910874, 92965621, 93017107, 93069428, 93125540, 93181777, 93234134, 93284297, 93336248, 93392479, 93451309, 93508554, 93563390, 93618292, 93674189, 93729842, 93782991, 93832564, 93881911, 93934882, 93989801, 94042426, 94092429, 94143736, 94198966, 94255793, 94310111, 94361544, 94413209, 94464105, 94507742, 94542038, 94572604, 94605833, 94643754, 94684011, 94724190, 94764930, 94809371, 94859040, 94911897, 94964921, 95017713, 95072019, 95126694, 95176023, 95216197, 95252532, 95292479, 95336235, 95379239, 95419222, 95457792, 95498085, 95540476, 95582098, 95621371, 95660293, 95701426, 95744359, 95786697, 95827365, 95868248, 95911819, 95957637, 96002722, 96045715, 96088552, 96133512, 96180236, 96226192, 96269739, 96312642, 96357644, 96404266, 96449661, 96492982, 96536255, 96581459, 96627980, 96673673, 96717590, 96761203, 96806312, 96852386, 96897173, 96940011, 96982521, 97026181, 97070688, 97114313, 97156334, 97198600, 97242957, 97288424]
2141.6I7288424M3976M1974M1842M3541M4281M2140L9017L8112L9345M0102L8969L7670
2166.1I7779393L8320M0275M1032L9619L8242L8904M0490M0799L9059L6842L6323L7390
2190.6I8246688L7676L6055L4028L3873L5173L5047L3039L1197L1257L2592L2651L0697
2215I8649973K9075K9379L0541L0512K8914K7228K7108K8282K8420K6399K4163K3669
2239.5I8983663K4623K4992K3085K0647TK2179K2560K1172J9914K0546K2399K2781
2264I9249208K0462J7637J7435J9508K0308J8358J5706J5711J7769J8066J5640J3208
2288.5I9459016J2940J4234J3709R662N341M899P361Q262N459J902J311L350M154J669
2317I9553269n06J603N776O532K462k766p003q565o295k080J752O378J1462J2946J0640
$$ y = [97288424, 97332400, 97374374, 97416216, 97459757, 97504038, 97546178, 97585195, 97623307, 97662652, 97702754, 97741723, 97779393, 97817713, 97857988, 97899020, 97938639, 97976881, 98015785, 98056275, 98097074, 98136133, 98172975, 98209298, 98246688, 98284364, 98320419, 98354447, 98388320, 98423493, 98458540, 98491579, 98522776, 98554033, 98586625, 98619276, 98649973, 98679048, 98708427, 98738968, 98769480, 98798394, 98825622, 98852730, 98881012, 98909432, 98935831, 98959994, 98983663, 99008286, 99033278, 99056363, 99077010, 99097657, 99119836, 99142396, 99163568, 99183482, 99204028, 99226427, 99249208, 99269670, 99287307, 99304742, 99324250, 99344558, 99362916, 99378622, 99394333, 99412102, 99430168, 99445808, 99459016, 99471956, 99486190, 99499899, 99509561, 99514902, 99519801, 99527162, 99535424, 99540883, 99542785, 99544096, 99547446, 99551600, 99553269, 99552763, 99554366, 99560142, 99566674, 99569136, 99566370, 99559367, 99550802, 99544507, 99542427, 99544179, 99550557, 99562019, 99574965, 99585605]
2347.6I9585605R352J2070J5187J3286P635K611p87l946l552L147J3202K2316K9058
2374.1I9705184L1769L0917L0923L2925L2973K8086K1428J7560J4793R686L541K80
2398.6I9960065J180L600M494L273K098K491L457L112J567M29J049K146J496k56m17
2429.2I9989784J365K587J949R83R95J413n78R24j526r66J26M94k20j139r89N9M95
2463.9I9995756K4k50k4k27j031j627j717j537j497j502j293j061j162j240j186j180
2496.5I9979246j026j269k045k485k247k164l052l862l284j902j668k808l850l314
2525.1I9944270j979j765k944l654k712j698k409m434n537m328k461k796m965n972
2553.6I9896616m441k414k515m709n811m030k378l910o920p850o163m387n090p600
$$ y = [99585605, 99594957, 99607027, 99622214, 99635500, 99643135, 99645746, 99644959, 99641013, 99637461, 99640608, 99653810, 99676126, 99705184, 99736953, 99767870, 99798793, 99831718, 99864691, 99892777, 99914205, 99931765, 99946558, 99956244, 99959785, 99960065, 99961245, 99964845, 99969339, 99972612, 99974710, 99977201, 99980658, 99983770, 99985337, 99985766, 99986815, 99988961, 99990457, 99990201, 99989784, 99991149, 99993736, 99995685, 99996668, 99997663, 99999076, 99998498, 99999422, 99997896, 99996930, 99997056, 99997550, 99997330, 99996191, 99995202, 99995261, 99995756, 99995780, 99995530, 99995506, 99995279, 99994248, 99992621, 99990904, 99989367, 99987870, 99986368, 99985075, 99984014, 99982852, 99981612, 99980426, 99979246, 99978220, 99976951, 99974906, 99972421, 99970174, 99968010, 99964958, 99961096, 99957812, 99955910, 99954242, 99951434, 99947584, 99944270, 99942291, 99940526, 99937582, 99933928, 99931216, 99929518, 99927109, 99922675, 99917138, 99912810, 99910349, 99907553, 99902588, 99896616, 99892175, 99889761, 99887246, 99882537, 99876726, 99872696, 99870318, 99866408, 99859488, 99851638, 99845475, 99841088, 99835998, 99828398]
2582.2I9828398q589o646m625n657q332q744o426m941o556r102r054o753n728p808
2610.7I9729437j0413j0336q160p182q976j1123j0448p928p164q959j0192q834o741
2637.2I9612981p057r793j1707j0299p928q124j0216j0776q911o992p623r877j0568
2663.7I9493110q684o938p749j0174j0872q792o378o389p767p522n311m142n847q542
2692.3I9388003r411q261p624q947j1032j1218q947p033p850r960j0246q541p373q589
2720.9I9262971j0574j0359q053o700p778r793j0157q058o157p195r554r841p826o366
2749.4I9144560o980q124p617n466m554o532r424j0580r531q088q398j0085j0431q756
2778I9029994p755q928j0550j0240q655q380j0241j2326j2529j1158j0323j0985j2034
$$ y = [99828398, 99819809, 99813163, 99808538, 99802881, 99794549, 99785805, 99779379, 99774438, 99767882, 99758780, 99749726, 99742973, 99737245, 99729437, 99719024, 99708688, 99700528, 99693346, 99684370, 99673247, 99662799, 99654871, 99647707, 99638748, 99628556, 99619722, 99612981, 99605924, 99596131, 99584424, 99574125, 99566197, 99558073, 99547857, 99537081, 99528170, 99521178, 99513555, 99503678, 99493110, 99484426, 99477488, 99469739, 99459565, 99448693, 99439901, 99433523, 99427134, 99419367, 99411845, 99406534, 99402392, 99396545, 99388003, 99378592, 99370331, 99362707, 99353760, 99342728, 99331510, 99322563, 99315530, 99307680, 99297720, 99287474, 99278933, 99271560, 99262971, 99252397, 99242038, 99233985, 99227285, 99219507, 99209714, 99199557, 99191499, 99185342, 99178147, 99168593, 99158752, 99150926, 99144560, 99137580, 99129456, 99121839, 99116373, 99111819, 99105287, 99095863, 99085283, 99075752, 99067664, 99059266, 99049181, 99038750, 99029994, 99022239, 99013311, 99002761, 98992521, 98983866, 98975486, 98965245, 98952919, 98940390, 98929232, 98918909, 98907924, 98895890]
2804.5I8895890j1880j0687j0490j2088j3381j2315r995r704j2189j4979j5688j5020
2828.9I8747474j5557j8805k2978k5338k6697k9045l2538l5071l4005l0261k7073k5200
2853.4I8424906k2698j8233j3286r811q440p987o431m280l975n961q052q542p766q095
2882I8291349r989j1754j2643j3720j5599j7494j8716j9383k0355k2650k6101k9123
2906.5I8073822l0327l0618l1907l4225l5214l2974k8717k4223j9086j2833o246n84
2930.9I7786868L349O283R018J1611J3208J2422R209N179K474J150m88k116k581k134
2959.5I7853452j729j907j883j61L326P194J0079J1450J2577J3977J4734J4234J3059
2986I7948402J1832J0311P916M482N4l696n483o152p075q315r191r477r912j1456j3208
$$ y = [98895890, 98884010, 98873323, 98862833, 98850745, 98837364, 98825049, 98815054, 98805350, 98793161, 98778182, 98762494, 98747474, 98731917, 98713112, 98690134, 98664796, 98638099, 98609054, 98576516, 98541445, 98507440, 98477179, 98450106, 98424906, 98402208, 98383975, 98370689, 98360878, 98352438, 98344451, 98338020, 98333740, 98329765, 98323804, 98315752, 98307210, 98299444, 98291349, 98281360, 98269606, 98256963, 98243243, 98227644, 98210150, 98191434, 98172051, 98151696, 98129046, 98102945, 98073822, 98043495, 98012877, 97980970, 97946745, 97911531, 97878557, 97849840, 97825617, 97806531, 97793698, 97787452, 97786868, 97790217, 97796500, 97805518, 97817129, 97830337, 97842759, 97851968, 97857147, 97859621, 97860771, 97860283, 97858167, 97855586, 97853452, 97851723, 97849816, 97847933, 97847772, 97851098, 97858292, 97868371, 97879821, 97892398, 97906375, 97921109, 97935343, 97948402, 97960234, 97970545, 97978461, 97982943, 97982997, 97979301, 97973818, 97967666, 97960591, 97952276, 97943085, 97933608, 97923696, 97912240, 97899032]
3016.6I7899032j3608j2738j1474j0854j1575j2666j2350j1492j1867j2719j2780j2701
3041.1I7752208j3233j4502j6009j6457j5623j5002j5372j6058j6433j6343j6248j7029
3065.5I7563899j8365j9002j8745j8901j9753j9920j8620j6880j6308j7864j9556j9318
3090I7340667j8662j9741k1905k3126k3187k3055k3627k5141k6059k5040k3759k4080
3114.5I7063285k5594k7061k7221k6780k7460k9153l0279k9993k9570l0524l2597l3939
3139I6713114l3647l3343l4696l6680l7867l8386l8999m0382m2635m4388m4835m5394
3163.4I6241862m7464m9859n1093n1224n1761n3841n6565n7876n8204n9139o0654o2609
3187.9I5581573o4879o6233o6543o7579o9023o9415o8718o8582o9999p1371p1424p0882
$$ y = [97899032, 97885424, 97872686, 97861212, 97850358, 97838783, 97826117, 97813767, 97802275, 97790408, 97777689, 97764909, 97752208, 97738975, 97724473, 97708464, 97692007, 97676384, 97661382, 97646010, 97629952, 97613519, 97597176, 97580928, 97563899, 97545534, 97526532, 97507787, 97488886, 97469133, 97449213, 97430593, 97413713, 97397405, 97379541, 97359985, 97340667, 97322005, 97302264, 97280359, 97257233, 97234046, 97210991, 97187364, 97162223, 97136164, 97111124, 97087365, 97063285, 97037691, 97010630, 96983409, 96956629, 96929169, 96900016, 96869737, 96839744, 96810174, 96779650, 96747053, 96713114, 96679467, 96646124, 96611428, 96574748, 96536881, 96498495, 96459496, 96419114, 96376479, 96332091, 96287256, 96241862, 96194398, 96144539, 96093446, 96042222, 95990461, 95936620, 95880055, 95822179, 95763975, 95704836, 95644182, 95581573, 95516694, 95450461, 95383918, 95316339, 95247316, 95177901, 95109183, 95040601, 94970602, 94899231, 94827807, 94756925]
3212.4I4756925p1370p3022p4440p5233p5919p6788p7725p8714p9495p9458p8547p7707
3236.9I3838507p6956p5340p3504p2301p1144o9350o6739o3807o1536o0552o0463n9873
3261.3I3026942n8174n5993n4794n5093n5772n6595n8257o0302o2257o4403o6632o9273
3285.8I2309397p3087p7438q1051q3595q6349r1172r7405j03021j07718j12563j18256
3308.2I1277742j24180j29431j34612j39951j45382j50746j55556j59997j64950j70648
3328.6H9802289j76650j82164j87075j91975j96975k02412k08312k14332k20871k27934
3349H7793589k34467k39903k44564k49004k52920k55597k56872k56926k55996k53862
3369.4H5293478k50149k44290k36112k26736k17890k09999k01452j90467j78629j69158
$$ y = [94756925, 94685555, 94612533, 94538093, 94462860, 94386941, 94310153, 94232428, 94153714, 94074219, 93994761, 93916214, 93838507, 93761551, 93686211, 93612707, 93540406, 93469262, 93399912, 93333173, 93269366, 93207830, 93147278, 93086815, 93026942, 92968768, 92912775, 92857981, 92802888, 92747116, 92690521, 92632264, 92571962, 92509705, 92445302, 92378670, 92309397, 92236310, 92158872, 92077821, 91994226, 91907877, 91816705, 91719300, 91616279, 91508561, 91395998, 91277742, 91153562, 91024131, 90889519, 90749568, 90604186, 90453440, 90297884, 90137887, 89972937, 89802289, 89625639, 89443475, 89256400, 89064425, 88867450, 88665038, 88456726, 88242394, 88021523, 87793589, 87559122, 87319219, 87074655, 86825651, 86572731, 86317134, 86060262, 85803336, 85547340, 85293478, 85043329, 84799039, 84562927, 84336191, 84118301, 83908302, 83706850, 83516383, 83337754, 83168596]
3389.8H3168596j61934j55479j50048j45990j42425j38563j33914j28758j24234j20872
3410.2H1766379j17523j12396j04851r5105q4305p3653o3062n2893m3350l3319k2805
3432.7H0963117j2660l064N925J4567K4098L4810M4983N3102O0648P0113Q0925Q9532
3457.1H1426096R4289R7000R9671J02651J05006J06263J07175J08552J10102J11252
3477.5H2468057J11150J10436J11467J15251J19186J20770J20986J21051J21605J23567
3497.9H3643526J26171J28347J30522J33049J35428J37520J38467J38689J40470J43671
3518.3H4995860J45948J47325J48946J51091J53536J55699J56588J56736J57100J57636
3538.7H6526465J58453J59389J60217J62375J66518J66088J59490J57053J61576J68180
$$ y = [83168596, 83006662, 82851183, 82701135, 82555145, 82412720, 82274157, 82140243, 82011485, 81887251, 81766379, 81648856, 81536460, 81431609, 81336504, 81252199, 81178546, 81115484, 81062591, 81019241, 80985922, 80963117, 80950457, 80947393, 80953318, 80967885, 80991983, 81026793, 81071776, 81124878, 81185526, 81255639, 81336564, 81426096, 81520385, 81617385, 81717056, 81819707, 81924713, 82030976, 82138151, 82246703, 82356805, 82468057, 82579207, 82689643, 82801110, 82916361, 83035547, 83156317, 83277303, 83398354, 83519959, 83643526, 83769697, 83898044, 84028566, 84161615, 84297043, 84434563, 84573030, 84711719, 84852189, 84995860, 85141808, 85289133, 85438079, 85589170, 85742706, 85898405, 86054993, 86211729, 86368829, 86526465, 86684918, 86844307, 87004524, 87166899, 87333417, 87499505, 87658995, 87816048, 87977624, 88145804]
3559.1H8145804J73319J76781J80894J88518J97863K03389K04355K07722K14458K19082
3579.5I0112185K18392K13069K10064K16759K27630K34198K35725K36243K37155K38579
3599.9I2379999K37370K27666K16984K16753K21467K20233K09164J99986J97649J98096
3620.3I4525367J97935J94645J90133J88100J86938J78993J56999J33341J24169J24466
3640.7I6201086J21009J12057J02270J00994J05697J08945J05286R9832R7245Q6975
3661.1I7241396O8772M7451K8139K4223L1764L4904L0428L0953L9882N1981O3968P0869
3685.6I7764730O8391O5660O4695N7358M8077L9816L5345L5638L5363K9439K0146J4890
3710I8279548J4144J7494K3776K4712J5342N776L541O109N400k020j353O103N710J729
$$ y = [88145804, 88319123, 88495904, 88676798, 88865316, 89063179, 89266568, 89470923, 89678645, 89893103, 90112185, 90330577, 90543646, 90753710, 90970469, 91198099, 91432297, 91668022, 91904265, 92141420, 92379999, 92617369, 92845035, 93062019, 93278772, 93500239, 93720472, 93929636, 94129622, 94327271, 94525367, 94723302, 94917947, 95108080, 95296180, 95483118, 95662111, 95819110, 95952451, 96076620, 96201086, 96322095, 96434152, 96536422, 96637416, 96743113, 96852058, 96957344, 97057176, 97154421, 97241396, 97310168, 97357619, 97385758, 97409981, 97441745, 97476649, 97507077, 97538030, 97577912, 97629893, 97693861, 97764730, 97833121, 97898781, 97963476, 98020834, 98068911, 98108727, 98144072, 98179710, 98215073, 98244512, 98264658, 98279548, 98293692, 98311186, 98334962, 98359674, 98375016, 98380792, 98384333, 98390442, 98395842, 98393822, 98392469, 98398572, 98404282, 98406011]
3738.6I8406011K569O038R280J6439K5493K6786K1691J9460K3479L1751L6103L2335
3763.1I8657435K9242K5678J6695J0955J1421J2099J2726J7321K0254J8185J3221L004
3787.5I8848236l767m137n209n317n90O157O467L713J192p80K753P070Q267R918R793
3818.1I8883766O896N645L75m148L6P760J2755J5533J9253J0097m745n972J007J0079
3846.7I8958337J5772J6719J7577J2309J341k742J585J2428K3335K7883K5046J0270
3871.2I9119860R54O878J2910J6070J9592K2650K1195J1986M71m202j01Q345J3214
3897.7I9249822J5736J8090J6659J6826J8782J8293K1564K7723K6178J6385O855K301
3922.1I9455214M714J0914J4865J7202J9026J7166J3429J2261J2725J3596J5926J7214
$$ y = [98406011, 98408580, 98414618, 98423898, 98440337, 98465830, 98492616, 98514307, 98533767, 98557246, 98588997, 98625100, 98657435, 98686677, 98712355, 98729050, 98740005, 98751426, 98763525, 98776251, 98793572, 98813826, 98832011, 98845232, 98848236, 98844469, 98840332, 98835123, 98829806, 98829216, 98835373, 98841840, 98845553, 98846745, 98845965, 98848718, 98855788, 98864055, 98873973, 98883766, 98890662, 98896307, 98896682, 98892534, 98892570, 98900330, 98913085, 98928618, 98947871, 98957968, 98953223, 98947251, 98948258, 98958337, 98974109, 98990828, 99008405, 99020714, 99022055, 99019313, 99020898, 99033326, 99056661, 99084544, 99109590, 99119860, 99120814, 99127692, 99140602, 99156672, 99176264, 99198914, 99220109, 99232095, 99232566, 99228364, 99228263, 99236608, 99249822, 99265558, 99283648, 99300307, 99317133, 99335915, 99354208, 99375772, 99403495, 99429673, 99446058, 99452913, 99455214, 99459928, 99470842, 99485707, 99502909, 99521935, 99539101, 99552530, 99564791, 99577516, 99591112, 99607038, 99624252]
3946.6I9624252J4681J2070J3226J6421J8668J7900J5163J4383J5354J4716J3459J3512
3971.1I9803805J4997J7053J7833J6332J4341J3679J4276J5503J5700J4293J3149J3798
3995.6I9984759J5241
3997.6A00000000
$$ y = [99624252, 99638933, 99651003, 99664229, 99680650, 99699318, 99717218, 99732381, 99746764, 99762118, 99776834, 99790293, 99803805, 99818802, 99835855, 99853688, 99870020, 99884361, 99898040, 99912316, 99927819, 99943519, 99957812, 99970961, 99984759, 100000000]
##END=$$ End of the data block
