##TITLE=AD 03 $$ Begin of the data block
##JCAMP-DX=5.00 $$ ACD/SpecManager v 10.08
##SPECTROMETER/DATA SYSTEM=Alpha
##DATE=16 Dec 2014 10:37:32
##DATA TYPE=INFRARED SPECTRUM
##DATA CLASS=XYDATA
##ORIGIN=
##OWNER=
##NPOINTS=1765
##FIRSTX=399.76428223
##LASTX=3997.64306641
##MAXX=3997.64306641
##MINX=399.76428223
##MAXY=0.68827349
##MINY=0.42084166
##XFACTOR=1.0000000000
##YFACTOR=1.000000000000000e-9
##FIRSTY=0.46707058
##DELTAX=2.03961372
##XUNITS=1/CM
##YUNITS=ARBITRARY UNITS
##XYDATA=(X++(Y..Y))
399.8D67070580k198399j454591j256258j532405k196938k608687j996785j092643
$$ 467070580 464872181 463417590 462161332 460628927 458431989 455823302 453826517 452733874
416.1D52733874j636266k663076k028227j284629r24498r20206j320512j725465j621335
$$ 452733874 451097608 448434532 446406305 445121676 444197178 443276972 441956460 440230995 438609660
434.4D38609660j161725q77797q49635r22084q78542p16418m38333j19447j51933l85970
$$ 438609660 437447935 436570138 435720503 434798419 433919877 433203459 432765126 432645679 432493746 432107776
454.8D32107776j96606J90229K73138K58684J84596J75953N73158J197725J289547
$$ 432107776 431911170 432101399 432374537 432633221 432817817 432993770 433566928 434764653 436054200
473.2D36054200P65860O06209J196027J883089K018154J685530J408368J558841K081722
$$ 436054200 436820060 437426269 438622296 440505385 442523539 444209069 445617437 447176278 449258000
491.5D49258000K581626K470285J931786J807749K524406L318429L303081K864629
$$ 449258000 451839626 454309911 456241697 458049446 460573852 463892281 467195362 470059991
507.9D70059991K694756L222465M033148M448742M287839L853738L870637M705816
$$ 470059991 472754747 475977212 480010360 484459102 488746941 492600679 496471316 501177132
524.2E01177132N644679N533219M765510M515171N285382O342650O319702N200088
$$ 501177132 506821811 512355030 517120540 521635711 526921093 533263743 539583445 544783533
540.5E44783533M292905M437149N041420M925251L865480K714694K370357K765239
$$ 544783533 549076438 553513587 558555007 563480258 567345738 570060432 572430789 575196028
556.8E75196028K861857K136648J149058P81536J229167J829386J714945P45952k7478
$$ 575196028 578057885 580194533 581343591 582125127 583354294 585183680 586898625 587644577 587617099
575.2E87617099L29495J305043J548529P08521n7161K65181J153290J467288Q95798
$$ 587617099 587946594 589251637 590800166 591508687 591451526 591716707 592869997 594337285 595233083
593.5E95233083K03669K15947Q37207J303971J057804L76165K8848M42624J129330
$$ 595233083 595436752 595652699 596489906 597793877 598851681 599227846 599256694 599699318 600828648
611.9F00828648J130700L72469j56462J69098R43005J355589R40621J66714j53601
$$ 600828648 601959348 602331817 602175355 602344453 603287458 604643047 605583668 605750382 605596781
630.2F05596781K03848O91116O57498J37449l60906m15445j5557L74973J74284n08427
$$ 605596781 605800629 606491745 607149243 607286692 606925786 606510341 606494784 606869757 607044041 606535614
650.6F06535614q52764m72605J28209J80364m70579j052379r69112o21200j51813j60098
$$ 606535614 605682850 605210245 605338454 605518818 605048239 603995860 603026748 602405548 602253735 602093637
671F02093637q11517j130522n63621Q0764j92880j064301j448750r99690l64840l60548
$$ 602093637 601282120 600151598 599587977 599668741 599475861 598411560 596962810 595963120 595598280 595237732
691.4E95237732j105785j819313j689374q96633l75807o83725j413167j668691j209021
$$ 595237732 594131947 592312634 590623260 589726627 589350820 588667095 587253928 585585237 584376216
709.8E84376216p57814r39488j579463j991749j773119j293540j182616j613677k134680
$$ 584376216 583618402 582678914 581099451 579107702 577334583 576041043 574858427 573244750 571110070
728.1E71110070k223969j864314j536310j707017k167106k392470k228678j868129
$$ 571110070 568886101 567021787 565485477 563778460 561611354 559218884 556990206 555122077
744.5E55122077j651108j823187k131581k118170j658857j119256r20594j038968j156629
$$ 555122077 553470969 551647782 549516201 547398031 545739174 544619918 543699324 542660356 541503727
762.8E41503727q74817j79171L65972L08573l3855R54O24895J346767J512944J126647
$$ 541503727 540628910 540449739 540815711 541124284 541090429 541091383 541716278 543063045 544575989 545702636
783.2E45702636Q94010J318574K077699K480626K153039J636326J817227K683222L359854
$$ 545702636 546596646 547915220 549992919 552473545 554626584 556262910 558080137 560763359 564123213
801.6E64123213L227830K683699K575934L181279L893852L903628L228604K682686
$$ 564123213 567351043 570034742 572610676 575791955 579685807 583589435 586818039 589500725
817.9E89500725K832711L341734L298223K361000J241684P17223O85334M03345n68510
$$ 589500725 592333436 595675170 598973393 601334393 602576077 603293300 603978634 604381979 603813469
836.2F03813469j854419k768159l056646l077447l378272m098773m762888m807115
$$ 603813469 601959050 599190891 596134245 593056798 589678526 585579753 580816865 576009750
852.6E76009750m307091l923237m133821m658520m793942m289031l652334l591120
$$ 576009750 571702659 567779422 563645601 558987081 554193139 549904108 546251774 542660654
868.9E42660654m133463m538596m238129l477931l029167l296256l823758l901541
$$ 542660654 538527191 533988595 529750466 526272535 523243368 519947112 516123354 512221813
885.2E12221813l414035k954721l099382l611326l767997l304810k678334k541125
$$ 512221813 508807778 505853057 502753675 499142349 495374352 492069542 489391208 486850083
901.5D86850083k937585l248245k983302k353489k016097k265573k641618k533704
$$ 486850083 483912498 480664253 477680951 475327462 473311365 471045792 468404174 465870470
917.8D65870470j972944j535326j566559j840711j914918j609504j233638j167237
$$ 465870470 463897526 462362200 460795641 458954930 457040012 455430508 454196870 453029633
934.1D53029633j347721j467407j322627j003593q38161r75877j164376j128734r28729
$$ 453029633 451681912 450214505 448891878 447888285 447050124 446074247 444909871 443781137 442852408
952.5D42852408p76023p93427r08613r65238r10461p69019o49810o59347p47293q22365
$$ 442852408 442076385 441282958 440374345 439409107 438498646 437729627 437079817 436420470 435673177 434850812
972.9D34850812q23617o95229n54084n64278o81251p29740o23047m50581l53873m12583
$$ 434850812 434027195 433331966 432777882 432213604 431532353 430802613 430179566 429728985 429375112 428962529
993.3D28962529n44548n49972l58761j83910k37703m42654n71579m80890k94089k72036
$$ 428962529 428417981 427868009 427509248 427325338 427087635 426644981 426073402 425592512 425298423 425026387
1013.7D25026387m45098n89400n33194k88158j09166k21253m36008m39941k14905k1756
$$ 425026387 424581289 423991889 423458695 423170537 423061371 422840118 422404110 421964169 421749264 421727508
1034.1D21727508n2064k34217l50207k49356L934J77085J49578O5178J26511L45349
$$ 421727508 421675444 421441227 421091020 420841664 420845598 421022683 421172261 421237439 421363950 421709299
1054.5D21709299N33640N60225M80383M36872N27084P20263Q54671Q28743P23421O82950
$$ 421709299 422242939 422803164 423283547 423720419 424247503 424967766 425822437 426651180 427374601 428057551
1074.9D28057551Q06898J032710J129747J002729Q74638R15945J070440J196503J127303
$$ 428057551 428864449 429897159 431026906 432029635 432904273 433820218 434890658 436087161 437214464
1093.2D37214464Q82029P37995Q65817J063973J048893P77513N17666N57333Q09253
$$ 437214464 438096493 438834488 439700305 440764278 441813171 442590684 443108350 443665683 444474936
1111.6D44474936R58263Q25823N57393M85867O72728Q50707P75993M98712L85523O09547
$$ 444474936 445433199 446259022 446816415 447302282 447975010 448825717 449601710 450100422 450485945 451095492
1132D51095492Q94963R38625P02321M26382M10139O36459Q00967O96689M34548L31401
$$ 451095492 451990455 452929080 453631401 454057783 454467922 455104381 455905348 456602037 457036585 457367986
1152.4D57367986N15759P65920Q05527O22004M50254N21988P82728R47088Q65131O58185
$$ 457367986 457883745 458649665 459455192 460077196 460527450 461049438 461832166 462779254 463644385 464302570
1172.8D64302570N92619P58707R76861J008689P91341N73665O18398Q54016R75251
$$ 464302570 464895189 465653896 466630757 467639446 468430787 469004452 469622850 470476866 471452117
1191.1D71452117Q34584O00636N37604P24703R81152J017452P69883N63234P03007
$$ 471452117 472286701 472887337 473424941 474149644 475130796 476148248 476918131 477481365 478184372
1209.5D78184372J036853J164585R68069O98030O83546R78291J245827J175284Q78423
$$ 478184372 479221225 480385810 481353879 482051909 482735455 483713746 484959573 486134857 487013280
1227.9D87013280P45684R60708J303464J398951J161009R29713J014680J311511J468211
$$ 487013280 487758964 488719672 490023136 491422087 492583096 493512809 494527489 495839000 497307211
1246.2D97307211J302451R94772Q98510J121581J370728J312196J012325Q24273R38415
$$ 497307211 498609662 499604434 500502944 501624525 502995253 504307449 505319774 506144047 507082462
1264.6E07082462J197696J281440J099587Q68618Q49009J048744J234352J203776R89913
$$ 507082462 508280158 509561598 510661185 511529803 512378812 513427556 514661908 515865684 516855597
1282.9E16855597Q31068Q86381J063227J115919R62734P57515P11858Q69036J035989
$$ 516855597 517686665 518573046 519636273 520752192 521714926 522472441 523184299 524053335 525089324
1301.3E25089324J027762Q25227O14047O40452Q83221J021803Q72910O22332N64396
$$ 525089324 526117086 526942313 527556360 528196812 529080033 530101836 530974746 531597078 532161474
1319.6E32161474P64311J002729J002252P11977M62711N51522Q43882R35555O91652
$$ 532161474 532925785 533928514 534930766 535642743 536105454 536656976 537500858 538436413 539128065
1338E39128065M45545N19335P96378R88126Q80658N48542L66568N45562Q69512R14455
$$ 539128065 539573610 540092945 540889323 541877449 542758107 543306649 543673217 544218779 545088291 546002746
1358.4E46002746N93543K69890L47852O44982P84516O51598L14951J42932L79801O20663
$$ 546002746 546596289 546866179 547214031 547859013 548643529 549295127 549610078 549753010 550132811 550753474
1378.8E50753474M54188J34468K46644P90775J184463J067281O51300K48074K15054
$$ 550753474 551207662 551342130 551588774 552379549 553564012 554631293 555282593 555530667 555745721
1397.1E55745721N05149P92861P50840M56810K76744L39628N38289O78539N40734J69575
$$ 555745721 556250870 557043731 557794571 558251381 558528125 558867753 559406042 560084581 560625315 560794890
1417.5E60794890K8729M14908P43270P21753M02033J19806K87532O40631P34150N70357
$$ 560794890 560823619 561238527 561981797 562703550 563105583 563225389 563512921 564153552 564887702 565458059
1437.9E65458059L72053L27050M78447O57499N90741L11434J39893K38478M99010P79629
$$ 565458059 565830112 566157162 566635609 567293108 567883849 568195283 568335176 568573654 569072664 569852293
1458.3E69852293P57396M88102L71099P29263J053392Q35717L43025L02076P46966
$$ 569852293 570609689 571097791 571468890 572198153 573251545 574087262 574430287 574732363 575479329
1476.7E75479329J020908R40204O25789L23057K49267M78386Q18313P63416L61741
$$ 575479329 576500237 577440441 578066230 578389287 578638554 579116940 579935253 580698669 581060410
1495E81060410J03831M55022Q82744Q44598K92659l58105K61188R09150R22501N69045
$$ 581060410 581164241 581619263 582502007 583346605 583639264 583281159 583542347 584451497 585373998 585943043
1515.4E85943043K13146J67549L33130O42241O51896L63707K70128L45946N15222P28190
$$ 585943043 586156189 586323738 586656868 587299109 587951005 588314712 588584840 588930786 589446008 590174198
1535.8E90174198N27024j69873k88188M25636P67172N99503K20597N9545J73509L57807
$$ 590174198 590701222 590531349 590243161 590668797 591435969 592035472 592256069 592315614 592489123 592846930
1556.2E92846930K23994l3080J88410K13802K80142L58104J78397L5942j96159m27485
$$ 592846930 593070924 593037844 593226254 593440056 593720198 594078302 594256699 594292641 594096482 593668997
1576.6E93668997m291K00748k00450n86570o09159m38333m00364o54519j025974j140893
$$ 593668997 593664706 593865454 593665004 593078434 592469275 592030942 591630578 590976059 589950085 588809192
1597E88809192r37879p62284q43346j116335j372695j388252j101494q88884j299202
$$ 588809192 587871313 587109029 586265683 585149348 583776653 582388401 581286907 580398023 579098821
1615.4E79098821j791179j050056m41253m64558m15922m42206m12584L9280M75287
$$ 579098821 577307642 576257586 575816333 575351775 574935853 574493647 574081063 574120343 574595630
1633.7E74595630P80761J081706J183986J237512J387298J733243K099276J875162
$$ 574595630 575376391 576458097 577642083 578879595 580266893 582000136 584099412 585974574
1650.1E85974574J586557J828193K027393J953184J750648J437426J290560J323223
$$ 585974574 587561131 589389324 591416717 593369901 595120549 596557975 597848535 599171758
1666.4E99171758J378536J365721J136124Q14915P91013J072228J137018P35879K38180
$$ 599171758 600550294 601916015 603052139 603867054 604658067 605730295 606867313 607603192 607841372
1684.7F07841372N27621R15646J030803Q73804L15905r8705J71303N87166P74145M74810
$$ 607841372 608368993 609284639 610315442 611189246 611505151 611406446 611577749 612164915 612939060 613413870
1705.1F13413870J32919K42412M73737N17309K35498k70128r5666M64797N76079M42982
$$ 613413870 613546789 613789201 614262938 614780247 615015745 614745617 614649951 615114748 615690827 616133809
1725.5F16133809K49922J18018J83701L36588O60896P34210M37856L50594N80132O81937
$$ 616133809 616383731 616501749 616685450 617022038 617682934 618417144 618855000 619205594 619785726 620467663
1745.9F20467663N51283L06487K86460M70936M95434M28677K93076J06692K06948L43620
$$ 620467663 621018946 621325433 621611893 622082829 622578263 623006940 623300016 623406708 623613656 623957276
1766.3F23957276L00825J87814P510J44005M17054M27842L32475K60651J69098J71066
$$ 623957276 624258101 624445915 624453425 624597430 625014484 625442326 625774801 626035452 626204550 626375616
1786.7F26375616K59697J86980J13129K49088K88368J96397K03788L47436L94821K76148
$$ 626375616 626635313 626822293 626935422 627184510 627472878 627669275 627873063 628220499 628615320 628891468
1807.1F28891468J41680J38462K87294L72947K92897K13265K02775J88708K23578K81453
$$ 628891468 629033148 629171610 629458904 629831851 630124748 630338013 630540788 630729496 630953074 631234527
1827.5F31234527J73688J44183K92123L38256L45766L51847K08437m1008N7578L93749
$$ 631234527 631408215 631552398 631844521 632182777 632528543 632880390 633088827 633047819 633105397 633499146
1847.9F33499146M67956L42905J84953J39833K25127L30507L43025K31862O4671Q345
$$ 633499146 633967102 634310007 634494960 634634793 634859920 635190427 635533452 635765314 635829985 635838330
1868.3F35838330K58744M90605L64423J10924O6281K21014L62456L39746J68622J1325
$$ 635838330 636097074 636587679 636952102 637063026 637129307 637350321 637712777 638052523 638221145 638232470
1888.7F38232470J26957L93332L96192K00629O7234J12295K85149L77774K51829N1737
$$ 638232470 638359427 638752759 639148951 639349580 639416814 639529109 639814258 640192032 640443861 640495598
1909.1F40495598M8161K41816L80099K78115R5785M5776J27852L35336M30762K65241
$$ 640495598 640543759 640785575 641165674 641443789 641539574 641585350 641713202 642048538 642479300 642744541
1929.5F42744541O1095N5551K37704L79681K87772N7160P511K12133L69429L57092
$$ 642744541 642805636 642861187 643098891 643478572 643766344 643823504 643831015 644043148 644412577 644769669
1949.9F44769669K46167J21534J05142K22981L30270L06725J78099O5505J39237L31461
$$ 644769669 645015836 645137370 645242512 645465493 645795763 646102488 646280587 646346092 646485329 646816790
1970.3F46816790L69132K34306J11222J07825K15113L24249K98500J53005M8816R6620
$$ 646816790 647185922 647420228 647531450 647639275 647854388 648178637 648477137 648630142 648678958 648775578
1990.7F48775578K58982L71039K84969J18077P8440J86145L10540K90931J41263L8922
$$ 648775578 649034560 649405599 649690568 649808645 649887085 650073230 650383770 650674701 650815964 650854886
2011.1F50854886R5844K18868K43247J28925m0651j55806k6048L65556N36203L06308
$$ 650854886 650950730 651169598 651412845 651541770 651501119 651345313 651319265 651684821 652221024 652527332
2031.5F52527332J00315J24931K35379K62141J73152O1452M7624J56343K56598K19047
$$ 652527332 652627647 652752578 652987957 653250098 653423250 653484702 653532326 653688669 653945267 654164314
2051.9F54164314R9421L4928Q8453K05696K47777J55806N9188Q1479J63674K17736
$$ 654164314 654263735 654298663 654387116 654592812 654840589 654996395 655055583 655137062 655300736 655518472
2072.3F55518472K05279J23262N1141Q1122J88946K52247K08080J11818P6235J49250
$$ 655518472 655723751 655847013 655898154 655979276 656168222 656420469 656628549 656740367 656816602 656965852
2092.7F56965852K44140K45691J60575Q0764Q7917J85311K53677K15113J17243N7280
$$ 656965852 657209992 657455683 657616258 657697022 657784939 657970250 658223927 658439040 658556283 658613563
2113.1F58613563J15573K46048K81334J70469N1916O1273J94490L14176K71976J01150
$$ 658613563 658729136 658975184 659256518 659426987 659478903 659540176 659734666 660048842 660320818 660421968
2133.5F60421968J7046J15753K68280L00467J62661K3246N7995K22743L37779K60592
$$ 660421968 660439014 660554767 660823047 661123514 661286175 661309421 661367416 661590159 661927938 662188530
2153.9F62188530O8963L278J36196L00110L10778J34767m7565K0564K85327L94464
$$ 662188530 662257493 662260771 662396967 662697077 663007855 663142622 663095057 663115621 663400948 663795412
2174.3F63795412K26616N961j3530J70469L37839L12924J21654j5915P0870K68459
$$ 663795412 664022028 664027989 664014459 664184928 664522767 664835691 664957345 664941430 665012300 665280759
2194.6F65280759L30448J80126j550J4603K11001L50713K54512K5630m5419J07527
$$ 665280759 665611207 665791333 665789783 665804386 666015387 666366100 666620612 666646242 666600823 666708350
2215F66708350K80619K93434J40786l219M9114K30491K99812J98245N3763J0073J18852
$$ 666708350 666988969 667282403 667423189 667419970 667469084 667699575 667999387 668197632 668251395 668261468 668380320
2237.5F68380320K49028K43366J15693R238M8936J90973K51174J51098J7702J431J06931
$$ 668380320 668629348 668872714 668988407 668997645 669046581 669237554 669488728 669639826 669657528 669658959 669765890
2259.9F69765890K02357J70887Q0883M6850Q5175J63376K04206J41918L9339L5346
$$ 669765890 669968247 670139134 670220017 670266867 670352042 670515418 670719624 670861542 670900881 670936227
2280.3F70936227J36912K20418K11298J10150j6034n4002Q941Q8811J15394M9472l0577
$$ 670936227 671073139 671293557 671504855 671615005 671598971 671544969 671553910 671642721 671758115 671807587 671777010
2302.7F71777010l4750K7597Q2672L1710r8408j26659j9253N4419K3306p2718j30355
$$ 671777010 671742260 671769857 671852529 671884239 671785831 671659172 671639919 671694338 671717644 671644926 671514571
2325.2F71514571m9115P1228Q6308O020j13488j52289p16J64688J24395N7399K28405
$$ 671514571 671465456 671536684 671622992 671629012 671515524 671363235 671362519 671527207 671651602 671709001 671937406
2347.6F71937406L61025K21789l3200j86145k26438j33693P3194K63572K77102J71900
$$ 671937406 672298431 672520220 672487020 672300875 672074437 671940744 672013938 672277510 672554612 672726512
2368F72726512K04921L92198N04971M70996L77178K94089K97785L67522L55721J99556
$$ 672726512 672931433 673323631 673828602 674299598 674676776 674970865 675268650 675636172 675991893 676191449
2388.4F76191449J9372j9968R7931K23875K10344O6519n3823j0252J41084J97649R0123
$$ 676191449 676210821 676190853 676288784 676512659 676723003 676789522 676735699 676725447 676866531 677064180 677154303
2410.8F77154303n0128o5505O9856K09570J94192K8432q5652M887J69635K03908Q6367
$$ 677154303 677104175 677038670 677108526 677318096 677512288 677540720 677455068 677459955 677629590 677833498 677919865
2433.3F77919865l5048k0623J10567J99317J36197L219n5492J4782J42693J76847O3718
$$ 677919865 677884817 677864194 677974761 678174078 678310275 678313494 678258002 678272784 678415477 678592324 678656042
2455.7F78656042o6460m2438J16765K14518J28865l0577o9619L8088J61171J56343
$$ 678656042 678589582 678547144 678663909 678878427 679007292 678976715 678907096 678945184 679106355 679262698
2476.1F79262698J6093q5592j8239J23143J76549R6619j6987k3485P6712J56581J10269
$$ 679262698 679278791 679193199 679174960 679298103 679474652 679571271 679554284 679530799 679607511 679764092 679874361
2498.5F79874361j7941o6460L636R3639J26541P8618m768k4557L5763Q6307Q4996M5538
$$ 679874361 679856420 679789960 679793596 679887235 680013776 680092394 680087626 680063069 680098832 680185139 680270135 680315673
2523F80315673p391R54P2718J13368Q6426L1949n126J192M7147Q9168P3493L099l9100
$$ 680315673 680308282 680309236 680381954 680495322 680581748 680613697 680608571 680609763 680656910 680746078 680819571 680822670 680783570
2549.5F80783570J9610J13606R9540j19m9114j0193Q3566J34647P1943k3425m0472
$$ 680783570 680803180 680916786 681016326 681016207 680967093 680956900 681040466 681175113 681247056 681223631 681183159
2572F81183159L8982J17600R2923q046o7294k563J21474J41681K0623r9003o5446Q3565
$$ 681183159 681222141 681339741 681432664 681424618 681357324 681354761 681476235 681617916 681638539 681539536 681474090 681557655
2596.4F81557655J55151N4658p2301n2571O2227J30356J01566M887p6711l4630Q9169
$$ 681557655 681712806 681767464 681695163 681642592 681704819 681835175 681936741 681941628 681864917 681830287 681919456
2618.9F81919456J21951L8087n3525n9664L4392J25587J02996j2934q1718q940J07288
$$ 681919456 682041407 682079494 682025969 681966305 682000697 682126284 682229280 682216346 682134628 682125688 682232976
2641.3F82232976J01328R54p2837o5863J1026P0691M6969k6166n6625l695P6294J11341
$$ 682232976 682334304 682335258 682262421 682196558 682207584 682278275 682325244 682299078 682242453 682238758 682315052 682426393
2665.8F82426393O7532j7345m9651K2650J08004Q6188j0669p3373m0651N1439Q7500
$$ 682426393 682493925 682476580 682426929 682449579 682557583 682643771 682633102 682559729 682519078 682570517 682658017
2688.2F82658017J3172p1048m0055O8486J13428M4644n8592p3075J8835R4414O4909
$$ 682658017 682671189 682600141 682560086 682628572 682742000 682786644 682728052 682654977 682673812 682768226 682833135
2710.7F82833135k4795p0990k1636O3598P9394O139o4373n2333J3471N8054M1366k4319
$$ 682833135 682808340 682737350 682715714 682779312 682858706 682864845 682800472 682748139 682761610 682819664 682861030 682836711
2735.1F82836711o7055k7418N3167P7069J0669o8843n1022M3154Q2731K6346n5135
$$ 682836711 682769656 682742238 682795405 682872474 682883143 682814300 682763278 682806432 682889163 682915509 682860374
2757.6F82860374o8128j4126L1352L7193N37n6088n4062L4094O9082j3113q7082q0884
$$ 682860374 682792246 682778120 682809472 682846665 682847202 682791114 682737052 682771146 682840228 682827115 682740033 682659149
2782F82659149j2874O7293P6652j1683r0182n7518K8789N1379J073n7936r4413p1049
$$ 682659149 682646275 682713568 682790220 682778537 682688355 682630837 682659626 682711005 682712078 682654142 682559729 682488680
2806.5F82488680R000J9610p2658j33276q7559J79L4868k801o0976q2135m9233j967
$$ 682488680 682497680 682517290 682444632 682311356 682223797 682223976 682258844 682256043 682195067 682112932 682063699 682061732
2831F82061732k146o9082j16944j19925j38759j56164j86086k41637k60890k07007
$$ 682061732 682059586 681990504 681873560 681753635 681614876 681458712 681272626 681030989 680770099 680563092
2851.4F80563092j10149m3035k4736l4332k8431J3292J6808l7730n9664n424J6510
$$ 680563092 680452943 680409908 680385172 680350840 680322409 680335701 680352509 680314779 680255115 680249691 680266201
2873.8F80266201m4584p1287n4479p5817q5711j8537L4809j5080r8050j04129m1306
$$ 680266201 680221617 680150330 680095851 680020034 679934323 679915786 679950595 679935515 679837465 679733336 679692030
2896.3F79692030j8895o3121j12295j36554j14918n2691j5258o9738j79529k41160
$$ 679692030 679673135 679610014 679497719 679361165 679246247 679193556 679178298 679108560 678929031 678687871
2916.6F78687871k25187j84119j61349j46568p2181O1035J39117J21117P5757Q8096
$$ 678687871 678462684 678278565 678117216 677970648 677898467 677959502 678098619 678219736 678295493 678383589
2937F78383589J66893K31027K29478J55092M2498K384O4492P5460p630m5538o795M2677
$$ 678383589 678550482 678781509 679010987 679166079 679208577 679210961 679275453 679350913 679343283 679297745 679290950 679333627
2961.5F79333627N8890L3497J5378L6776Q5593J23918J22249J40548J84476J48654
$$ 679333627 679392517 679426014 679441392 679478168 679563761 679687679 679809928 679950476 680134952 680283606
2981.9F80283606P4983O4373R1970J56164J76132O4313j252L0756L5584J8895j5616
$$ 680283606 680358589 680422962 680514932 680671096 680847228 680911541 680910289 680941045 680976629 680995524 680979908
3004.4F80979908l3439N5611J69516J31428k5510j30713j23442o9320l5047n2333j14978
$$ 680979908 680946469 681002080 681171596 681303024 681277514 681146801 681023359 680954039 680918992 680866659 680751681
3026.8F80751681j06156J610P2717J0789j00672p6175L4809L1769q1896j63436j46449
$$ 680751681 680645525 680647135 680719852 680730641 680629969 680553794 680588603 680620372 680538476 680375040 680228591
3049.2F80228591q3387m6790n7756j23799j63973r6619l695L7253l6180j90080k22206
$$ 680228591 680145204 680098414 680040658 679916859 679752886 679656267 679652572 679689825 679653645 679463565 679241359
3071.7F79241359q7142O0320P1168o9857j84297j58489j15991j07645j20163j82927
$$ 679241359 679154217 679214537 679285705 679215848 679031551 678873062 678757071 678649426 678529263 678346336
3092.1F78346336j94252j12891n3823r8109j96457k03013r8944n0724j33454j60575
$$ 678346336 678152084 678039193 677985370 677887261 677690804 677487791 677388847 677338123 677204669 677044094
3112.4F77044094o2406l2425j14322k32279l38793l22581k11119j68741k16663k53200
$$ 677044094 676981688 676949263 676834941 676602662 676263869 675941288 675730169 675561428 675344765 675091565
3132.8F75091565j91450p7606q1896k38717l49701k99453k24948j97053j74046k48849
$$ 675091565 674900115 674822509 674740613 674501896 674152195 673852742 673627794 673430741 673256695 673007846
3153.2F73007846l92795l94463l03209k99454l47555l49223l15428l13938l51667l83794
$$ 673007846 672615051 672220588 671917379 671617925 671270370 670921147 670605719 670291781 669940114 669556320
3173.6F69556320l95656m00901l91841l78608m01795m47631m69923m65095m59850m66526
$$ 669556320 669160664 668759763 668367922 667989314 667587519 667139888 666669965 666204870 665745020 665278494
3194F65278494n13196n66542n38587m60923m21345m60327n44846n67496n10514m79877
$$ 665278494 664765298 664198756 663660169 663199246 662777901 662317574 661772728 661205232 660694718 660214841
3214.4F60214841m94122n25236n55158n48184n33938n44369n65410n24223m49121n09799
$$ 660214841 659720719 659195483 658640325 658092141 657558203 657013834 656448424 655924201 655475080 654965281
3234.8F54965281o24597o27398n72205n01871m43399m47213m94779n28335m84765m18782
$$ 654965281 654340684 653713286 653141081 652639210 652195811 651748598 651253819 650725484 650240719 649821937
3255.2F49821937m20213m37438m34101m16755l65913k86818k41280l38315m92991n42283
$$ 649821937 649401724 648964286 648530185 648113430 647747517 647460699 647219419 646881104 646388113 645845830
3275.6F45845830n21421m99189m99725n12541n15163n12301m75109m68075n80371p17520
$$ 645845830 645324409 644825220 644325495 643812954 643297791 642785490 642310381 641842306 641261935 640544415
3296F40544415p92742p93338p05838o04034o51419q98898j124382j144707j043498
$$ 640544415 639751673 638958335 638252497 637648463 636997044 636098146 634973764 633829057 632785559
3314.4F32785559r92239j043200j121581j134813j115203j206815j337767j368343
$$ 632785559 631793320 630750120 629628539 628493726 627378523 626171708 624833941 623465598
3330.7F23465598j359105j318753j271010j367509j549244j628876j633107j601279
$$ 623465598 622106493 620787740 619516730 618149221 616599977 614971101 613337994 611736715
3347F11736715j533032j613497j851678j941264j805901j677096j726687j827598j770198
$$ 611736715 610203683 608590186 606738508 604797244 602991343 601314247 599587560 597759962 595989764
3365.4E95989764j662433j722396j888811j919687j768112j620412j543999j478493
$$ 595989764 594327331 592604935 590716124 588796437 587028325 585407913 583863914 582385421
3381.7E82385421j430094j371026j207948j008690j017809j212358j238942j026809
$$ 582385421 580955327 579584301 578376353 577367663 576349854 575137496 573898554 572871745
3398E72871745q70347r75371j169443j133919r61303r02772r10461q96395q33153p18713
$$ 572871745 572001398 571026027 569856584 568722665 567761362 566858590 565948129 565051734 564218581 563499868
3418.4E63499868o60420o27219m95076l23892k32101k54273k05219k5034j2576j69575
$$ 563499868 562839448 562212229 561717153 561393261 561161160 560906887 560701668 560676634 560664058 560494483
3438.8E60494483j68264M530J63018K71499L66509M46737M72605M85182N69284O78897
$$ 560494483 560326219 560330749 560493767 560765266 561131775 561578512 562051117 562536299 563105583 563784480
3459.2E63784480O71208O67453Q37385R52662Q20696O23226N98550O95228Q27969R03844
$$ 563784480 564455688 565123141 565960526 566913188 567733884 568357110 568955660 569650888 570478857 571382701
3479.6E71382701Q07345P69079Q79049Q59440P87675Q71718R79483J002789R55701
$$ 571382701 572190046 572959125 573838174 574697614 575485289 576357007 577336490 578339279 579294980
3497.9E79294980R35018R37044Q48353Q16584R21786J000166J040101J054704J016438
$$ 579294980 580229998 581167042 582015395 582831979 583753765 584753931 585794032 586848736 587865174
3516.3E87865174J000821J051605J114845J068950R99272J041353J093507J102864
$$ 587865174 588865995 589917600 591032445 592101395 593100667 594142020 595235527 596338391
3532.6E96338391J174748J234114J212955J254141J277387J174450J045347J098811
$$ 596338391 597513139 598747253 599960208 601214349 602491736 603666186 604711533 605810344
3548.9F05810344J257122J263559J203954J264453J385689J387477J265227J197636
$$ 605810344 607067466 608331025 609534979 610799432 612185121 613572598 614837825 616035461
3565.2F16035461J294375J493931J600563J541913J466870J483858J581192J698196
$$ 616035461 617329836 618823767 620424330 621966243 623433113 624916971 626498163 628196359
3581.5F28196359J751363J690566J496733J486778J675904J750290J738668J746058
$$ 628196359 629947722 631638288 633135021 634621799 636297703 638047993 639786661 641532719
3597.9F41532719J722515J688480J710594J683593J566767J500428J534164J553357
$$ 641532719 643255234 644943714 646654308 648337901 649904668 651405096 652939260 654492617
3614.2F54492617J611173J644373J508713J346051J289010J341701J254141J082838
$$ 654492617 656103790 657748163 659256876 660602927 661891937 663233638 664487779 665570617
3630.5F65570617J211941J257241J181960J132428R74298Q06212P78556P91848P23362
$$ 665570617 666782558 668039799 669221759 670354187 671328485 672134697 672913253 673705101 674428463
3648.8F74428463O61015Q28207Q97527P02321O84023O73890M04060K82169L26156J65165
$$ 674428463 675089478 675917685 676815212 677517533 678201556 678875446 679279506 679561675 679887831 680052996
3669.2F80052996J45256M68016J77562q2433M18424O60778O34789O20782N06282J89543
$$ 680052996 680198252 680666268 680843830 680761397 681179821 681840599 682475388 683096170 683602452 683791995
3689.6F83791995J92046M74572M12167J36196m3332j59920m9591K43187K59638K8908
$$ 683791995 683984041 684458613 684870780 685006976 684963644 684803724 684754133 684997320 685256958 685285866
3710F85285866p6771K31982N32150M89175K76626J25229J65462K70188L96908M23967
$$ 685285866 685209095 685441077 685973227 686462402 686739028 686864257 687029719 687299907 687696815 688120782
3730.4F88120782J52707j52170j18971L7372R6679k11299r30845o79017l9219l63231
$$ 688120782 688273489 688121319 688002348 688039720 688136399 687925100 686994255 686315238 686276019 685912788
3750.8F85912788n06878o556J61588l6121j08123K8730l5226j29819j33455j47164
$$ 685912788 685405910 685399354 685560942 685524821 685416698 685445428 685410202 685280383 685146928 684999764
3771.2F84999764L0577J54078O1989j36018j30832L0816j2219l5048K8789M4406O2286
$$ 684999764 685030341 685184419 685246408 685110390 684979558 685010374 684998155 684963107 684991896 685036302 685098588
3793.7F85098588n7756j32382r1613l58522j58429J89424q1361l9577K27153J53065
$$ 685098588 685040832 684908450 684816837 684458315 684299886 684489310 684407949 684368372 684595525 684748590
3814.1F84748590j79350j55628r2268l39866K1935K41637O2346M292k4378Q8989M3273
$$ 684748590 684569240 684413612 684321344 683981478 684003413 684245050 684307396 684311688 684287310 684376299 684419572
3836.5F84419572l23832k15649O4492L7670P5221J84655J31131m15981o98328J02997
$$ 684419572 684095740 683880091 683944583 683982253 684057474 684242129 684373260 683957279 683258951 683361948
3856.9F83361948M58121K26796j39952l12150q0645o378j19268P5996J51932J40667
$$ 683361948 683820069 684046865 683906913 683594763 683514118 683507740 683388472 683464468 683616400 683757067
3877.3F83757067k7061k31683R8109Q5235j65761p212j03414j44064J63912J41323
$$ 683757067 683730006 683498323 683596432 683681667 683515906 683508694 683405280 683261216 683425128 683566451
3897.7F83566451j98066l18468j62184P6652K57611J59323m5299l3319p034j12057
$$ 683566451 683368385 683049917 682887733 682964385 683221996 683381319 683336020 683302701 683295667 683183610
3918.1F83183610j08420l7313m2081K2710J59680Q2970j24514j09196J1802M6730K3007
$$ 683183610 683075190 683037877 682995796 683018506 683178186 683261156 683136642 683027446 683039248 683085978 683108985
3940.5F83108985q9287j01090o974k8669l815N7757n841o7294l457Q0407N1379l0935
$$ 683108985 683019698 682918608 682911634 682882965 682879150 682936907 682931066 682863772 682860315 682940722 682992101 682961166
3965F82961166o0856l9816k0206j8895k8551j1324L1590O8307N2929l2067o0618m4048
$$ 682961166 682900310 682860494 682840288 682821393 682792842 682781518 682813108 682881415 682934344 682902277 682841659 682797611
3989.5F82797611n0485q762M0769J9968
$$ 682797611 682747126 682738364 682779133 682799101
3997.6F82799101
$$ 682799101
##END=$$ End of the data block
