##TITLE=AD 02 $$ Begin of the data block
##JCAMP-DX=5.00 $$ ACD/SpecManager v 10.08
##SPECTROMETER/DATA SYSTEM=Alpha
##DATE=16 Dec 2014 10:37:32
##DATA TYPE=INFRARED SPECTRUM
##DATA CLASS=XYDATA
##ORIGIN=
##OWNER=
##NPOINTS=1765
##FIRSTX=399.76428223
##LASTX=3997.64306641
##MAXX=3997.64306641
##MINX=399.76428223
##MAXY=1.00000000
##MINY=0.45841494
##XFACTOR=1.0000000000
##YFACTOR=0.000000010000000
##FIRSTY=1.00000000
##DELTAX=2.03961372
##XUNITS=1/CM
##YUNITS=ARBITRARY UNITS
##XYDATA=(X++(Y..Y))
399.8A00000000p79414p76839p92027q11386q35866q72040r03606r13578r11349q98809
420.2I1505086q76987q60667q45086q21311p92443p63256p35903p18408p04033o76268
440.6H3710724o49661o27726n99170n60373n18507m81605m43584l89409l17782k47175
461G8875732j87373j28615o6363r400L8993Q3739J28519J72788K08175K30009K46364
483.4G9592568K64895K84123K99162L07572L15368L28302L41845L45784L41278L45111
503.8H2766008L63690L80641L83759L86220M00150M22567M41205M48364M52096M65113
524.2H6909813M86570M97586M90445M80813M82398M89723M85582M63861M44746M45944
544.6I1677481M53585M47715M29910M16565M18693M25178M15229L91496L76111L76838
$$ y = [100000000, 99220586, 98443747, 97651720, 96840334, 96004468, 95132428, 94228822, 93315244, 92403895, 91505086, 90628099, 89767432, 88922346, 88101035, 87308592, 86545336, 85809433, 85091025, 84386992, 83710724, 83061063, 82433337, 81834167, 81273794, 80755287, 80273682, 79830098, 79440689, 79122907, 78875732, 78688359, 78559744, 78493381, 78483981, 78522974, 78606713, 78735232, 78908020, 79116195, 79346204, 79592568, 79857463, 80141586, 80440748, 80748320, 81063688, 81391990, 81733835, 82079619, 82420897, 82766008, 83129698, 83510339, 83894098, 84280318, 84680468, 85103035, 85544240, 85992604, 86444700, 86909813, 87396383, 87893969, 88384414, 88865227, 89347625, 89837348, 90322930, 90786791, 91231537, 91677481, 92131066, 92578781, 93008691, 93425256, 93843949, 94269127, 94684356, 95075852, 95451963, 95828801]
565I5828801L76988L59189L28577L08007L06380L05205K87277K58577K37977K31266
585.4I8828244K22832J96076J59871J38861J34391J22690R1457N3937K9456J8871L314
607.8A00000000%Tl153J210J943%m596n060M637N019%Wj8907m7981o1363o8659q6254
648.6I9716836j14846j42390j58935j67728j82366k06542k26963k33441k34354k43288
669I7805983k60925k75618k78110k75761k81929k97028l10880l17157l15505l11678
689.4I4881392l09951l03351k85477k63977k50506k44338k36439k23202k11280k10715
709.8I2342156k22224k36022k44469k50149k58684k69782k77251k78354k79772k88815
730.2H9736634l02129l10582l12341l14337l21871l32057l38388l38119l36379l38918
$$ y = [95828801, 96205789, 96564978, 96893555, 97201562, 97507942, 97813147, 98100424, 98359001, 98596978, 98828244, 99051076, 99247152, 99407023, 99545884, 99680275, 99802965, 99894422, 99948359, 99977815, 99996686, 100000000, 100000000, 100000000, 99996847, 99998057, 100000000, 100000000, 99995404, 99990344, 99994981, 100000000, 100000000, 100000000, 100000000, 100000000, 100000000, 99981093, 99933112, 99871749, 99803090, 99716836, 99601990, 99459600, 99300665, 99132937, 98950571, 98744029, 98517066, 98283625, 98049271, 97805983, 97545058, 97269440, 96991330, 96715569, 96433640, 96136612, 95825732, 95508575, 95193070, 94881392, 94571441, 94268090, 93982613, 93718636, 93468130, 93223792, 92987353, 92764151, 92552871, 92342156, 92119932, 91883910, 91639441, 91389292, 91130608, 90860826, 90583575, 90305221, 90025449, 89736634, 89434505, 89123923, 88811582, 88497245, 88175374, 87843317, 87504929, 87166810, 86830431, 86491513]
750.6H6491513l42566l39067l26853l12555l01987k93803k80941k58666k29669j99371
771H3606035j67060j28407q4251m2993j2469J0806L7372O9756J00106J23960J45137
793.4H3657992J68919J95921K21020K38371K48253K54542K53933K37424K00128J46312
813.8H5822815Q4722J8817n6815j44130k33984l18045l96686m74853n52809o22880
834.2H3126152o77026p16072p46948p71963p86483p88147p81184p71940p63041p51090
854.6G5572258p35414p21830p14296p09748p02244o89072o72829o57654o44052o29091
875F8696028o11532n94705n81646n71013n59616n48774n43248n42713n41293n35065
895.4F3066423n25367n15431n05639m93717m79269m64678m52006m41414m31156m19611
$$ y = [86491513, 86148947, 85809880, 85483027, 85170472, 84868485, 84574682, 84293741, 84035075, 83805406, 83606035, 83438975, 83310568, 83226317, 83183324, 83170855, 83181661, 83219033, 83288789, 83388895, 83512855, 83657992, 83826911, 84022832, 84243852, 84482223, 84730476, 84985018, 85238951, 85476375, 85676503, 85822815, 85907537, 85926354, 85869539, 85725409, 85491425, 85173380, 84776694, 84301841, 83749032, 83126152, 82449126, 81733054, 80986106, 80214143, 79427660, 78639513, 77858329, 77086389, 76323348, 75572258, 74836844, 74115014, 73400718, 72690970, 71988726, 71299654, 70626825, 69969171, 69325119, 68696028, 68084496, 67489791, 66908145, 66337132, 65777516, 65228742, 64685494, 64142781, 63601488, 63066423, 62541056, 62025625, 61519986, 61026269, 60547000, 60082322, 59630316, 59188902, 58757746, 58338135]
915.8E8338135m08023l98558l90417l81517l72458l65108l59958l55238l49003l42125
936.2E4615730l37219l34186l30299l24768l19635l16668l14593l10612l04449k98875
956.6E1424426k95228k91622k85536k76917k68626k62830k58022k50998k41787k33444
977D8759416k27490k22054k14330k03827j93363j84769j76230j65787j53703j42550
997.4D6875313j34546j28018j19582j08359r7435q9091q1835p2887o1572m9618l9032
1019.8D5893338k9123j7803m918P776J8540K7826L8064N0878O4427P5832Q5273R5681
1044.3D6305791J08119J20473J30785J39025J47032J55929J64592J70291J72371J73372
1064.7D7787780J75958J79294J80999J81165J82849J87978J93996J98304K01491K05907
$$ y = [58338135, 57930112, 57531554, 57141137, 56759620, 56387162, 56022054, 55662096, 55306858, 54957855, 54615730, 54278511, 53944325, 53614026, 53289258, 52969623, 52652955, 52338362, 52027750, 51723301, 51424426, 51129198, 50837576, 50552040, 50275123, 50006497, 49743667, 49485645, 49234647, 48992860, 48759416, 48531926, 48309872, 48095542, 47891715, 47698352, 47513583, 47337353, 47171566, 47017863, 46875313, 46740767, 46612749, 46493167, 46384808, 46287373, 46198282, 46116447, 46043560, 45981988, 45932370, 45893338, 45864215, 45846412, 45841494, 45849270, 45867810, 45895636, 45933700, 45984578, 46049005, 46124837, 46210110, 46305791, 46413910, 46534383, 46665168, 46804193, 46951225, 47107154, 47271746, 47442037, 47614408, 47787780, 47963738, 48143032, 48324031, 48505196, 48688045, 48876023, 49070019, 49268323, 49469814, 49675721]
1085.1D9675721K12261K19104K23970K26003K27058K28882K30825K30407K27809K26117
1105.5E1928157K27266K28834K27452K23392K19995K19476K20173K19661K18255K17873
1125.9E4150534K18862K19864K19285K17015K15244K15429K16228K15357K12866K10089
1146.3E6310773K07937K06238K04539K03133K03317K05469K08843K12610K16496K21502
1166.7E8400857K27732K33847K39479K45297K51162K55895K58637K60341K62653K65974
1187.1F0901874K69491K72649K76381K81352K87133K92808K96986L00515L05361L11279
1207.5F3795829L16095L19219L21936L25311L28922L31062TL30210L30615L31402L30084
1229.9F7391747L26395L22408L20017L18420L15136L09205L02201K96229K90955K83747
$$ y = [49675721, 49887982, 50107086, 50331056, 50557059, 50784117, 51012999, 51243824, 51474231, 51702040, 51928157, 52155423, 52384257, 52611709, 52835101, 53055096, 53274572, 53494745, 53714406, 53932661, 54150534, 54369396, 54589260, 54808545, 55025560, 55240804, 55456233, 55672461, 55887818, 56100684, 56310773, 56518710, 56724948, 56929487, 57132620, 57335937, 57541406, 57750249, 57962859, 58179355, 58400857, 58628589, 58862436, 59101915, 59347212, 59598374, 59854269, 60112906, 60373247, 60635900, 60901874, 61171365, 61444014, 61720395, 62001747, 62288880, 62581688, 62878674, 63179189, 63484550, 63795829, 64111924, 64431143, 64753079, 65078390, 65407312, 65738374, 66069436, 66399646, 66730261, 67061663, 67391747, 67718142, 68040550, 68360567, 68678987, 68994123, 69303328, 69605529, 69901758, 70192713, 70476460]
1250.3G0476460K74235K64550K56926K51203K44570K36529K29824K26205K24471K22004
1270.7G2906977K17611K13289K11155K10345K07585K02108J96784J93465J91551J88965
1291.1G4939835J84524J79625J75976J73712J70762J65599J60641J58834J58888J57839
1311.5G6626235J54585J51539J50841J51503J49954J43289J35494J31171J29045J26272
1331.9G8049928J20950J14196J09357J06841J05143J01399R2405Q2267P6568P0816
1352.3G9029870O0600M7231L4320K5553J9246J2171L225r269k5820l8016l8427l5411
1376.7G9085273l5507l1710k3186j6230j0044o002k086O443J4043J6380J5032O735
1401.2G9019141q958j2958l761K622O765J0038J1724J7637K1714K0504L0398M5914
$$ y = [70476460, 70750695, 71015245, 71272171, 71523374, 71767944, 72004473, 72234297, 72460502, 72684973, 72906977, 73124588, 73337877, 73549032, 73759377, 73966962, 74169070, 74365854, 74559319, 74750870, 74939835, 75124359, 75303984, 75479960, 75653672, 75824434, 75990033, 76150674, 76309508, 76468396, 76626235, 76780820, 76932359, 77083200, 77234703, 77384657, 77527946, 77663440, 77794611, 77923656, 78049928, 78170878, 78285074, 78394431, 78501272, 78606415, 78707814, 78800219, 78882486, 78959054, 79029870, 79090470, 79137701, 79172021, 79197574, 79216820, 79228991, 79232216, 79222947, 79197127, 79159111, 79120684, 79085273, 79049766, 79018056, 78994870, 78978640, 78968596, 78962594, 78960508, 78966951, 78980994, 78997374, 79012406, 79019141, 79010183, 78997225, 78993464, 78996086, 79002851, 79012889, 79024613, 79042250, 79063964, 79084468, 79114866, 79160780]
1425.7G9160780N7703O7705P3635P4399P6705Q8346R1422P7653P9697R0987R5659R8688
1450.2H0133379J07216J20277J31768J38026J50752J67811J82945J98560K16079K23893
1470.6H1770706K09832J91808K04986K19018K10350J99795K04468K09075J99682J75780
1491H3795500J66040J73438J82045J88279J89322J82420J65027J55467J65486J68288
1511.4H5531312J63979J67352J73366J79308J75768J45841J26183J34111J40625J43063
1531.8H7080908J38312J31715J26832J30785J25581R7311R8234J10382J14214J16480
1552.2H8270754J05583Q5068P8315Q1682Q0418Q1575P8559P4351O9875N7417L0285
1574.6H9093882P510J5336J3125l320k4777m5979n7424p1030r4706j10996j17463j26254
$$ y = [79160780, 79218483, 79286188, 79359823, 79434222, 79510927, 79599273, 79690695, 79768348, 79848045, 79939032, 80034691, 80133379, 80240595, 80360872, 80492640, 80630666, 80781418, 80949229, 81132174, 81330734, 81546813, 81770706, 81980538, 82172346, 82377332, 82596350, 82806700, 83006495, 83210963, 83420038, 83619720, 83795500, 83961540, 84134978, 84317023, 84505302, 84694624, 84877044, 85042071, 85197538, 85363024, 85531312, 85695291, 85862643, 86036009, 86215317, 86391085, 86536926, 86663109, 86797220, 86937845, 87080908, 87219220, 87350935, 87477767, 87608552, 87734133, 87831444, 87929678, 88040060, 88154274, 88270754, 88376337, 88461405, 88539720, 88621402, 88701820, 88783395, 88861954, 88936305, 89006180, 89063597, 89093882, 89101392, 89116728, 89129853, 89126533, 89101756, 89055777, 88998353, 88927323, 88832617, 88721621, 88604158, 88477904]
1599.1H8477904j41949j57094j66553j75989j81442j79428j74439j64330j51831j48720
1619.5H6836129j39606j08349o8223k3950J2964L7736P6270J15943J28585J63377K18206
1641.9H7249082K63322K87735L01701L12680L08472L01933L09563L06922K87861K65544
1662.3I0194815K51764K43569J97458J52099J66184J77467J72031J59782J46115J35773
1682.7I1997057J10024R1881R2572Q5348P9876Q9169R4759Q1325M8673L7461N2429
1705.1I2860574O2596O6442O1553N1564M4364K9552K3133L1101L5817M6158O2233P2002
1729.6I3447089P0602O0129O3032Q6796J02592J05828J08236J04934R5874Q2362P3576
1752I4401050P5513O4462N0897M8840M6503L9971L4016L4625M1175M5949M6193M1050
$$ y = [88477904, 88335955, 88178861, 88012308, 87836319, 87654877, 87475449, 87301010, 87136680, 86984849, 86836129, 86696523, 86588174, 86519951, 86496001, 86508965, 86546701, 86622971, 86738914, 86867499, 87030876, 87249082, 87512404, 87800139, 88101840, 88414520, 88722992, 89024925, 89334488, 89641410, 89929271, 90194815, 90446579, 90690148, 90887606, 91039705, 91205889, 91383356, 91555387, 91715169, 91861284, 91997057, 92107081, 92198962, 92291534, 92376882, 92456758, 92545927, 92640686, 92722011, 92770684, 92808145, 92860574, 92923170, 92989612, 93051165, 93102729, 93147093, 93176645, 93199778, 93230879, 93266696, 93312854, 93375087, 93447089, 93517691, 93577820, 93640852, 93727648, 93830240, 93936068, 94044304, 94149238, 94245112, 94327474, 94401050, 94476563, 94541025, 94591922, 94640762, 94687265, 94727236, 94761252, 94795877, 94837052, 94883001, 94929194, 94970244]
1776.5I4970244L6055L9440M2957L8410L1888K7210K8950L5774L8076L8981M2427M4274
1801I5414686M5598N0252M9818M1085L8386L7360L0547K8313L1465L4344L7104M0513
1825.5I5879471L8183L2365L2092L3974L7480M2015M1813L7145L4249L2157L3259L9154
1850I6313357L7021K8503K7650K9368K3818J9425K3514K7501K9391L0905L0262K8264
1874.4I6648979K9242L1215L0768K8020K2233J9336K3716K7085K5969K4385K5433K7937
1898.9I6964318K7543K4265K1487J9068J8901J9824K0474K2519K4557K5803K6750K7436
1923.4I7242945K5976K3168K3288K4068K1458J8942J9980K0403K0408K1547K2459K3920
1947.9I7508562K4974K4259K3532K3502K2048K0540K1332K2179K2191K3049K4629K5290
$$ y = [94970244, 95006299, 95045739, 95088696, 95127106, 95158994, 95186204, 95215154, 95250928, 95289004, 95327985, 95370412, 95414686, 95460284, 95510536, 95560354, 95601439, 95639825, 95677185, 95707732, 95736045, 95767510, 95801854, 95838958, 95879471, 95917654, 95950019, 95982111, 96016085, 96053565, 96095580, 96137393, 96174538, 96208787, 96240944, 96274203, 96313357, 96350378, 96378881, 96406531, 96435899, 96459717, 96479142, 96502656, 96530157, 96559548, 96590453, 96620715, 96648979, 96678221, 96709436, 96740204, 96768224, 96790457, 96809793, 96833509, 96860594, 96886563, 96910948, 96936381, 96964318, 96991861, 97016126, 97037613, 97056681, 97075582, 97095406, 97115880, 97138399, 97162956, 97188759, 97215509, 97242945, 97268921, 97292089, 97315377, 97339445, 97360903, 97379845, 97399825, 97420228, 97440636, 97462183, 97484642, 97508562, 97533536, 97557795, 97581327, 97604829, 97626877, 97647417, 97668749, 97690928, 97713119, 97736168, 97760797, 97786087]
1972.3I7786087K4169K1905K1553K3329K3288K1338K0868K1946K3056K3418K2626K1982
1996.8I8055565K2346K2906K2984K2411K0939J8877J6236J3227J0758R978J1545J4616
2021.3I8262388J7493J8853J9563K1845K5236K7264K7370K6637K5493K3198J9390J6784
2045.8I8531514J6201J6266J7178J8138J7708J6487J6558J8323J9312J8078J6456J6720
2070.2I8738939J8644J9842J9491J8734J8680J9854K1386K1619K0885K1029K2191K2721
2094.7I8984015K1601K0086J9980K0653K0528J9181J7982J8126J9151J9628J9121J8299
2119.2I9218351J8054J8304J8079J7142J6498J6869J7720J8001J7869J8209J8835J8901
2143.7I9432832J8215J7739J8066J8328J7148J4913J3656J4055J4716J4526J3923J3990
$$ y = [97786087, 97810256, 97832161, 97853714, 97877043, 97900331, 97921669, 97942537, 97964483, 97987539, 98010957, 98033583, 98055565, 98077911, 98100817, 98123801, 98146212, 98167151, 98186028, 98202264, 98215491, 98226249, 98236227, 98247772, 98262388, 98279881, 98298734, 98318297, 98340142, 98365378, 98392642, 98420012, 98446649, 98472142, 98495340, 98514730, 98531514, 98547715, 98563981, 98581159, 98599297, 98617005, 98633492, 98650050, 98668373, 98687685, 98705763, 98722219, 98738939, 98757583, 98777425, 98796916, 98815650, 98834330, 98854184, 98875570, 98897189, 98918074, 98939103, 98961294, 98984015, 99005616, 99025702, 99045682, 99066335, 99086863, 99106044, 99124026, 99142152, 99161303, 99180931, 99200052, 99218351, 99236405, 99254709, 99272788, 99289930, 99306428, 99323297, 99341017, 99359018, 99376887, 99395096, 99413931, 99432832, 99451047, 99468786, 99486852, 99505180, 99522328, 99537241, 99550897, 99564952, 99579668, 99594194, 99608117, 99622107]
2168.1I9622107J4817J5396J4800J3900J4055J5032J5187J3644J1503J0878J2040J2410
2192.6I9785769J1146J0008J0276J1020J0491R006Q392R281J0067R286P666P295Q333
2219.1I9908036Q672P141N388N389O628P039N513L505L368M780N108L869K729L016
2247.7I9980181M161L910J717K02J490L326K742L04j007L0J663J281%l87L87%Tj234
2284.4I9998766k354j097o56l588p850r900r185q357r894j3536j6469j6719j5873j7017
2312.9I9866271j8936j7226j2332r299j0228j2588j4043j3656o222O354J2856Q196
2337.4I9779147k62o831j2893j7690j8299j4788j0776q118m989L45Q023J9014L5280
2363.9I9747163M8423M8995M0561L2508K6298J9902J4955J1050O903L069J73%Um83
$$ y = [99622107, 99636924, 99652320, 99667120, 99681020, 99695075, 99710107, 99725294, 99738938, 99750441, 99761319, 99773359, 99785769, 99796915, 99806923, 99817199, 99828219, 99838710, 99847716, 99856108, 99865389, 99875456, 99884742, 99892408, 99899703, 99908036, 99916708, 99923849, 99929237, 99934626, 99941254, 99948293, 99953806, 99957311, 99960679, 99965459, 99970567, 99974436, 99977165, 99980181, 99984342, 99988252, 99989969, 99990171, 99991661, 99994987, 99997729, 99998033, 99997026, 99997056, 99998719, 100000000, 100000000, 99999613, 100000000, 100000000, 100000000, 99998766, 99996412, 99995315, 99994659, 99991071, 99983221, 99973321, 99964136, 99955779, 99945885, 99932349, 99915880, 99899161, 99883288, 99866271, 99847335, 99830109, 99817777, 99808478, 99798250, 99785662, 99771619, 99757963, 99751741, 99758095, 99770951, 99779147, 99778885, 99772054, 99759161, 99741471, 99723172, 99708384, 99697608, 99689490, 99684501, 99684846, 99692869, 99711883, 99747163, 99795586, 99844581, 99885142, 99917650, 99943948, 99963850, 99978805, 99989855, 99996758, 99999827, 100000000, 100000000, 100000000, 100000000, 99999517]
2394.5I9999517n18J49N72K80%Ul58o79j252j788j490m65O44J061M41j19M41J293J097
2435.3I9998826J01n4N79N48n54j675j449R0J132M95q64q35P63J896J001p87r89N48
2472I9998772J228%j329j067P51J645n4k187j818M71J299k80j818j138P39J091o14
2506.7I9995691k009j192P87J436L6j335p99R06J484M23l39O55K247K009%r89n55O80
2543.4I9999136Q64k74j145r18j66K98J07q9M53J031P03n19j615j550r29l82L6J97
2580.1I9995238L21Q23J502J496O20k21p1K92q3j115j580p39M18N66j31n84K80J543
2616.8I9998575J425%j121o19P68R72m05j550j264k08k15j532k491j657o0K57p16j186
2653.5I9988973j97J467J973Q58k50j79N90Q82J37n42J01J204J460N79k27O0J037J371
$$ y = [99999517, 99998999, 99999148, 99999720, 100000000, 100000000, 100000000, 100000000, 99999642, 99998963, 99997711, 99995923, 99994433, 99993968, 99994612, 99995673, 99996114, 99995995, 99996436, 99997729, 99998826, 99998927, 99998873, 99999452, 100000000, 99999446, 99997771, 99996322, 99996412, 99997544, 99998039, 99997175, 99996340, 99997103, 99998999, 100000000, 99999213, 99998224, 99998772, 100000000, 100000000, 99998671, 99997604, 99998355, 100000000, 99999946, 99997759, 99995941, 99996412, 99997711, 99997431, 99995613, 99994475, 99995214, 99996305, 99995691, 99993682, 99992490, 99993277, 99994713, 99994749, 99993414, 99992615, 99993521, 99995005, 99995428, 99995089, 99995744, 99997991, 100000000, 100000000, 99999011, 99998456, 99999136, 100000000, 99999726, 99998581, 99997663, 99997497, 99997795, 99997902, 99997813, 99998266, 99999297, 100000000, 99999481, 99997866, 99996316, 99995387, 99995005, 99995041, 99995238, 99995559, 99996382, 99997884, 99999380, 100000000, 99999779, 99999708, 100000000, 99999917, 99998802, 99997222, 99996483, 99996901, 99997467, 99997336, 99996752, 99997032, 99998575, 100000000, 100000000, 99998879, 99998260, 99999028, 100000000, 99999595, 99998045, 99996781, 99996573, 99996358, 99994826, 99992335, 99990678, 99990618, 99990875, 99990159, 99988973, 99988776, 99990243, 99992216, 99993074, 99992824, 99992645, 99993235, 99994117, 99994254, 99993712, 99993813, 99995017, 99996477, 99997056, 99996829, 99996889, 99997926, 99999297]
2690.3I9999297P03%k38k27j67l81m65J25Q11N42n72j544j860j293k86L81N25J85l6
2729I9995500M2O37J240J443R41J97%Tj97o43l22L51M35j96q76o98K98R66Q28N4m17
2771.8I9999583j37L45K09l22l10K27M05k38j294k068j931j520k003l612m917n108
2804.5I9977309m864n281o193o443n490m506m780o050o938p016o920q434j2165j6588
2833I9875641k0564k4807l0327l6192m0078m0269l7301l3152k8813k3293j6147q595
2857.5I9536103k307J884M899P195P569N430K253m88k259l201m047n585p886j0163
2886.1I9529397j1920j3227j4132j4752j5265j5664j6308j7881k0731k4968k9802l3468
2910.5I9301279l5417l6407l6234l3688k7919j9795j0729j359Q667J9067K7824L2526
$$ y = [99999297, 100000000, 100000000, 99999762, 99999535, 99999368, 99998987, 99998522, 99998647, 99999458, 100000000, 99999428, 99997884, 99996024, 99994731, 99994445, 99994826, 99995351, 99995536, 99995500, 99995542, 99996179, 99997419, 99998862, 99999803, 100000000, 100000000, 100000000, 99999803, 99999160, 99998838, 99999189, 99999624, 99999428, 99998552, 99997854, 99998152, 99999118, 99999946, 100000000, 99999583, 99999446, 99999791, 100000000, 99999678, 99999368, 99999595, 100000000, 99999762, 99998468, 99996400, 99994469, 99992949, 99990946, 99987334, 99982417, 99977309, 99972445, 99967164, 99960971, 99954528, 99949038, 99944532, 99939752, 99933702, 99926764, 99919748, 99912828, 99904394, 99892229, 99875641, 99855077, 99830270, 99799943, 99763751, 99723673, 99683404, 99646103, 99612951, 99584138, 99560845, 99544698, 99536103, 99533796, 99535680, 99540579, 99547774, 99555343, 99560773, 99563026, 99562538, 99560279, 99557078, 99553031, 99547446, 99539560, 99529397, 99517477, 99504250, 99490118, 99475366, 99460101, 99444437, 99428129, 99410248, 99389517, 99364549, 99334747, 99301279, 99265862, 99229455, 99193221, 99159533, 99131614, 99111819, 99101090, 99099731, 99108398, 99127465, 99155289, 99187815]
2935I9187815L3325L2491L1197K8962K4670J8692J3500J1087J0449R167P391P152Q923
2961.5I9424821J1277J3173J4728J7071K0510K3264K4068K3645K3473K4634K6095K5195
2986I9671954K1458J7440J4800J2201Q833N949M369L654L188K522J287k68j180j955
3014.5I9764252l767o128q034r078r447r591r602r293r059q673p552p224r006j1039
3043.1I9646759j1504j1927j3524j4877j5152j4513j3262j2976j4496j6004j5682j4174
3067.6I9478668j3751j5437j7113j6045j4025j4961j8198j9931j9068j7714j8573k1529
3092.1I9272323k3544k2680k1380k2232k3926k3782k1392j9181k0534k4712k7543k8229
3116.5I8993188k8473l0005l2711l3903l3105l2699l4266l6937l8362l7116l5232l5656
$$ y = [99187815, 99221140, 99253631, 99284828, 99313790, 99338460, 99357152, 99370652, 99381739, 99392188, 99401355, 99408746, 99415898, 99424821, 99436098, 99449271, 99463999, 99481070, 99501580, 99524844, 99548912, 99572557, 99596030, 99620664, 99646759, 99671954, 99693412, 99710852, 99725652, 99737853, 99746686, 99752635, 99757004, 99760658, 99763846, 99766368, 99767655, 99767387, 99766207, 99764252, 99760485, 99754357, 99746323, 99737245, 99727798, 99718207, 99708605, 99699312, 99690253, 99681580, 99674028, 99666804, 99657798, 99646759, 99635255, 99623328, 99609804, 99594927, 99579775, 99565262, 99552000, 99539024, 99524528, 99508524, 99492842, 99478668, 99464917, 99449480, 99432367, 99416322, 99402297, 99387336, 99369138, 99349207, 99330139, 99312425, 99293852, 99272323, 99248779, 99226099, 99204719, 99182487, 99158561, 99134779, 99113387, 99094206, 99073672, 99048960, 99021417, 98993188, 98964715, 98934710, 98901999, 98868096, 98834991, 98802292, 98768026, 98731089, 98692727, 98655611, 98620379, 98584723]
3141I8584723l7825l9661m0996m2659m4721m6784m8166m8650m9918n2864n6207n8663
3165.5I8017609n9968o0147o0159o0976o2012o3432o5738o7651o8599o9833p2246p5192
3189.9I7231656p7724p9835q1366q2534q3828q4389q4173q3977q4055q4144q4054q4180
3214.4I6237397q4883q5747q6296q6742q7273q8436r0450r1743r1029q9931r0027q9949
3238.9I5174891q8489q5813q3530q2469q1223p8392p5323p3117p0983o8861o6984o4850
3263.4I4254857o3222o3277o4426o5863o7801p0625p3749p6449p9054q2349q6457r0218
3287.8I3371367r2512r3996r6113j00106j05828j12152j18774j25987j33383j40130
3308.2I2252386j45215j49906j56522j64538j72234j78438j82468j85430j90079j96541
$$ y = [98584723, 98546898, 98507237, 98466241, 98423582, 98378861, 98332077, 98283911, 98235261, 98185343, 98132479, 98076272, 98017609, 97957641, 97897494, 97837335, 97776359, 97714347, 97650915, 97585177, 97517526, 97448927, 97379094, 97306848, 97231656, 97153932, 97074097, 96992731, 96910197, 96826369, 96741980, 96657807, 96573830, 96489775, 96405631, 96321577, 96237397, 96152514, 96066767, 95980471, 95893729, 95806456, 95718020, 95627570, 95535827, 95444798, 95354867, 95264840, 95174891, 95086402, 95000589, 94917059, 94834590, 94753367, 94674975, 94599652, 94526535, 94455552, 94386691, 94319707, 94254857, 94191635, 94128358, 94063932, 93998069, 93930268, 93859643, 93785894, 93709445, 93630391, 93548042, 93461585, 93371367, 93278855, 93184859, 93088746, 92988640, 92882812, 92770660, 92651886, 92525899, 92392516, 92252386, 92107171, 91957265, 91800743, 91636205, 91463971, 91285533, 91103065, 90917635, 90727556, 90531015]
3328.6I0531015k03639k11030k17664k22350k26712k32535k38926k45630k52813k60079
3349H8219637k66290k69610k70605k72631k76649k79922k81816k82580k81114k77513
3369.4H5460907k73245k68036k60449k50304k39628k30080k18856k04331j90807j82437
3389.8H3142734j77271j72388j67930j63752j60003j56963j53821j49948j45423j40572
3410.2H1554663j35422j28269j18249j06663r4539q2320p0262n8889m8280l9095l0094
3432.7H0642581j9658r054R78J0776K0624L1715M3184N2726O2394P5776R0444J00320
3457.1H1102806J04297J05780J07628J11586J16569J19501J20366J21081J22815J24514
3477.5H2256943J23984J23721J27494J32507J34945J36477J37216J36477J37180J40244
$$ y = [90531015, 90327376, 90116346, 89898682, 89676332, 89449620, 89217085, 88978159, 88732529, 88479716, 88219637, 87953347, 87683737, 87413132, 87140501, 86863852, 86583930, 86302114, 86019534, 85738420, 85460907, 85187662, 84919626, 84659177, 84408873, 84169245, 83939165, 83720309, 83515978, 83325171, 83142734, 82965463, 82793075, 82625145, 82461393, 82301390, 82144427, 81990606, 81840658, 81695235, 81554663, 81419241, 81290972, 81172723, 81066060, 80971521, 80889201, 80818939, 80760050, 80711770, 80672675, 80642581, 80622923, 80613869, 80614847, 80625623, 80646247, 80677962, 80721146, 80773872, 80836266, 80912042, 81002486, 81102806, 81207103, 81312883, 81420511, 81532097, 81648666, 81768167, 81888533, 82009614, 82132429, 82256943, 82380927, 82504648, 82632142, 82764649, 82899594, 83036071, 83173287, 83309764, 83446944, 83587188]
3497.9H3587188J43885J46550J48636J50073J51068J52009J51539J52546J57106J60063
3518.3H5100663J60849J64592J69075J71095J71256J71214J75178J80227J80632J79880
3538.7H6824661J81848J84030J85835J91695J93864J78617J66839J78051J93310J98495
3559.1H8677245J98990K03258K14607K27558K32232K25145K24089K38890K50524K49225
3579.5I0941763K39360K28638K37530K63626K77376K70658K62392K62690K65663K69467
3599.9I3519163K56121K28310K33561K62928K70468K40105K08461K15096K29817K37298
3620.3I5901328K34783K21664K16245K21336K13683J73861J24526J21015J47545J49256
3640.7I7725242J28329J02818J01549J32668J46186J30320J09273J06507Q8394N4878
$$ y = [83587188, 83731073, 83877623, 84026259, 84176332, 84327400, 84479409, 84630948, 84783494, 84940600, 85100663, 85261512, 85426104, 85595179, 85766274, 85937530, 86108744, 86283922, 86464149, 86644781, 86824661, 87006509, 87190539, 87376374, 87568069, 87761933, 87940550, 88107389, 88285440, 88478750, 88677245, 88876235, 89079493, 89294100, 89521658, 89753890, 89979035, 90203124, 90442014, 90692538, 90941763, 91181123, 91409761, 91647291, 91910917, 92188293, 92458951, 92721343, 92984033, 93249696, 93519163, 93775284, 94003594, 94237155, 94500083, 94770551, 95010656, 95219117, 95434213, 95664030, 95901328, 96136111, 96357775, 96574020, 96795356, 97009039, 97182900, 97307426, 97428441, 97575986, 97725242, 97853571, 97956389, 98057938, 98190606, 98336792, 98467112, 98576385, 98682892, 98771286, 98826164]
3661.1I8826164L3546J1241J7059N3268N5027K2609J9860M6515O8420Q4001Q4603N8937
3685.6I9381250M3035N3698M4709L0601K7144K6429L8057M0937J9806m011j025J2779
3710I9713409K4253L5364L0821N311j2785j586J7888J2445k2233j8906J3369L612j9145
3736.5I9781817q845J0186J5563K1738L2586K4020L702k122J3882L5101L1066N478
3761I9964172j2O37j5878j5247O527J3077P272J1915J7941R596l135k5934l2276j5658
3789.6I9922997j5688j7578o133O515J842n544n072j3679o521P790Q065O443o20j3149
3818.1I9869668j0436j6022k5064o515J1576J3417J5211K5064n568o0778l7629O050
3842.6I9778974K3454K1440P606M440m196k5457k2280m399J6761L5339L2193R966l6055
$$ y = [98826164, 98859710, 98870951, 98888010, 98941278, 98996305, 99018914, 99038774, 99085289, 99153709, 99237710, 99322313, 99381250, 99424285, 99477983, 99522692, 99553293, 99580437, 99606866, 99644923, 99685860, 99705666, 99701655, 99700630, 99713409, 99737662, 99773026, 99803847, 99809158, 99796373, 99794787, 99812675, 99825120, 99802887, 99783981, 99797350, 99800962, 99781817, 99772972, 99783158, 99798721, 99820459, 99853045, 99877065, 99880767, 99878645, 99892527, 99927628, 99958694, 99964172, 99964160, 99964797, 99948919, 99933672, 99940199, 99953276, 99960548, 99972463, 99990404, 100000000, 99996865, 99970931, 99938655, 99922997, 99907309, 99889731, 99883598, 99890113, 99891955, 99886411, 99881339, 99867660, 99861139, 99868929, 99876994, 99883437, 99882817, 99869668, 99859232, 99843210, 99818146, 99811631, 99823207, 99836624, 99851835, 99876899, 99871331, 99810553, 99772924, 99778974, 99802428, 99823868, 99831474, 99835914, 99831718, 99806261, 99783981, 99779582, 99796343, 99831682, 99863875, 99873841, 99837786]
3869.1I9837786m9603M923K7472J5473J2309J6129J3977o288k9308k7901q785J1181
3893.6I9817365J4335Q673Q315p51j37J1789P135P230K2268J8865n996k3431k2041
3920.1I9863619o497J2195J5539J0371R251K902n889l296L112K914L380O682K807k885
3948.7I9914205J609R817J1403O401j067k104K063P03k235j14L493N442N800M858L701
3979.3I9963975M578N507M798L785L106L534M524M041K152
3997.6A00000000
$$ y = [99837786, 99788183, 99793106, 99820578, 99836051, 99848360, 99864489, 99878466, 99872178, 99842870, 99814969, 99806184, 99817365, 99831700, 99840373, 99848688, 99847937, 99847800, 99859589, 99866724, 99873954, 99896222, 99915087, 99909091, 99885660, 99863619, 99857122, 99869317, 99884856, 99895227, 99904478, 99907380, 99901491, 99898195, 99901307, 99904221, 99907601, 99914283, 99917090, 99914205, 99915814, 99925631, 99937034, 99943435, 99942368, 99940264, 99942327, 99943030, 99940795, 99940681, 99944174, 99949616, 99955416, 99960274, 99963975, 99968553, 99974060, 99978858, 99982643, 99985749, 99989283, 99993807, 99997848, 100000000]
##END=$$ End of the data block
