##TITLE=AD 01 $$ Begin of the data block
##JCAMP-DX=5.00 $$ ACD/SpecManager v 10.08
##SPECTROMETER/DATA SYSTEM=Alpha
##DATE=16 Dec 2014 10:37:32
##DATA TYPE=INFRARED SPECTRUM
##DATA CLASS=XYDATA
##ORIGIN=
##OWNER=
##NPOINTS=1765
##FIRSTX=399.76428223
##LASTX=3997.64306641
##MAXX=3997.64306641
##MINX=399.76428223
##MAXY=1.00000000
##MINY=0.60356009
##XFACTOR=1.0000000000
##YFACTOR=0.000000010000000
##FIRSTY=1.00000000
##DELTAX=2.03961372
##XUNITS=1/CM
##YUNITS=ARBITRARY UNITS
##XYDATA=(X++(Y..Y))
399.8 100000000 99441367 98858613 98248750 97644228 97048974 96434575 95777810 95086884 94398904 93764287
420.2 93764287 93202889 92669439 92105603 91514885 90957952 90473557 90037751 89591277 89122701 88681632
440.6 88681632 88305998 87987244 87680525 87355727 87031722 86754858 86544997 86372477 86195868 86016047
461 86016047 85873824 85797036 85769051 85748327 85716414 85698545 85731447 85816389 85913521 85987723 86049634 86140329
485.4 86140329 86282831 86454737 86610687 86736578 86861062 87018073 87206674 87392718 87552226 87703913
505.8 87703913 87885225 88108522 88348913 88573134 88778061 88993800 89250761 89541739 89826941 90080625
526.2 90080625 90322244 90595627 90917563 91256142 91568029 91847795 92129546 92447388 92792678 93121940
546.6 93121940 93410301 93681556 93980378 94317591 94654602 94948840 95206732 95478648 95797467 96137619
567 96137619 96443748 96695852 96932912 97204423 97509116 97797394 98030245 98223805 98429984 98671091
587.4 98671091 98909640 99095285 99226189 99350321 99507362 99679422 99809486 99867898 99885660 99915010
607.8 99915010 99967122 100000000 99989641 99957138 99943233 99968809 100000000 100000000 99975342 99943674 99945825 99978995 100000000
634.3 100000000 100000000 99965590 99933428 99923015 99906868 99845141 99734557 99611115 99504334 99397641 99258512
656.8 99258512 99073809 98859978 98653883 98473978 98299056 98095465 97859091 97619516 97406369 97217226
677.2 97217226 97021937 96798152 96553177 96311331 96086335 95872808 95646042 95393980 95142901 94925070
697.5 94925070 94738770 94551653 94339389 94111770 93901312 93724310 93559629 93371361 93149161 92920285
717.9 92920285 92717379 92537802 92346716 92118841 91867441 91627473 91413790 91202974 90959883 90680194
738.3 90680194 90397018 90141022 89905608 89657378 89376712 89083344 88815045 88584512 88369256 88142020
758.7 88142020 87903482 87683272 87507415 87368995 87240064 87108874 86994803 86925238 86904961 86911780 86921775
781.2 86921775 86936277 86979055 87067056 87190038 87321043 87443703 87567741 87714815 87890023 88071740
801.6 88071740 88232321 88363999 88479757 88590711 88685232 88734454 88717085 88635856 88506627 88333493 88099587
824 88099587 87783319 87382692 86920512 86422509 85893714 85321778 84701151 84050441 83401889 82773215
844.4 82773215 82155818 81532907 80904341 80290258 79710883 79164481 78629905 78091186 77555418 77044249
864.8 77044249 76567632 76110750 75651145 75185144 74730116 74301946 73895866 73491645 73076040 72657824
885.2 72657824 72257203 71881658 71518046 71148086 70769852 70400572 70056182 69732744 69412535 69085211
905.6 69085211 68758935 68450415 68165433 67892075 67614985 67333084 67059660 66806573 66570669 66337097
926 66337097 66096330 65854460 65625131 65413010 65208697 64999694 64784545 64574242 64378691 64195287
946.4 64195287 64012313 63822180 63629389 63444942 63273764 63109744 62943316 62772650 62605697 62450999
966.8 62450999 62308484 62170178 62028968 61885846 61748755 61624193 61509585 61396360 61280662 61167812
987.2 61167812 61067015 60981750 60906279 60832047 60757291 60689181 60635108 60593140 60553241 60508406 60463142 60427964
1011.6 60427964 60407007 60394067 60380393 60364765 60356009 60363573 60386640 60415316 60442531 60472429 60515010 60574239
1036.1 60574239 60643172 60711855 60778928 60853869 60945994 61053622 61166078 61275709 61386210 61507624 61643821
1058.6 61643821 61786765 61924613 62054694 62185794 62326795 62475419 62620944 62757236 62889636 63027787
1079 63027787 63174731 63322848 63462180 63592303 63722110 63858163 63996381 64126837 64245039 64356613
1099.4 64356613 64470398 64588499 64705068 64813972 64916009 65018469 65127021 65239030 65348107 65452385
1119.8 65452385 65556216 65665460 65781665 65900087 66014528 66124117 66233844 66348535 66467386 66584748
1140.1 66584748 66696167 66802430 66907495 67013723 67119253 67220306 67316139 67410952 67510092 67615235
1160.5 67615235 67723519 67831481 67939895 68053538 68175924 68305469 68436921 68566406 68694764 68825746
1180.9 68825746 68960816 69096845 69229186 69357127 69485170 69618589 69757795 69898027 70035791 70173597
1201.3 70173597 70317763 70472163 70634353 70798743 70963216 71131533 71308607 71494287 71683532 71871889
1221.7 71871889 72060186 72253418 72454315 72659361 72862762 73063052 73264199 73470473 73680925 73889315
1242.1 73889315 74089903 74283010 74473959 74665999 74856317 75039488 75213885 75383544 75553709 75725359
1262.5 75725359 75894952 76059145 76219034 76379550 76543790 76709384 76871336 77027911 77182204 77337855
1282.9 77337855 77495039 77650321 77799743 77943057 78084618 78228170 78372419 78513223 78648216 78778708
1303.3 78778708 78908622 79040611 79172826 79301262 79424524 79546052 79670721 79799271 79926497 80045038
1323.7 80045038 80153239 80257517 80363566 80469930 80570436 80661613 80747432 80834126 80923164 81010789 81090719
1346.2 81090719 81159759 81223822 81288469 81348729 81395793 81426811 81447530 81467158 81488156 81502718 81500673 81480265
1370.6 81480265 81450820 81425226 81407934 81392068 81371123 81352973 81346875 81353742 81367248 81378013 81388247 81409353
1395.1 81409353 81443602 81480539 81508881 81523943 81534761 81557268 81592649 81629896 81661093 81688911 81723434 81771958
1419.6 81771958 81824648 81868863 81911278 81964159 82033509 82115388 82197541 82271594 82346064 82434702 82528204 82610029
1444.1 82610029 82683152 82755721 82835370 82927179 83029211 83137995 83250588 83369589 83502978 83652496
1464.5 83652496 83812094 83979815 84158564 84344131 84518915 84679091 84840059 85003221 85161090 85317057
1484.9 85317057 85478318 85644472 85802889 85938013 86061209 86187345 86321658 86461580 86601222 86733925
1505.2 86733925 86854821 86972952 87095255 87216592 87336320 87461287 87595212 87741989 87891990 88015699
1525.6 88015699 88117129 88213700 88315558 88421637 88523561 88616258 88703936 88800347 88893247 88967210 89033264
1548.1 89033264 89098543 89170301 89255714 89342141 89410394 89462900 89508212 89557672 89617097 89678949 89735436 89785546
1572.6 89785546 89828390 89851171 89854372 89848089 89829195 89799225 89759737 89709002 89646751 89564013 89454877 89334345
1597 89334345 89217424 89098907 88957155 88794082 88624883 88455421 88287085 88117272 87946188 87786603
1617.4 87786603 87648249 87525731 87419164 87335861 87286723 87282997 87322074 87392640 87490112 87615234 87763453
1639.9 87763453 87940878 88153720 88395560 88652331 88920259 89195514 89465308 89728546 89989680 90243614
1660.3 90243614 90481734 90701431 90913880 91116774 91282034 91414940 91540545 91667289 91799092 91930574
1680.7 91930574 92054331 92164344 92253160 92329216 92401618 92467791 92531234 92600322 92676896 92749166 92799753
1703.1 92799753 92838097 92877656 92925143 92984611 93049639 93110484 93163407 93200994 93231523 93266493 93308777 93358278
1727.6 93358278 93413371 93471748 93528366 93574899 93616784 93663681 93714625 93771082 93836123 93903291 93964469 94012862
1752 94012862 94057107 94105738 94150817 94187146 94217730 94243675 94266021 94288802 94316393 94349217 94384331 94418508
1776.5 94418508 94450432 94483787 94523817 94565254 94598222 94623047 94646263 94675577 94709772 94740099 94767004 94799531
1801 94799531 94840842 94887769 94935018 94974166 95006293 95042384 95080066 95108771 95127875 95145905 95170295 95203859
1825.5 95203859 95242441 95274109 95295823 95317096 95345408 95381302 95419943 95455307 95486975 95518869 95551527 95586312
1850 95586312 95622796 95652610 95675516 95701140 95730966 95755172 95771652 95787615 95807892 95834279 95865178 95894349
1874.4 95894349 95917809 95939898 95965487 95994794 96022171 96040380 96052992 96069384 96092492 96118277 96142036 96163285
1898.9 96163285 96184945 96208650 96233767 96255958 96271515 96282738 96294260 96310323 96331525 96353811 96374017 96393913
1923.4 96393913 96416914 96442324 96467543 96491426 96512580 96531129 96551192 96574128 96596229 96616030 96635026 96656126
1947.9 96656126 96681726 96709573 96735209 96757758 96778947 96800101 96822435 96845436 96866393 96885604 96906680 96931940
1972.3 96931940 96960562 96988326 97011155 97031069 97052842 97076881 97100711 97122228 97141069 97159845 97181839 97206992
1996.8 97206992 97232521 97256136 97277915 97300452 97325999 97350860 97367781 97376412 97383046 97393054 97407591 97424293
2021.3 97424293 97440577 97456491 97474909 97498620 97526622 97554451 97579432 97603583 97629768 97656369 97678804 97696191
2045.8 97696191 97711754 97728735 97748983 97771460 97792536 97809619 97824556 97841829 97863084 97885531 97905844 97923517
2070.2 97923517 97941542 97963011 97987330 98010987 98031497 98049945 98069739 98093027 98118395 98142415 98163742 98184973
2094.7 98184973 98209399 98236907 98263818 98286951 98306984 98327333 98350412 98375303 98398727 98418838 98437685 98459017
2119.2 98459017 98483902 98509443 98532212 98552150 98572659 98596430 98622209 98646224 98666185 98683763 98703057 98726010
2143.7 98726010 98750037 98771238 98789304 98807669 98829180 98853010 98875517 98893929 98909861 98927987 98950458 98974282
2168.1 98974282 98994911 99011481 99027824 99048078 99071902 99095201 99114698 99130940 99147719 99167830 99189425 99208015
2192.6 99208015 99222392 99236298 99253839 99274808 99294990 99310553 99322617 99336034 99353653 99373025 99389136 99400407
2217.1 99400407 99410921 99425405 99443549 99460703 99473405 99482864 99493676 99508554 99524635 99536806 99544257 99551427
2241.6 99551427 99562889 99578428 99593377 99603868 99611264 99620020 99632543 99646425 99657005 99662745 99667144 99674660 99685723
2268.1 99685723 99697012 99705487 99712110 99720818 99733198 99745870 99754244 99757493 99759072 99762774 99768412 99772120 99770951 99765694
2296.6 99765694 99759775 99755836 99753076 99747992 99738580 99726248 99713653 99701864 99689209 99673110 99654198 99636042 99620581
2323.1 99620581 99606514 99590385 99568468 99542016 99519682 99509460 99511456 99519241 99527878 99537218 99547845 99557078 99560219
2349.7 99560219 99555689 99546522 99536890 99528617 99520415 99510574 99503481 99509501 99534971 99577212 99627954 99680763 99732816
2376.2 99732816 99783516 99832016 99875534 99911273 99938738 99959409 99975526 99987745 99994469 99995130 99992532 99990630 99991709
2402.7 99991709 99995172 99998176 99998438 99997050 99996811 99998438 100000000 99999076 99995595 99992484 99992067 99993634 99994773 99993968 99992198 99992049
2435.3 99992049 99994707 99997747 99997652 99994069 99990106 99988824 99990153 99990946 99988919 99985534 99983901 99984872 99986291 99985528 99982053 99978280
2467.9 99978280 99977112 99978387 99978948 99976456 99972153 99969238 99968863 99968880 99966508 99961734 99957389 99955827 99956357 99956375 99953985 99950576
2500.6 99950576 99949300 99950862 99952269 99950236 99944854 99939370 99936312 99935281 99933887 99930483 99926078 99923110 99922723 99923295 99921942
2531.2 99921942 99918115 99914002 99911714 99911171 99910134 99907094 99902970 99899793 99898618 99898010 99895406 99890018 99883896 99879920 99878508
2561.8 99878508 99877340 99874300 99869537 99864936 99861878 99859643 99856216 99850541 99843943 99838984 99836153 99833441 99828947 99823076
2590.3 99823076 99818236 99815995 99814796 99811423 99804503 99796098 99789375 99785471 99782187 99776816 99769568 99763298 99759889 99758130
2618.9 99758130 99754786 99747986 99739575 99732643 99727994 99723572 99717301 99709594 99702626 99697798 99694026 99688768 99680829 99671990
2647.4 99671990 99665129 99660909 99656832 99650759 99643219 99636388 99631852 99628943 99625105 99618614 99610680 99603945 99599326 99595225
2676 99595225 99589676 99582553 99575967 99571806 99569184 99565536 99559301 99551666 99545360 99541479 99538350 99533564 99526674 99519521 99514204
2706.6 99514204 99510437 99505609 99498200 99489695 99482566 99477804 99474114 99469447 99463391 99457353 99452764 99449569 99445897 99439830
2735.1 99439830 99432218 99425691 99421334 99417788 99413210 99407065 99400461 99395126 99391443 99387252 99380231 99371070 99362844 99357396
2763.7 99357396 99353111 99347526 99340224 99332869 99327296 99323577 99319696 99313527 99305189 99297142 99291390 99286759 99280733 99272597
2792.2 99272597 99263883 99256015 99248528 99239928 99228966 99216086 99203765 99193782 99185258 99176145 99165761 99155450 99146438
2818.8 99146438 99138433 99129790 99119031 99106336 99093145 99080259 99066782 99050504 99029535 99004281 98976928 98949325
2843.2 98949325 98921502 98892957 98864329 98837823 98816079 98799956 98788255 98779321 98772424 98768121 98766297 98764616 98759866
2869.7 98759866 98751104 98740584 98731256 98723572 98715752 98706079 98694509 98682708 98671961 98661470 98648947 98633313 98616326
2896.3 98616326 98600721 98586845 98572296 98554492 98533350 98510981 98488307 98464227 98437661 98409003 98380923 98357195
2920.7 98357195 98339444 98326522 98317552 98314214 98319101 98332191 98349744 98367476 98383695 98398721 98413068 98426276
2945.2 98426276 98436654 98442632 98444581 98444641 98443961 98441941 98438776 98435646 98434013 98435318 98439705 98446327 98454231 98462695 98471951
2975.8 98471951 98482817 98494875 98506522 98516768 98525220 98531854 98537135 98541099 98542792 98542178 98540932 98540056 98538893 98536319
3004.4 98536319 98531342 98524153 98516417 98509246 98502314 98494101 98483133 98469812 98455846 98442465 98430097 98418593 98407525
3030.9 98407525 98396790 98387247 98379427 98371726 98361921 98349619 98336142 98322344 98307210 98289764 98270333 98250407
3055.3 98250407 98232073 98215944 98200524 98184800 98169345 98155892 98145258 98135138 98122561 98107249 98090798 98074448
3079.8 98074448 98057860 98039824 98019326 97996449 97972274 97947907 97923905 97899461 97873133 97846311 97822112 97801256
3104.3 97801256 97782135 97762787 97741836 97719139 97695488 97670728 97643358 97612453 97579455 97546870 97515273 97482401
3128.8 97482401 97446936 97410274 97374618 97341752 97310913 97278810 97243583 97206068 97167689 97128946 97089273 97047663
3153.2 97047663 97003829 96958488 96911931 96863419 96812201 96757960 96701807 96646178 96591806 96537137 96480840 96422493
3177.7 96422493 96362555 96302384 96242315 96180362 96114522 96045423 95975024 95904398 95833665 95761740 95687485 95611954
3202.2 95611954 95537126 95463318 95389223 95313531 95236182 95158303 95081270 95005614 94930339 94853818 94775808 94697702
3226.7 94697702 94620222 94542426 94463468 94383955 94304967 94227183 94150841 94075304 93999702 93924659 93852103 93783164
3251.1 93783164 93716383 93650329 93585950 93524599 93466461 93411028 93356514 93300438 93242049 93182391 93122083 93060166
3275.6 93060166 92995286 92927438 92857492 92785561 92710853 92633009 92552650 92470694 92387855 92302781 92211962 92113030
3300.1 92113030 92006004 91891778 91771269 91645622 91516036 91382289 91242510 91095400 90941137 90781236
3320.5 90781236 90618360 90454286 90287954 90117335 89940852 89758039 89569473 89375961 89177656 88974154
3340.9 88974154 88765383 88550955 88329577 88100111 87864107 87626046 87389654 87153238 86912537 86667228
3361.3 86667228 86420363 86174846 85931814 85690171 85448456 85208398 84975672 84755218 84545922 84343618
3381.7 84343618 84149790 83970511 83806300 83649582 83494598 83342248 83194822 83052629 82913500 82774246
3402.1 82774246 82634127 82495439 82361394 82233042 82108569 81987900 81874967 81774420 81687927 81614065
3422.5 81614065 81551135 81497884 81453723 81418800 81392509 81373370 81360483 81354111 81355423 81366491 81389314 81423670
3446.9 81423670 81466830 81518751 81583756 81663728 81753695 81846923 81940496 82035947 82136023 82240242 82345879
3469.4 82345879 82451993 82558745 82666451 82775480 82884479 82992673 83102888 83218604 83340186 83464926
3489.8 83464926 83590090 83714241 83838254 83964449 84093523 84224856 84357780 84490699 84623724 84758896
3510.2 84758896 84896553 85035974 85177094 85319740 85464597 85613042 85763872 85915065 86067313 86222631
3530.6 86222631 86381370 86542964 86705703 86867547 87029260 87192118 87356222 87523824 87696052 87865740
3551 87865740 88027138 88186818 88352120 88524854 88703829 88886583 89072907 89267176 89472479 89684165
3571.3 89684165 89895689 90109497 90330434 90557891 90785807 91006625 91221637 91442138 91674036 91912675
3591.7 91912675 92151141 92386580 92619592 92854971 93092489 93320566 93536448 93752754 93976516 94200969
3612.1 94200969 94413561 94615364 94813216 95011848 95212537 95411605 95606893 95800483 95992905 96176183
3632.5 96176183 96334749 96469855 96597892 96725684 96848506 96961004 97062737 97165245 97275400 97388786
3652.9 97388786 97495753 97597349 97696817 97783589 97848654 97887838 97906578 97926384 97957575 97992247 98022592
3675.4 98022592 98053724 98094040 98148811 98217368 98288429 98350012 98407382 98464584 98515266 98555952 98585504 98610651
3699.8 98610651 98639685 98672056 98698640 98712939 98719317 98726243 98741251 98765790 98790634 98803514 98806882 98813075
3724.3 98813075 98826510 98835802 98831862 98827600 98828596 98824394 98814166 98805964 98802954 98805869 98820162 98846334 98874611
3750.8 98874611 98896593 98916191 98943567 98982298 99024600 99061590 99093187 99115157 99124032 99129927 99140030 99151444
3775.3 99151444 99162650 99177343 99195343 99213678 99225593 99224228 99216193 99207437 99197096 99186778 99180114 99177915 99177366
3801.8 99177366 99179041 99179995 99178857 99180770 99186867 99196523 99208742 99217200 99220765 99222898 99218148 99208015 99202341 99205035
3830.4 99205035 99214780 99232817 99256426 99263352 99251127 99238008 99232870 99236798 99244690 99254888 99269503 99279410 99275976
3856.9 99275976 99265802 99261147 99271500 99295563 99325061 99347258 99349630 99347091 99355906 99371696 99389112 99408549
3881.4 99408549 99432379 99455541 99465704 99459130 99445415 99436545 99437350 99444282 99455255 99468005 99480075 99495256 99513412
3907.9 99513412 99530596 99549586 99572873 99594307 99606276 99608099 99605125 99605554 99612486 99623656 99638855 99656183 99669570
3934.4 99669570 99678016 99686122 99695867 99706274 99717104 99727523 99735677 99742973 99753356 99768251 99784935 99798638 99808502
3960.9 99808502 99818659 99829847 99839407 99848157 99858564 99870944 99884069 99896103 99905229 99911845 99918234 99926645 99937767
3987.4 99937767 99950236 99962378 99974191 99986631 100000000
3997.6 100000000
##END=$$ End of the data block
