##TITLE=$$ Begin of the data block
##JCAMP-DX=5.00 $$ ACD/SpecManager v 10.08
##SPECTROMETER/DATA SYSTEM=16PC
##DATE=Tue Aug 20 10:24:50 2013
##DATA TYPE=INFRARED SPECTRUM
##DATA CLASS=XYDATA
##ORIGIN=
##OWNER=
##NPOINTS=3601
##FIRSTX=400.00000000
##LASTX=4000.00000000
##MAXX=4000.00000000
##MINX=400.00000000
##MAXY=34.64112091
##MINY=13.46588135
##XFACTOR=1.0000000000
##YFACTOR=0.000000100000000
##FIRSTY=25.88000298
##DELTAX=1.00000000
##XUNITS=1/CM
##YUNITS=TRANSMITTANCE
##XYDATA=(X++(Y..Y))
400B58800030J1096248J4717102L170243j33515o30378J2168M361859L812542j125336
409B94080963l889313o921768p016411m598617j175423O634483O812573r17683l432979
418B79575825m593601k081872P714978Q025875J54037m344940j1065979r187927M171142
427B68367538O659508m79698J31111Q484135P232189l990898o374111k826443n23567
436B76679764M502296L553620n435715n503655L411541M100094k425689l005257J621723
445B77498722J252174m090557m300117J93138J001587r65595r57489l71457J627923
454B70888329P698783O370049l366222o008397m614582k455463L148785M746189L026962
463B79434433K680321K712478K406121K246380J006603k080441k722034j319161n63144
$$ y = [258800030, 269896278, 284613380, 287783623, 287650108, 287019730, 287031898, 291393757, 295206299, 294080963, 290191650, 283269882, 276253471, 271654854, 270479431, 277113914, 283926487, 283008804, 279575825, 274982224, 272900352, 280615330, 288641205, 288795242, 284450302, 273384323, 264196396, 268367538, 275027046, 274547348, 274678459, 283162594, 290394783, 286403885, 280029774, 277203331, 276679764, 281182060, 284735680, 279299965, 273796310, 277207851, 281307945, 278882256, 275876999, 277498722, 278750896, 274660339, 270360222, 270553360, 271554947, 270589352, 269631863, 269260406, 270888329, 278587112, 284957161, 281590939, 275582542, 270967960, 268512497, 271661282, 276407471, 279434433, 282114754, 284827232, 287233353, 289479733, 290486336, 288405895, 285683861, 284364700, 283801556]
472B83801556J67369J078377L130417K272148k873668k750149K628555L759155K167454
481B93381214J252651M77r33399j840134k213478k854576j068344N182266N051842
490B95958519j742363l227005j735191R2010N414257M233113m887810o205082j421681
499B86478767N28794K334137K176284o82830j475582p29809j103401l072739k074947
508B82378674K795467L353119j80741n07106J631488J905938J388778J16578l149491
517B89732704l490696j239071J4553J648198J737346K40574p55081k562752k017975
526B83307800K078286J763572l234615l864040j521111L25909L881206L795624m06265
535B86126366j476994l70273n21660j602879j494884m95682M64210K290955K287159
$$ y = [283801556, 283968925, 285047302, 288177719, 290449867, 287576199, 284826050, 287454605, 291213760, 293381214, 294633865, 294634342, 293700943, 291860809, 289647331, 286792755, 285724411, 290906677, 295958519, 294216156, 290989151, 289253960, 289345970, 294760227, 298993340, 294105530, 287900448, 286478767, 287007561, 289341698, 291517982, 290835152, 289359570, 288629761, 287526360, 284453621, 282378674, 285174141, 288527260, 288346519, 287839413, 289470901, 291376839, 292765617, 292882195, 289732704, 286242008, 285002937, 285017490, 286665688, 288403034, 288643608, 287888527, 285325775, 283307800, 285386086, 287149658, 283915043, 280051003, 278529892, 278855801, 282737007, 286532631, 286126366, 284649372, 284279099, 283757439, 282154560, 280659676, 280163994, 280628204, 282919159, 285206318]
544B85206318L01609l65982k93503m68960l28064j141548m031181l242245K038002
553B77674446K802601k86808q71658k633J62125j14212K70844J595745J642475M96139
563B83369064L3856O2942n23815j931190k234211j916886r71317J475563J920242P73659
573B80057907j05629j613617k026062j646290r85393Q48064P97749j443138j591683
582B72291908j06811N62172J192588J121979L34511m44183k016774j900672O0081P56741
592B71851540P88211Q66642Q82874N61714n73387l42865J214027K074967L298035K669582
602B83291340l38555j399993j108170j418819k385636j840820N70068J259308N92232
611B77220955O93817J345387J294841N77927L03516K20299K21500N23320L65734n16663
$$ y = [285206318, 285507927, 285141945, 284848442, 284379482, 284051418, 282909870, 278878689, 275636444, 277674446, 280477047, 280190239, 279318581, 279315948, 279478073, 279363861, 279634705, 281230450, 282872925, 283369064, 283402920, 283465862, 282942047, 281010857, 278776646, 276859760, 275888443, 277364006, 279284248, 280057907, 279952278, 278338661, 276312599, 274666309, 273680916, 274528980, 275326729, 273883591, 272291908, 272185097, 272747269, 273939857, 275061836, 275396347, 274952164, 272935390, 271034718, 271094799, 271851540, 272639751, 273506393, 274389267, 274950981, 274377594, 274034729, 275248756, 277323723, 280621758, 283291340, 282952785, 281552792, 280444622, 279025803, 276640167, 274799347, 275369415, 276628723, 277220955, 277914772, 279260159, 280555000, 281132927, 281436443, 281656742, 281878242, 282401562, 282767296, 282250633]
621B82250633l05633J179924J395225P89414J07765j500130j378555P85370J081218
630B84405231J60923o73294k495040k315293n5065R80625J984596J487008j235733
639B82243958j820317r12666k94438Q41599J046181K74906J52588K20299O85691K262364
649B84700165J887073p43389j354694m08879l35693p42454p72934n62210m27704l88871
659B80850410n3176O46362J047611M71592K293816J0141620O126881j3426552j5927315
668B72171249m647712R08851P390023P705917L84331j596928o11305j44005J057148
677B82617569J465797J338005J175652Q57105L67165n84355q22563o88553M311K064705
687B87794838K069225n2700n97000O5346k89459j944542j544457Q16097K158642L938675
$$ y = [282250633, 281945000, 283124924, 284520149, 285309563, 285417328, 283917198, 282538643, 283324013, 284405231, 284566154, 283892860, 281397820, 279082527, 279027462, 280008087, 281992683, 283479691, 282243958, 280423641, 279510975, 279216537, 280058136, 281104317, 281379223, 281531811, 281752110, 282437801, 284700165, 286587238, 285843849, 284489155, 284080276, 283744583, 283002129, 282229195, 281666985, 281239281, 280850410, 280797234, 281443596, 282491207, 282962799, 285256615, 295398235, 301525116, 288098564, 272171249, 267523537, 268432388, 275822411, 283528328, 283912659, 282315731, 281704426, 281560421, 282617569, 284083366, 285421371, 286597023, 287454128, 287821293, 287236938, 286414375, 285725822, 285730133, 287794838, 289864063, 289811363, 289214363, 289279709, 288990250, 287045708, 285501251, 286317348, 288475990, 292414665]
697B92414665L310433m56086j596679j055966q20636l37830J64261R74884J163483
706B93760529P22656O11782P27901N22118j88103j24454R21497Q35419n97000m06514
716B96785831J618634J661300k28176m34170P21474R10759P38850J12057j825333j558533
726B98502693J118412J865387J464844J123428L26634p4158k76794l41416j19934j48048
736C03441048m76361l68824J32065M59442R03130Q67615L13263o905m06494l86009
746C04471970Q2969L84560R00993P18842l95775n95093k73704K96592J994839J574268
756C09160461j366615j976471q10394m99954n78175k85149M67053N66482O4850j34220
766C04607868l16868k42233K88010K39143m22249n31196m29383Q3695J441707J707077
$$ y = [292414665, 295725098, 295269012, 293672333, 292616367, 291795731, 291457901, 291622162, 292597046, 293760529, 294483185, 295094967, 295822868, 296344986, 296156883, 296032429, 296953926, 297789345, 297192345, 296785831, 298404465, 300065765, 299837589, 299403419, 300124893, 301035652, 301774502, 301886559, 300061226, 298502693, 299621105, 301486492, 302951336, 304074764, 304401398, 304327240, 304050446, 303709030, 303589096, 303441048, 302964687, 302595863, 302727928, 303187370, 304090500, 304958115, 305271378, 305264473, 304857979, 304471970, 304554939, 304939499, 305840492, 306559334, 306163559, 305568466, 305294762, 305591354, 307586193, 309160461, 307793846, 305817375, 305006981, 304507027, 303928852, 303643703, 304110756, 304677238, 304742088, 304607868, 304291000, 304048767, 304336777, 304575920, 304153671, 303622475, 303193092, 303276787, 304718494, 306425571]
776C06425571J108876O68068k31037j49022R88503J441460J831054J410027j78585
785C13314915p60079q31852n81493M31061O29673K11715l7193m95205m35123J37577
795C11583996N14984J090050R97791P7705j64737J08471L7689k63939l89576n62420
805C13030014k96841Q19683O50406j046180j168480M1961M47502N15938N12352L7689
815C13544044M21029K109069J983147j0719n41210k01226M9115P22160P27425J26838
825C18929672k37942n53836r14822j715660j285553O65665J303672J268387Q30899
834C18290482p99180p34100J064530J553306J342049J031875K50359j15891l16123
843C21567307k40822K72522M64668O20842L59535p75070n79376J190910J352539J29471
$$ y = [306425571, 307534447, 308202515, 307971478, 307822456, 308810959, 310252419, 312083473, 313493500, 313314915, 312554836, 311722984, 311141491, 311572552, 312202225, 312413940, 312376747, 311881542, 311446419, 311583996, 312098980, 313189030, 314186821, 314264526, 314099789, 314208260, 314245949, 313982010, 313592434, 313030014, 312733173, 313552856, 314203262, 313157082, 311988602, 312030563, 312478065, 312994003, 313506355, 313544044, 313965073, 316074142, 318057289, 318046570, 317505360, 317304134, 317353249, 318075409, 318802834, 318929672, 318691730, 318137894, 317223072, 315507412, 314221859, 314887524, 316191196, 317459583, 318290482, 317491302, 316757202, 317821732, 319375038, 320717087, 321748962, 321999321, 321883430, 321567307, 321326485, 321599007, 322063675, 322684517, 323044052, 322268982, 321689606, 322880516, 324233055, 324362526]
853C24362526j91689q3923N5313P15256L33557j317291j768341j518708j041679J59988
863C19705009N67894N14527J85737q89091j014214k05764r5368n88169m35352L63121
873C18108330N55992L54996J64508k94208l12080Q7966K88239N08804M87328J48544
883C20098419N2414Q4419J41144K55585L96004P22198O24390Q8958k22473p27386m17252
894C21096420J044770J300087P13806J84059q57582j037598m12712j31111J01547K53944
904C22255630M12674K59400n14488l59764Q23478J086235P10488N15480L09677L6964
914C25535774m94957m63943J03454M87824J067848J046906L25431R6093J64756J12763
924C27981949J12991j09176o96640q05893n90783k79426M44183N44052M9363j23749
$$ y = [324362526, 324170837, 324086914, 324142227, 324857483, 325191040, 323873749, 322105408, 320586700, 319545021, 319705009, 320272903, 320787430, 320973167, 320084076, 319069862, 318864098, 318768730, 318180561, 317745209, 318108330, 318664322, 319019318, 319183826, 318889618, 318577538, 318665504, 318953743, 319462547, 319949875, 320098419, 320150833, 320235252, 320376396, 320631981, 321027985, 321750183, 322374573, 322463531, 322241058, 321513672, 321096420, 322141190, 323441277, 324155083, 324339142, 323481560, 322443962, 322031250, 321900139, 322001686, 322255630, 322668304, 322927704, 322413216, 322053452, 322876930, 323963165, 324673653, 325189133, 325498810, 325535774, 325040817, 324576874, 324680328, 325168152, 326236000, 327282906, 327608337, 327704430, 327869186, 327981949, 328094940, 327985764, 327289124, 326483231, 325892448, 325613022, 326057205, 326601257, 326650620, 326526871]
934C26526871j08948k87285p39097p65343l56674k50321k40326m13894r85146j010666
944C21369171m47502m10805p69386r33876j125336j049995n26657n76515j277428j297722
954C12953949p60555n05696l03974k32696l68119l28064j07765j08967l08036l98140
964C09531937n96543l44276O06079P04765j3351j40438K56290L6240j024952q89301
974C08126450N88188P89146L109l12099m53701o91891j057854j158256r67484r81102
984C03884506j200199j127491p09534o58989r16938j008988j091957j015663p29561
993B95425186n87711m44164n28832j019936r78012l18279l18775q96912j107216j182556
1003B88042793j139183q19664q39729j313210j169433m11263j01089Q2722q6537r07898
$$ y = [326526871, 326417923, 326130638, 325391541, 324626198, 324269524, 324019203, 323778877, 323364983, 322379837, 321369171, 320921669, 320510864, 319741478, 318807602, 317682266, 316632271, 316105614, 315529099, 314251671, 312953949, 312193394, 311687698, 311383724, 311151028, 310782909, 310454845, 310347080, 310238113, 309930077, 309531937, 308935394, 308591118, 309197197, 309901962, 309888611, 309748173, 310004463, 310040703, 309015751, 308126450, 308714638, 309503784, 309506893, 309194794, 308741093, 308049202, 306991348, 305833092, 304865608, 303884506, 302684307, 301556816, 300847282, 300188293, 299271355, 298262367, 297170410, 296154747, 295425186, 294837475, 294393311, 293864479, 292844543, 291866531, 291548252, 291229477, 290332565, 289225349, 288042793, 286903610, 286083946, 285244217, 283931007, 282761574, 282350311, 282249222, 282331944, 282245407, 281337509]
1013B81337509r59644l37124q2970J17073M8142m51546n20706j99566j89533m80900
1023B78280735m11987j9551J80474L89824L14483m539m38690j451722j317520P2975
1033B75594482N56946O18687M81853k28176k40326L87192O15120Q20160N33352m57306
1043B78681984q36830r33895p51973p5569K36016N24768K79675q29945r72747l70503
1053B74950981L2425O70662P49130K68688K0733k98729k67505K15053L23067K21481
1063B76885986P3662l35197l12348K16255K58675j39694j69296R3460J43299Q0108
1073B76794910Q107k66552p3910P67937Q60939K58674J41144L16620L72181M81853
1083B79661903L59288k02885r1095R55124P78904p16915r87053l33557r7046J23520
$$ y = [281337509, 280377865, 280040741, 279957771, 280074844, 280122986, 279671440, 279150734, 278951168, 278761635, 278280735, 277868748, 277849197, 278029671, 278419495, 278733978, 278729439, 278290749, 276839027, 275521507, 275594482, 276151428, 276770115, 277251968, 277023792, 276783466, 277170658, 277785778, 278605938, 279139290, 278681984, 277845154, 276911259, 276159286, 276083717, 276319733, 276844501, 277124176, 276294231, 275321484, 274950981, 274983406, 275654068, 276403198, 276671886, 276692619, 276393890, 276126385, 276341438, 276664505, 276885986, 276959648, 276624451, 276312103, 276528358, 276787033, 276647339, 276478043, 276571503, 276714802, 276794910, 276803017, 276536465, 276462555, 277230492, 278091431, 278350105, 278491249, 278807869, 279180050, 279661903, 280021191, 279818306, 279727211, 280682335, 281461239, 280744324, 279757271, 279423714, 279326668, 279450188]
1093B79450188O2694m29859m86870k00500p2251Q2512K6455k64168m57058p90824o46820
1104B76273499N1727L75976O41117N13554k73933l19023K01473N90076J281281J235008
1114B80570755L03497J16577M10328O08921R88732J018753P82242M76608k38895k02179
1124B84835339O53514Q95501P98225O94981M43458K79427Q3923R4662M31061L77407
1134B89587498j31855j19667K69165O34918J407127J267205J65214l83606r40094p77473
1144B90978432L91483O89983M75159J94092m76380o93073p52697l11851J136322J219749
1154B92851219M7436m47750r87053o18706J132508J410942N41935P8449p00722m66347
1164B92841911J050721J443367J115798Q54989K20050J87397O95229J013031J503715
$$ y = [279450188, 279512882, 279083023, 278596153, 278395653, 278323402, 278405914, 278432369, 278168201, 277711143, 276920319, 276273499, 276325226, 276701202, 277342319, 277855873, 277581940, 277262917, 277464390, 278054466, 279335747, 280570755, 280874252, 280990829, 281401157, 282010078, 282998810, 284017563, 284799805, 285276413, 285037518, 284835339, 285488853, 286384354, 287182579, 287877560, 288321018, 288600445, 288684368, 288779030, 289210091, 289587498, 289455643, 289335976, 289605141, 290240059, 291647186, 292914391, 293079605, 292695999, 291755905, 290978432, 291369915, 292059898, 292535057, 292729149, 292252769, 291559696, 290806999, 290495148, 291631470, 292851219, 292898655, 292450905, 291463852, 290845146, 291977654, 293388596, 293930531, 294008980, 293308258, 292841911, 293892632, 295335999, 296451797, 297306786, 297526836, 297714233, 298409462, 299422493, 300926208]
1173C00926208J446000O90956N55744Q44955J021138J386184J269341N33562L97930
1182C09072018P91301P77741L11127N09033J610031J538753K89917m3392J94073K85625
1192C15336227O00338L77655o25133o78787J70955L74546K51065P1048l02085n92690
1202C14983139j098404r06219J64260M77562M36535O2466j068592j284351p62482m68006
1212C10535908N7220n6267q85009j254788j549492j407623o45637l61672l52859l34282
1222C03745499m22936m35829l79562m13666m89464o41823r65843j048565j026153p68662
1232B97152996l6488Q0357m60873m00543K12670L11622j7166n4836K64873m3621j393795
1243B95615196j146545Q87623J308441O12507K12898m96388n05199L01819M50859J92165
$$ y = [300926208, 302372208, 303063164, 303618908, 304463863, 305485001, 306871185, 308140526, 308674088, 309072018, 309863319, 310641060, 310952187, 311461220, 313071251, 314610004, 314899921, 314856529, 315050602, 315336227, 315936565, 316314220, 315689087, 315010300, 315181255, 315555801, 315806866, 315877914, 315575829, 314983139, 313884735, 312978516, 313142776, 313620338, 314056873, 314119339, 313050747, 311766396, 311003914, 310535908, 310593128, 310536861, 309651852, 308397064, 306847572, 305439949, 304794312, 304432640, 304079781, 303745499, 303322563, 302886734, 302507172, 302093506, 301604042, 300962219, 299996376, 298947811, 297921658, 297152996, 297116508, 297196865, 296735992, 296335449, 296548119, 296859741, 296842575, 296787739, 297052612, 297008991, 295615196, 294468651, 295356274, 296664715, 297277222, 297490120, 296993732, 296488533, 296790352, 297241211, 297433376]
1253B97433376k861m75635l34988O64959O49204l67870n71022j44959j69029n83191
1263B96097984n51681j69049J06812M84219N86280L58811L92914O39686P00226P20520
1273B99366722N15938r1095k05994R7771K17190L18279L37372J26610L39508J236915
1283C02259216J120320q7738l79315l4103N6267O5803J89057M75425N31426M31785
1293C04628143K69642q7261k04086j31131j03244l2177l6717j67618j05609K42939
1303C04272881J82876k59170m95663p45297p21702m78249q8463P92504Q57353J10626
1313C03427696j60942k42939k82287k07901j59741o6757p5817k41757k00748N1975
1323C01840782J29929M2915J36623M06971N22614N48611N54790M80423M99001O17523
$$ y = [297433376, 297430515, 296954880, 296619892, 297284851, 297934055, 297566185, 296995163, 296850204, 296681175, 296097984, 295546303, 295377254, 295484066, 295968285, 296554565, 296913376, 297306290, 297945976, 298646202, 299366722, 299882660, 299791565, 299585571, 299683342, 299900532, 300218811, 300556183, 300682793, 301022301, 302259216, 303379536, 303291798, 302912483, 302878380, 302934647, 303000450, 303189507, 303664932, 304196358, 304628143, 304897785, 304810524, 304606438, 304475307, 304372063, 304339886, 304303169, 304135551, 304029942, 304272881, 304455757, 304196587, 303700924, 302955627, 302233925, 301755676, 301667213, 302459717, 303317070, 303427696, 303266754, 303023815, 302741528, 302533627, 302373886, 302307129, 302231312, 301989555, 301788807, 301840782, 301970711, 302013626, 302150249, 302557220, 303079834, 303628445, 304183235, 304663658, 305162659, 305780182]
1333C05780182O31561P05490L86238l91006r16977j893749j221905J773834K290497
1342C07144165P38144K77290K62261J14441q8234q1291K32696J97887j55925k92054
1352C08349380k53925m04358r14821p37191K89917M70887L15437n21431k844811l089427
1362C00659657j588574n74360J233807R43908k192020k292881L15914J053333J157761
1371B98716545K55108k893200k959022M997Q78582O44207M90417j66893j80473K26250
1381B95016518P97996K400170J823177j284847k310028k575398j404285K234459L538856
1390B98236618M219761K232304m868012n259514J144161K176037n84106j290817j659851
1399B94346581o76651L066310K923260j286049k198219j013508k96345J140347J110554
$$ y = [305780182, 306411743, 307117233, 307503471, 307112465, 306195488, 304301739, 303079834, 304853668, 307144165, 307882309, 308159599, 308421860, 308536301, 308448067, 308366776, 308599472, 308797359, 308641434, 308349380, 308095455, 307691097, 306776276, 306039085, 306329002, 306799889, 307115326, 306593895, 303749084, 300659657, 299071083, 298496723, 299730530, 300674438, 298482418, 296189537, 296505451, 297558784, 298716545, 298971653, 296078453, 293119431, 293124428, 294003010, 294647217, 295137634, 294970741, 294790268, 295016518, 295814514, 298214684, 300037861, 298753014, 296442986, 293867588, 292463303, 294697762, 298236618, 302456379, 304688683, 299820671, 294561157, 295705318, 297881355, 297297249, 296006432, 294346581, 293669930, 296736240, 299659500, 298373451, 296175232, 295161724, 294865379, 296005726, 297116280]
1408B97116280o54450q95748m3869L62644M53949J245499L979187K669582l263950
1417C00969124n514870o914368m445076N139580N834122k568493l237724K421856L197193
1426B94881344R03129n06649l132572k529621J750717L467312N546570K521038q980274
1435B93920994j0008812j882305J719703N001068M825364l75519j195431J446972J820068
1444B95272102J371880L9329m011383l381977K666722L780117j30406J643181J2138119
1453C09387684Q494129j2093048j5548954n991936j023540M801750P303238P957229
1461C03286552N038033m860649o388436j001815J774540M944553O017456O380310K972145
1470C18162689p558117q745193j266232J121521J061440J737098K515564K743493K818813
$$ y = [297116280, 296461830, 295566082, 295522213, 295884857, 296338806, 297584305, 301563492, 304233074, 300969124, 295454254, 288539886, 284094810, 289234390, 295068512, 292500019, 289262295, 291684151, 294881344, 295784473, 295277824, 292145252, 289615631, 291366348, 294833660, 300380230, 302901268, 293920994, 283912182, 282029877, 283749580, 288750648, 293576012, 293200493, 292005062, 293452034, 295272102, 296643982, 296683311, 292671928, 289289951, 291956673, 295736790, 295606384, 297249565, 309387684, 317881813, 305788765, 290239811, 284247875, 283224335, 288026085, 295329323, 303286552, 308324585, 303463936, 297075500, 296073685, 297848225, 302792778, 308810234, 315190544, 318162689, 310604572, 301859379, 300593147, 301714668, 302776108, 304513206, 307028770, 309772263, 312591076]
1479C12591076J803150j623859j244545L472576M181366K045631P54585l87878k288818
1488C19303284p087708n322227M207611P236957P530918M290848o319771q156776k533455
1497C13149681l43780L04679K735863P599831Q969307J0719299L276329k0547371k2427082
1506C03436756m151344L106823P568607P521877n40733q79059P082939N300522p732391
1515C20713997p948151M592648O064167K0981l932000j1776428r193420P713547R037017
1524C15292358m414558n970478J006126L296852M381180L556252K90165k587567r505977
1533C05344353n579491J3893375J5220166J670837o144028j7184753j6223431l41663
1541B90655365L556252j307240r21001K900581L402252J502266K81811j975537j487960
$$ y = [312591076, 314394226, 312770367, 311525822, 314998398, 319179764, 321225395, 321979980, 321592102, 319303284, 312215576, 306893349, 311100960, 318337917, 325868835, 330159683, 323839912, 315683136, 313149681, 312805901, 313110580, 315846443, 323446274, 332415581, 343134880, 346411209, 325863838, 303436756, 299285412, 302392235, 309960842, 317482719, 316941986, 316062927, 323145866, 328446388, 320713997, 312765846, 317358494, 323422661, 323443642, 319511642, 307735214, 298541794, 306255341, 315292358, 310877800, 304907322, 305913448, 309210300, 313591480, 317147732, 317437897, 314850330, 305344353, 299764862, 313658237, 328878403, 330549240, 324405212, 307220459, 290997028, 290655365, 294211617, 292904377, 291983376, 294883957, 298286209, 299788475, 300070286, 298094749, 296606789]
1550B96606789K798538K885818k393226l72429J3619919Q229026k0686416k5208702
1558B75479317j1712303k618561J2757778J4095306o56128k975940M138221M154931
1566B92662621j96686l304978r648552o927013P732391J0535241N987873j42098j5602569
1575B81096230j5170346K369881O933689L612995K121926q90732j736393n63622m67548
1584B77306080j005879q54034J19705O1035j139640j189480j74046m4346n74588p17392
1594B71787415p72248n91278L4561J19458j23730n63622j682529j685391o03180j08966
1604B65810490L97205J89056j045932j334439j228332m93050J115341K384415O027222
1613B71821976K404213j2418518j3066044p78199M028569P218113N750408l135681
$$ y = [296606789, 299405327, 302291145, 299897919, 299525490, 313145409, 321374435, 300688019, 275479317, 263767014, 261148453, 273906231, 288001537, 287345409, 284369469, 288507690, 292662621, 292465935, 289160957, 279512405, 272585392, 280317783, 290853024, 296840897, 296698799, 281096230, 265925884, 268295765, 275229454, 278842449, 280964375, 280073643, 278337250, 277773628, 277306080, 276300201, 275446167, 275565872, 275626907, 274487267, 273297787, 273123741, 273079395, 272504807, 271787415, 271015167, 270423889, 270458450, 270577908, 270454178, 269890556, 268208027, 266522636, 265919456, 265810490, 266207695, 266396751, 265350819, 264016380, 262788048, 262294998, 263410339, 265794754, 271821976, 274226189, 261807671, 248741627, 247963428, 251991997, 259210110, 264960518, 261824837]
1621B61824837n355339l213654j576424K421151K183666l489494l200531K246151M669895
1630B56510258P174740N522728p58667n542984j4192811j1386642O331444R813309
1638B53471375J497039P77245M920463N465279N356560J275062j1288414j0981083
1646B50493526R18141Q169670K1000862J4740696j7293682k3703346j1873017l663292
1654B38789558J0908356J3769150M798889K550621M514198K177239n606651n742074
1662B66159286J190682M416923Q037568O420860k082825n243778p138958l691216J0155678
1671B78224220J0100136m261742p014732k477417P09057O647358P564297K727260K837677
1680B95056114J0893097M199982k4380684k3600578P199764J4132500N144825K335548
$$ y = [261824837, 256469498, 253255844, 251679420, 254100571, 256284237, 252794743, 249594212, 251840363, 256510258, 263684998, 269207726, 268449059, 262906075, 248713264, 237326622, 243658066, 253471375, 254968414, 255745659, 260666122, 266131401, 271487961, 272763023, 261474609, 250493526, 251411667, 259581337, 280582199, 295322895, 278029213, 254325867, 242452850, 238789558, 249697914, 263467064, 268265953, 270816574, 275330772, 277508011, 271901360, 266159286, 267349968, 271766891, 279804459, 286225319, 284142494, 278898716, 271759758, 268068542, 278224220, 288324356, 284062614, 277047882, 274570465, 275279522, 281926880, 289491177, 292218437, 295056114, 305949211, 310149193, 285768509, 262167931, 269367695, 283500195, 288645020, 290980568]
1688B90980568j194000N1994Q715630Q731346J441955k460479q252373n520344J2251148
1697C04745445Q584976k1562118k1543255P332096J3652554N705585J749993n184632
1705B93480644n475292J636982L491402K108574K065658K471695K311707K689819K01721
1714C04982910o316433q808136j0297775o746292N521526P763863J362343m69704q38032
1723B86154270n34305J669654J651535r57031n61466K971897L512840M308472j502762
1732B96713104k1448135j8560162J0389576J5519371K753487j724701n279312m639855
1740B73723373K355576L786316P89642P35760L109455K599945m41055k111435l986359
1749B80561218l669033j225223J210670O324768N507012l101120l457070L988266M996071
$$ y = [290980568, 289786568, 289838562, 298554192, 307285538, 308727493, 306267014, 298014641, 292494297, 304745445, 313330421, 291768303, 270225048, 277557144, 291209698, 296915283, 298665276, 293480644, 288005352, 289642334, 293133736, 295242310, 297307968, 299779663, 302091370, 304781189, 304982910, 298666477, 289858341, 279560566, 272814274, 278335800, 286099663, 287462006, 286992302, 286154270, 285619965, 287289619, 288941154, 287984123, 287422657, 290394554, 293907394, 298215866, 296713104, 275264969, 256704807, 267094383, 282613754, 285367241, 283642540, 278363228, 273723373, 276078949, 279865265, 280654907, 281390667, 284500122, 287100067, 286659012, 284547577, 280561218, 276892185, 275666962, 276877632, 283202400, 288709412, 285608292, 282151222, 286139488, 291135559]
1758B91135559J807671l06835m791012l141651O719341P976532J773128L51429J528969
1767C03053131J792202L362179Q65707q595009q058300K791157N727539L553162L281345
1776C07773113L942967K401352k703667k796898K715111K880821j948357k230167Q82397
1785C10916672K458076M344940M079361K281647j068344r565582q812676K076626N159626
1794C11870346L473988K808323J681823K28386k463341k883911j379013p7476K293110
1803C15552235K769947J460304Q96950O34193p8697j643181j704216l52611M17957
1812C17952881J481514J333961l76701p40776k26727J28498O00815J120339K573242
1821C23847046J482735l603936l400573K525825L154259l8147j940727n414963m126301
$$ y = [291135559, 292943230, 292636395, 287845383, 284703732, 291423073, 299399605, 301172733, 301524162, 303053131, 304845333, 308207512, 309073219, 300478210, 292419910, 295211067, 300938606, 304491768, 307773113, 311716080, 314117432, 311413765, 308616867, 311331978, 314212799, 312264442, 310034275, 310916672, 313374748, 317719688, 321799049, 324080696, 323012352, 313446770, 304634094, 306710720, 311870346, 315344334, 318152657, 319834480, 320062866, 317599525, 314715614, 313336601, 313259125, 315552235, 318322182, 319782486, 320679436, 321313629, 321234932, 319591751, 317887535, 317534924, 317952881, 319434395, 320768356, 320391655, 319650879, 319424152, 319552650, 320153465, 321273804, 323847046, 325329781, 321725845, 318325272, 320851097, 324005356, 323967209, 322026482, 316611519, 312485218]
1830C12485218L561268M769325N47638m25568K91329K53220o00815M14619M392357
1839C25688591M273911J115798k252120r791127q488407L498783N785465M66805m54407
1848C19843292Q87871J023521O72112M24614N6991j27792k38418j46142L04451L62626
1858C23063126P6294M539j53999K46277J550903J731872J615983p6752n012970n246658
1868C17798615j154423Q23726K812882K749672m4823p93953k97546j34201J36833L29018
1878C22225800N70297N33104K34146o6033r17930l82881K359848K086410j308212k182465
1888C23152084j725464q26110J842498J859665j013755j401177R5596N05906M36325
1897C22925568M29153L27835K14310M0550q5602l01094j66664N59082M69933m08669
$$ y = [312485218, 316046486, 320815811, 321363449, 320937881, 321229210, 321482430, 320881615, 321296234, 325688591, 329962502, 331078300, 328826180, 319035053, 310546646, 314045429, 319830894, 320297699, 319843292, 320731163, 321754684, 322426796, 322851410, 322908401, 322780609, 322542191, 322396049, 322700500, 323063126, 323139420, 323143959, 322989960, 323236237, 324787140, 326519012, 328134995, 328058243, 323045273, 317798615, 316644192, 317467918, 320280800, 323030472, 322985649, 322191696, 321894150, 321759949, 321896782, 322225800, 322796097, 323329201, 323563347, 323497314, 322579384, 322196503, 324556351, 326642761, 325334549, 323152084, 321426620, 320600510, 322443008, 324302673, 323288918, 321887741, 321983337, 322489243, 322925568, 323354721, 323682556, 323896866, 323937416, 323851814, 323550720, 323384056, 323943138, 324413071, 324004402]
1907C24004402p72476j149406p32422P13577J438637K303123J615296j136322k217293
1916C24067116k952576j779556K953987L073235j454583k324600q53043q0833J151543
1925C21800690J246948J10397k81601l87420l51410o7482J84059P48863N24521q64487
1935C22663078q15887O23970J037598J248321L77922k625007k677918K49863R50813
1944C21032753K15797Q7967J26343M9591k25754q5373O39191O57578O2713k30560m84009
1955C21846237n68390n32379l11127K88239M27246J54266J13717L70521J9989j260033
1965C20548286j276016j06811L66459P01198N45960l81928o01768k99950k13623j87149
1975C19094658j08490J5030R8953J98822J74522J6938j00861l11603k59152L0270L05176
$$ y = [324004402, 323231926, 322082520, 321350098, 322063675, 323502312, 325805435, 327420731, 326284409, 324067116, 321114540, 319334984, 322288971, 325362206, 323907623, 321583023, 320729980, 320649147, 321800690, 323047638, 323158035, 322876434, 322489014, 322137604, 322070122, 322254181, 323003044, 323527565, 322663078, 321847191, 322471161, 323508759, 324757080, 325135002, 322509995, 319832077, 320081940, 321032753, 321248550, 321336517, 321462860, 321512451, 321286697, 321201324, 321840515, 322498093, 322560806, 322330246, 321846237, 321277847, 320745468, 320434341, 320722580, 321149826, 321304092, 321417809, 321788330, 321808319, 320548286, 319272270, 319165459, 319531918, 320233116, 320779076, 320397148, 319795380, 319495430, 319281807, 319094658, 318986168, 319001198, 319100151, 319298973, 319473495, 319490433, 319389572, 319077969, 318818817, 318849087, 319154263]
1986C19154263R99698O28929j048317j583099j642456j010437J017818J403809M09832
1995C18330040K3842l15895l54042n3654J78814O85215N01156o46591p03087L03726
2005C17949524M27494q8692k73456l34511m16031o49452l67661P64389P37896m63733
2015C17285767p66507o17027l03516N85098O92596R4414j56631l37143l96233k98748
2025C15782070k37942j71890p4882J34010J04408k16236k68230j03226p7724j90259
2035C14680099r0370K69661L46661K71797O1283m95205n75542k59629n2452K46754
2045C14403057L39260K66571J59722r2259j77860q8463j73073n22156m25338K27928
2055C13917389K84691k17686k77042n6267R4185M37965K67258n82695p44820m38442
$$ y = [319154263, 320153961, 320782890, 319734573, 318151474, 316509018, 315498581, 316516399, 317920208, 318330040, 318353882, 318037987, 317683945, 317630291, 317809105, 318494320, 318995476, 318348885, 317645798, 317949524, 318377018, 318288326, 318014870, 317680359, 317264328, 316614876, 316247215, 317011604, 317749500, 317285767, 316519260, 315902233, 315598717, 316183815, 316876411, 316970825, 316814194, 316477051, 316080818, 315782070, 315544128, 315372238, 315297356, 315431366, 315535774, 315319538, 315051308, 314948082, 314870358, 314680099, 314589729, 314859390, 315206051, 315477848, 315539131, 315043926, 314468384, 314208755, 314156303, 314403057, 314742317, 315008888, 315168610, 315076351, 314898491, 314810028, 314636955, 314114799, 313689461, 313917389, 314202080, 313984394, 313707352, 313651085, 313745270, 314183235, 314450493, 313867798, 313122978, 312684536]
2065C12684536j54495M63733M79699j49975l15190k21977j59969q7986J17550O76861
2075C13332787N81741k76795m56085j28994m9343o8436l0517Q6555L8376k05269k82058
2086C12541962k45095k47001l15895j89782J69507L45230N34057L65505l48587m88739
2096C12121162j44252p7725j91917j16596K15530J62601l19004m13646k44389j35422
2106C10856342L2425J02997J09196P5340k6703j11580k66075k30064N1250R6798n6743
2117C10633183p7000l1014J5259J33057J02272j01090j62601j43299j14441n9128K5997
2128C10221195K48203J74981k97299l23772M4822J65215K42481R6321m38938n23796
2138C09609413k63691p7247K53677K74181o5326j12057P1525Q2245l8376n4130J5030
$$ y = [312684536, 312530041, 312993774, 313473473, 313323498, 313008308, 312786331, 312626362, 312538376, 312655926, 313332787, 313914528, 313637733, 313181648, 313052654, 313003311, 312934875, 312904358, 312990913, 313029289, 312824020, 312541962, 312296867, 312049866, 311733971, 311544189, 311713696, 312058926, 312592983, 312958488, 312609901, 312121162, 311976910, 311899185, 311707268, 311590672, 311806202, 311968803, 311649799, 311236153, 310991764, 310856342, 310888767, 310991764, 311100960, 311176300, 311149597, 311038017, 310771942, 310541878, 310593128, 310689926, 310633183, 310556183, 310525169, 310540428, 310673485, 310775757, 310674667, 310512066, 310368767, 310254326, 310195198, 310221195, 310469398, 310644379, 310347080, 310023308, 310068130, 310233345, 310475826, 310572147, 310133209, 309609413, 309345722, 309268475, 309522152, 309796333, 309731007, 309618950, 309690475, 309772720, 309734344, 309680214, 309695244]
2149C09695244J1215j8368j04904l43075l23791k7886N7450R784L109k4795K29J02272
2161C09036484J10397P6523l9558l62168l57151k7904J04446J70937J67369O3649j8826
2172C08924198j38759j84536j84308j37558j0013N7468J28975Q7261j65462j21117
2182C08256149K81563K89688l2425j89781l46413l43570j93596q831L99132L89099
2192C08501015q2016k02179r1324q2016q9645j22796k16941k23885j74294r4871K1210
2203C07142258J69983M68502M52747J12305m9115j96704j75934R1552J34697J7891
2213C08168182m8637j63078j43299P1277N6267k01454k25544p7000J1673J42098J40667
2224C07731152l0270m9839R2754L0976k93236k83489P5817J24454o9866j17760j42822
$$ y = [309695244, 309706459, 309688091, 309583187, 309240112, 308916321, 308888435, 308945885, 308955669, 308958778, 308933983, 308934212, 309036484, 309146881, 309223404, 309183846, 308821678, 308464527, 308436623, 308541069, 308712006, 308879375, 308943024, 308924198, 308785439, 308600903, 308416595, 308279037, 308269024, 308326492, 308455467, 308542728, 308377266, 308256149, 308537712, 308827400, 308794975, 308605194, 308258781, 307915211, 307721615, 307712784, 308111916, 308501015, 308418999, 308216820, 308125496, 308043480, 307953835, 307831039, 307614098, 307390213, 307215919, 307121048, 307142258, 307312241, 307780743, 308233490, 308345795, 308296680, 308099976, 307924042, 308015594, 308150291, 308168182, 308119545, 307956467, 307813168, 307884445, 307940712, 307739258, 307513714, 307436714, 307448387, 307590485, 307731152, 307700882, 307651043, 307743797, 307774773, 307481537, 307198048, 307273865, 307398319, 307328453, 307210693, 307067871]
2235C07067871m3640K84691L19938J04199r060j82381j21364K57969L22342J86691
2245C08187256K0981l42141m04586k20795p4139J90487K36054Q8691k1476k64397j93596
2256C07202339K78950L54519J08013L5038K5520K4567P8907N5790j183j33762m15096
2267C07613602n10922n50747l51429K89440L76225j4782j95026l83854l94593k27203
2277C05650711o8664J32560L56198P58648P34806K33898O1741O8912M7436J07059J6919
2288C08100224k74907l30200k24590r7027J79749K32467O8188K8610p152J02272M63485
2299C08241119N05696K47478J82877K01225K47459M22726L75271Q6555j9321O3419
2309C10554504j12762q39233n06173J007080J606465J927852J520634K5501o72798
$$ y = [307067871, 307024231, 307308922, 307628860, 307733059, 307723999, 307541618, 307420254, 307678223, 308000565, 308187256, 308208237, 307866096, 307461510, 307240715, 307166576, 307357063, 307593117, 307681808, 307660332, 307395935, 307202339, 307481289, 307835808, 307943821, 307978859, 308004379, 308028946, 308107853, 308163643, 308162460, 308028698, 307613602, 307102680, 306551933, 306200504, 306489944, 306866169, 306851387, 306656361, 306272507, 305877914, 305650711, 305582047, 305714607, 306070805, 306829453, 307564259, 307798157, 307859898, 307928810, 307976246, 308083305, 308100224, 307825317, 307495117, 307270527, 307173500, 307353249, 307585716, 307653904, 307682514, 307675362, 307777634, 308241119, 308746815, 308994293, 309177170, 309378395, 309625854, 310048580, 310423851, 310510406, 310491085, 310554504, 310441742, 309602509, 309096336, 310103416, 311709881, 313637733, 315158367, 315183868, 314511070]
2318C14511070p93228j348266k684594k403011l87669M99001J152038Q53787q17299
2327C08581829j458874j717338j410713j65940L40920O84509K41508j530151j842270
2336C01723480p94182p78904j056919k193908m435788o236553j0474434p185230M277477
2345B72845039J1361122J9771081J9238014Q712539K657853l670922n759697k625465
2353C22529564k717514n091171n078564k947331k295494k366790k589684l389130l638744
2362B92415142l675461l280887k146473j728306j935711j675606j263370n31197R57489
2371B77135620J285305N16892L10897J85719M09374R95388J619339K644310K941857
2380B88044701K641906K351036J836319J421433R57031P15485P56492N69115J37100
$$ y = [314511070, 313717842, 312369576, 309684982, 307281971, 306894302, 307393303, 308545341, 309399128, 308581829, 307122955, 305405617, 303994904, 303828964, 304169884, 304854393, 305095901, 303565750, 301723480, 300929298, 300150394, 299093475, 296899567, 292463779, 286227226, 275752792, 268567562, 272845039, 284206161, 303977242, 323215256, 331927795, 334585648, 330914726, 325155029, 322529564, 319812050, 314720879, 309642315, 306694984, 304399490, 302032700, 299443016, 296053886, 292415142, 288739681, 285458794, 283312321, 281584015, 279648304, 277972698, 276709328, 276178131, 277135620, 278420925, 278937817, 279248714, 279434433, 279843807, 280839195, 282458534, 285102844, 288044701, 290686607, 293037643, 294873962, 296295395, 297252426, 297967911, 298724403, 299293518, 299430618]
2389B99430618L4790K68936K36054j6213p5836P878J7414k1477M063R4890J34468K23389
2401C00338974P5111m66346m93775m7912J27315K36263K05040k5749j46141k64168
2411B99538612k61306j30425k1438K13127J30424m15077l99838J56155L08762K60124
2421B99379120J42097j88121k92073k27203k02179j57585j23520p5798q1310k06471
2431B97966957j20163K30560L00160K36988p401p15961p11441L8147K26726J05153
2441B97549725k4796l74317m02680r7274n2948k00978k21252j91441j24225R5119J9570
2452B95974503m58260m65393l815O1531k02903j99090L2197N4588l8147j86672n52655
2463B94015884n49545k00767K48K35805K69165Q5602k2431j53541k08130j90010j84307
$$ y = [299430618, 299465408, 299734344, 299970398, 299954185, 299878349, 299886227, 299903641, 299882164, 299886227, 299981117, 300115585, 300338974, 300414085, 299947739, 299453964, 299406052, 299533367, 299769630, 299974670, 299948921, 299802780, 299538612, 299277306, 299146881, 299125443, 299338570, 299468994, 299053917, 298654079, 298810234, 299118996, 299379120, 299521217, 299333096, 299041023, 298813820, 298611641, 298454056, 298330536, 298254738, 298173428, 297966957, 297846794, 298077354, 298377514, 298614502, 298607101, 297891140, 297179699, 297217846, 297444572, 297549725, 297524929, 297150612, 296747932, 296650658, 296597710, 296396732, 296175480, 295984039, 295859814, 295954933, 295974503, 295516243, 295050850, 295047035, 295108566, 294905663, 294706573, 294738770, 294793358, 294755211, 294568539, 294015884, 293466339, 293265572, 293265820, 293501625, 293770790, 293856392, 293833961, 293680420, 293472290, 293282280, 293097973]
2474B93097973j44959j71661k83718l06358k95182k04086M1733R5844l1223l7442P0572
2485B91831493J5507k11010k98252k96135l17802m03881k82288J48525K06948p4387
2495B90318718j45912j11580j07765j63307k8134M57287M01974k31495m02947k80838
2505B89706001k33192j47572j06106j19209o4125P7725J08242M3144J5507K8610o4373
2516B89244652l25432l60031k07653j04656L7899R7751Q9874P4158M2439l5763k07176
2527B88346062k57035k05497j89324k20756j15643K00749K45819K9316n722J39236
2537B87967205K5749m05788m79469k86561j38282J38511J59264j00136j60217j19934
2547B86600342o3400J49955M0531n17368n43365n5066L4810k10038j34010K83737L04451
$$ y = [293097973, 292953014, 292781353, 292497635, 292191277, 291896095, 291692009, 291733742, 291829586, 291798363, 291760921, 291831493, 291847000, 291635990, 291337738, 291041603, 290723801, 290319920, 290037632, 290186157, 290393105, 290318718, 290172806, 290061226, 289953461, 289790154, 289762020, 290219307, 290621281, 290389786, 289986839, 289706001, 289472809, 289325237, 289219131, 289099922, 289035797, 289113522, 289221764, 289264908, 289280415, 289309025, 289244652, 288919220, 288559189, 288351536, 288246880, 288284779, 288382530, 288472404, 288546562, 288589001, 288553238, 288346062, 288089027, 287883530, 287694206, 287473450, 287357807, 287558556, 287804375, 287833691, 287827969, 287967205, 287992954, 287587166, 287107697, 286821136, 286682854, 286821365, 286980629, 286880493, 286720276, 286600342, 286536942, 286686897, 286727428, 286210060, 285666695, 285611629, 285646439, 285436401, 285302391, 285586128, 285890579]
2558B85890579o5326j14689R4185R7045m4117j13964j15871k53677o44932o15826j49975
2569B83963432J0987O3171l6240m96635m37965J65939L29742K53678J19209k64168
2579B83671150l16162n1002P133j2627j05133m01039l84330l8147N2948l6965k0504
2590B82365322O3648Q0357N5065J7662r7523o0787J94302J69048j49498k11716n8174
2601B82367706p9155k79655k52266O6299J2627m72069m90417r6569K6703M4117k3613
2612B80823708k86103l27110k37942p2002L46184L67889M3869j80016n61485n16395
2622B79400597O9618J54247j93596k07653L4085P5588L566p5092k27699k93503l13511
2633B78426647k85854j84307j18008k0752m9591l00178k33403J84536K77996J77384
$$ y = [285890579, 285825253, 285710564, 285804749, 285901794, 285857677, 285743713, 285627842, 285374165, 284729233, 284113407, 283963432, 283974419, 284037590, 284001350, 283504715, 283066750, 283232689, 283562431, 283816109, 283935318, 283671150, 283354988, 283303986, 283311119, 283298492, 283193359, 282792320, 282407990, 282369843, 282422791, 282385826, 282365322, 282428970, 282509327, 282564392, 282582054, 282484531, 282423744, 282618046, 282787094, 282637596, 282425880, 282367706, 282288551, 282008896, 281756630, 281822929, 281835556, 281363487, 280873070, 280776501, 280803204, 280847321, 280823708, 280537605, 280210495, 279972553, 279900551, 280246735, 280614624, 280658493, 280478477, 279916992, 279400597, 279470215, 279624462, 279430866, 279223213, 279257298, 279332886, 279336452, 279261360, 279033661, 278740158, 278426647, 278140793, 277956486, 277838478, 277817726, 277768135, 277467957, 277234554, 277419090, 277697086, 277874470]
2643B77874470L6487k78968l86239l52611k94438j35917o4354R54p8450m48932l89595
2654B75482407J64032K29835r6321k17190k82535k92778k16236j80951j75247j20163
2664B74294853L8147K384l28064k55336K20298M00544M75158L80993M5777j79539n01137
2675B74594078m47769J07307J85013r9907k28653m00295l40939M3869J02044p3204
2685B73441544k05994m29154m90188m73976k95639K10056K93732K613j03703k02656
2695B71746635j46637J35193K09580K27203J5984o14166p31965m41551k60582L4104
2705B70173798O7463k49386j88351K89440K97318j70708k04334J65691J49269k27699
2715B70102501k81105j17054L567K80151J75247m01039n52883m89483k72255L55225
$$ y = [277874470, 277910957, 277631989, 277245750, 276893139, 276598701, 276462784, 276398430, 276399384, 276320934, 275872002, 275482407, 275646439, 275876274, 275779953, 275562763, 275280228, 274987450, 274771214, 274590263, 274415016, 274294853, 274333000, 274335384, 274007320, 273751984, 273972282, 274372826, 274847984, 275228977, 275274754, 275095215, 274594078, 274146309, 274253616, 274438629, 274338722, 274110069, 273709774, 273368835, 273412704, 273514748, 273441544, 273235550, 272806396, 272316208, 271842232, 271546593, 271756649, 272050381, 272052994, 271949291, 271746635, 271599998, 271735191, 271944771, 272171974, 272187958, 271573792, 270841827, 270400276, 270139694, 270173798, 270241261, 269991875, 269803524, 270092964, 270390282, 270219574, 270015240, 270180931, 270330200, 270102501, 269821396, 269704342, 269707909, 269988060, 270163307, 269762268, 269209385, 268719902, 268447647, 268802872]
2725B68802872M28199K8611k07901n86510n25703O0081K44618K36988J25885k55108
2735B68352032l29018j54018p6771M5071j3848l52363l52860r9182J26591N68142N33104
2746B68246880l4333k21958k44617j58081K28881K05994k18849l68843m10805l56674
2756B66667595j03455n3177j76200j90010j75705r1324J87645J18007m24862m00314
2766B65358200K02675K96097P25p9632m2439j02043k65598k91119k26021j23729J35669
2777B64862785J24932j61667k76070l74336k80609P1754K40097L98636K91348j96705
2787B64700165l50456k55585k84443m33674l47137p878J59970K84443K76088J01090
2797B63842583j6213j13487k66800n54314n89847l48797l17822n02586l96480L4084
$$ y = [268802872, 269231071, 269259682, 269051781, 268465271, 267939568, 267999649, 268244267, 268481255, 268607140, 268352032, 268023014, 267868996, 267792225, 267837296, 267823448, 267471085, 267118225, 267019043, 267145634, 267713776, 268246880, 268212547, 267990589, 267745972, 267587891, 267816772, 268022766, 267803917, 267435074, 267024269, 266667595, 266564140, 266510963, 266334763, 266144753, 265969048, 265877724, 266065369, 266183376, 265758514, 265358200, 265560875, 265856972, 265857697, 265778065, 265735626, 265633583, 265367985, 265076866, 264850845, 264727116, 264862785, 264987717, 264826050, 264549980, 264175644, 263895035, 263966789, 264206886, 264605522, 264896870, 264700165, 264349709, 264094124, 263809681, 263376007, 263028870, 263020992, 263180962, 263465405, 263741493, 263842583, 263826370, 263712883, 263446083, 262891769, 262301922, 261953125, 261635303, 261132717, 260736237, 260770321]
2807B60770321J48067K9564j8615n7927j46389l90777l06835K25544K40802k31495
2817B60262260l46679k54135k04087q5601r3461k48432k76088j94073k08149l08037
2827B58043518l29971l44734k33651J11809J36147j24474k59628m16279m17233k07176
2837B55958328j85966k97318l66935m87786m64935k59857k24114k26269m41551j074314
2847B51929283j133442p02610m38232j29452L5534R6321P9861q7490j41392p2956j84288
2858B49251137n28336n94387m51794l35941j74770k3594K35557J85490k53448l47367
2868B46962547j78566j51882k03132j84308m3869j35879n59101n65529j74770n6267
2878B44709244j25160n1976K11716J40667l45459m02946o7463m1962k79903k67983
$$ y = [260770321, 260918388, 260947952, 260929337, 260871410, 260725021, 260334244, 260027409, 260252953, 260493755, 260262260, 259915581, 259661446, 259457359, 259371758, 259278297, 259029865, 258753777, 258559704, 258351555, 258043518, 257713547, 257368813, 257135162, 257246971, 257383118, 257258644, 256999016, 256582737, 256165504, 255958328, 255772362, 255475044, 255108109, 254620323, 254155388, 253895531, 253671417, 253445148, 253003597, 251929283, 250795841, 250093231, 249654999, 249525547, 249561081, 249657402, 249737263, 249649773, 249508381, 249435425, 249251137, 248722801, 248128414, 247676620, 247340679, 247165909, 247142315, 247377872, 247563362, 247309914, 246962547, 246783981, 246632099, 246428967, 246244659, 246200790, 246064911, 245505810, 244940281, 244765511, 244709244, 244584084, 244532108, 244743824, 244884491, 244539032, 244136086, 244068623, 244026661, 243746758, 243478775]
2888B43478775j8845N017j98365j61876J67351J09920l63598m59423k95391j94549
2898B42069016J5010l3855m55132m27246P7477J25160k17438k86808k36988j18484
2908B40510712K53429J86920l95527m95205j97658j60217k76070l17822l25450l68348
2918B38414764n10940m29611l9101n493m09126k62986N34306N88665%k37961m09584
2929B37232933l72887o0577J13029K91825L12805J11332J07517K84443K89669J45455
2939B38455544J11808J16120J87378M21066M05311J15624O1760J43757K48203N21889
2949B40788460M88758J33991p858J8120j45684n52654o32992m89731k82039K53200
2959B39571571K21978n08309n14030J24435L04947K51999J68095j92166n2681P62940
$$ y = [243478775, 243459930, 243464947, 243266582, 243104706, 243272057, 243381977, 243018379, 242558956, 242263565, 242069016, 242084026, 242050171, 241595039, 241167793, 241245270, 241370430, 241152992, 240866184, 240629196, 240510712, 240764141, 240951061, 240555534, 240060329, 239862671, 239702454, 239426384, 239108562, 238783112, 238414764, 237903824, 237474213, 237435112, 237429619, 237020493, 236757507, 237291813, 237880478, 237880478, 237642517, 237232933, 236860046, 236799469, 236912498, 237204323, 237517128, 237628460, 237735977, 238020420, 238310089, 238455544, 238567352, 238683472, 238870850, 239291916, 239697227, 239812851, 239874611, 240018368, 240266571, 240788460, 241277218, 241411209, 241403351, 241421471, 241275787, 240723133, 240090141, 239600410, 239318371, 239571571, 239793549, 239285240, 238771210, 238895645, 239200592, 239452591, 239620686, 239428520, 239375839, 240138779]
2969B40138779P72476j1215j59264J46637K04544Q9893K01474O41575N99384L6468
2979B42660751q4381R6550J75476K97776K83737J61628n722l59993l99837j56403p877
2990B42661705J88370K39124J30901J09425J79043P4634k90165l07312R308J05362
3000B43100395J20659M7436k14825k56538j15624n1498L1471O676j84059j84288O0310
3011B42360115k6703n03540n62439l00865j39236R1781J32561m2191p5111k6703j2875
3022B40894794L4581m4117l22342l47843j08719j08261k96822l70979m32968l79563
3032B38517761j96457m6501K07901J77155j82877l07789l27358k88715j10150p3433
3042B37369537j69983j52587m1962n493q354k4071n6038j18008j75476l53107p65305
$$ y = [240138779, 240911255, 240900040, 240740776, 240887413, 241091957, 241181850, 241383324, 242024899, 242624283, 242660751, 242576370, 242672920, 242848396, 243146172, 243429909, 243591537, 243585815, 243225822, 242825985, 242669582, 242661705, 242850075, 243089199, 243220100, 243329525, 243508568, 243583202, 243293037, 242985725, 242995033, 243100395, 243221054, 243268490, 243053665, 242797127, 242681503, 242630005, 242661476, 242668152, 242484093, 242299805, 242360115, 242333412, 241829872, 241267433, 240966568, 240827332, 240919113, 241051674, 241009483, 240934372, 240907669, 240894794, 240929375, 240885258, 240562916, 240215073, 240106354, 239998093, 239701271, 239330292, 238897324, 238517761, 238321304, 238274803, 238482704, 238659859, 238476982, 238169193, 237841835, 237553120, 237442970, 237369537, 237199554, 237046967, 237005005, 236999512, 236991158, 236967087, 236911049, 236793041, 236617565, 236264458, 235499153]
3053B35499153q30421o84262l65963L83606N65529L11127R3956k73953n14507q04672
3063B33379593p15256j39694O5079P4157M1237j83582j54247J89781J58062k74410
3073B32440720l19729L109k0752l54538m32720l26157l17574m37488k83737K11258
3083B30162392L75499M06971J83354n11875o91185m56086l89099l86009k83966j659
3093B28408337k9087m72546m17709J58062K49862N5561k12421q48065q90483l33558
3103B25667953j64756k02179j89533k47956j50928J48315K35558J96685J01815r2507
3113B25302467k82783n68390o58493o11801m86603j26114j02291m54655m54445j54495
3123B21402397p3185r6569j62353l55950l99589l15209k92778l32832k45323J8596
$$ y = [235499153, 234668732, 233984470, 233618507, 234002113, 234567642, 234878769, 234972725, 234698772, 234184265, 233379593, 232664337, 232524643, 232589722, 232663879, 232705116, 232521534, 232367287, 232557068, 232715130, 232440720, 232120991, 232124100, 232103348, 231748810, 231316090, 230989933, 230672359, 230234871, 229951134, 230162392, 230537891, 230944862, 231128216, 230616341, 229925156, 229469070, 229079971, 228693962, 228409996, 228408337, 228379250, 227906704, 227488995, 227647057, 227896919, 227952480, 227740059, 226891994, 226001511, 225667953, 225503197, 225301018, 225111485, 224863529, 224712601, 224860916, 225096474, 225293159, 225394974, 225302467, 225019684, 224451294, 223792801, 223181000, 222694397, 222568283, 222465992, 222011337, 221556892, 221402397, 221329212, 221232643, 221070290, 220714340, 220314751, 219999542, 219706764, 219373932, 219128609, 219147205]
3133B19147205P1278l8853j21364k22206l48549n93682n78880l11604j41849L5744
3143B16897240J47361K96345J40667m64916n98908l47137k91119l39508k79426o8665
3153B15091934r1781l49770m54178m78268n18798o30856n00450k3117O9141j66187
3163B11947670k29836k05745k58923l90281m33693m83742l31173K02656J91211l53565
3173B09654579n54581o49452n65281j82399n3635q6784j00365j53084j93596k70347
3183B06845055k44141l5286j04446m56562o11058p64618o13441M9820Q9874m92096
3193B03663101n66234k55337j98860k94686l13034k66800l35693n78384n83649l47138
3203A99923286k98500l87687l87898l48091k99930k51046j42097J24931R5825k27680
$$ y = [219147205, 219218483, 219179630, 219058266, 218836060, 218487511, 217893829, 217314949, 217003345, 216861496, 216897240, 217044601, 217340946, 217481613, 217016697, 216417789, 216070652, 215779533, 215440025, 215160599, 215091934, 215000153, 214650383, 214196205, 213717937, 213199139, 212568283, 212067833, 212044716, 212113857, 211947670, 211717834, 211512089, 211253166, 210862885, 210429192, 209945450, 209614277, 209816933, 210008144, 209654579, 209099998, 208450546, 207885265, 207702866, 207649231, 207562447, 207462082, 207308998, 207115402, 206845055, 206600914, 206565628, 206461182, 206004620, 205393562, 204628944, 204015503, 204065323, 204155197, 203663101, 203096867, 202841530, 202642670, 202347984, 202034950, 201768150, 201432457, 200854073, 200270424, 199923286, 199624786, 199237099, 198849201, 198501110, 198201180, 197950134, 197808037, 197932968, 198028793, 197801113]
3213A97801113m00295o08940n52407j18732n8174k70367m07219o63280o11305k16961
3223A93893433m5300P7725K0256l15667m08630k98500l49770n78403n58148k39372
3233A91197624k47459n56488o46096o93321n14278M2915J83582l6964m8141Q6536M9114
3244A88817024j19209k65846n10216n29995k93026k53677l83129l45707j12305j36833
3254A85867081m44908m81110l46680j92642J18256J85260R4166j00364o07720o48270
3264A83443069k26497j03951j40438j38740j39485j78585k67982l26863l80992m08898
3274A81130638m16260m03404l81241l05404j18027r8229k10762l19957n68142n23110
3284A77786102j36833l5057j44234j33762r060p9880m27704m19616p172j6918m44412
$$ y = [197801113, 197400818, 196791878, 196239471, 196120739, 196062565, 195792198, 195384979, 194721699, 194110394, 193893433, 193848133, 193925858, 193946114, 193630447, 193221817, 192923317, 192573547, 191995144, 191436996, 191197624, 190950165, 190393677, 189747581, 189054260, 188539982, 188582897, 188766479, 188729515, 188681374, 188767910, 188817024, 188697815, 188431969, 187921753, 187391758, 187098732, 186845055, 186461926, 186116219, 186003914, 185867081, 185422173, 184941063, 184594383, 184401741, 184519997, 184705257, 184799423, 184699059, 184091339, 183443069, 183216572, 183112621, 182972183, 182833443, 182693958, 182515373, 182247391, 181920528, 181539536, 181130638, 180714378, 180310974, 179929733, 179624329, 179506302, 179408073, 179197311, 178877354, 178309212, 177786102, 177649269, 177614212, 177469978, 177336216, 177327156, 177247276, 176819572, 176399956, 176392784, 176375866, 175931454]
3295A75931454m81358j66187j55697m56810l87898J31131R4890n61714n73635M6501
3305A73420677Q2474m03862m45366m0302j64280q79994r63688n20706l54290k86102
3315A69444561k29359j86195k37713m68731m58717j74523j69754l94344m94957n85804
3325A66044464n66940l87440l51200m56810m08402j62353j91689n63392n36690j58062
3335A62261486J5507J99318Q7967m41323n93891m66099m67796n07812n41697o34670
3345A58910990n72443l41416k13146r7513q6069j37806l25680q62360q25405j18732
3355A55330420n1737n70059n83649j55449j25408m11987n03779n58138m58002n2690
3365A51859522o5088n36681n79595k13385k48194p15494o82115j22071p2956m71115
$$ y = [175931454, 175450096, 175283909, 175128212, 174671402, 174283504, 174414635, 174509525, 173947811, 173374176, 173420677, 173503151, 173099289, 172653923, 172613621, 172449341, 171569347, 170605659, 170084953, 169730663, 169444561, 169215202, 169029007, 168791294, 168322563, 167863846, 167689323, 167519569, 167125225, 166630268, 166044464, 165477524, 165090084, 164738884, 164282074, 163873672, 163711319, 163519630, 162956238, 162419548, 162261486, 162276993, 162476311, 162564278, 162122955, 161529064, 161062965, 160595169, 160087357, 159545660, 158910990, 158338547, 157997131, 157783985, 157686472, 157600403, 157462597, 157136917, 156274557, 155449152, 155330420, 155278683, 154708624, 154124975, 153969526, 153844118, 153432131, 152928352, 152370214, 151912212, 151859522, 151794434, 151257753, 150678158, 150464773, 150216579, 149501085, 148818970, 148696899, 148623943, 148152828]
3375A48152828n34534m41790k61783K34842J98126l81947o16073p89404o52790j7882
3385A44889593J10150j51158k67744m27723m14848j70231j47104k97785l61204m52996
3395A42308950l72171j6451J431l27587l57390j86920o7711J39713J27077j21593k36988
3406A40890360l46899l11613m5777l2186k50578k99454k18630k52723l80993m43220
3416A38308287n00203m72307m11510j89543L86953M13180p0095l22819o91891n31912
3426A35918140L34025N50270L49283J56164k58445m03166l84569k69890N8174J96695
3436A36246681K80857J70231k47717l85046l46184l03030j55925j33038l67403j00613
3446A34658813Q72374R69648K64883M3869P1764K39j24216j40667K0504q2016n87225
$$ y = [148152828, 147618294, 147176504, 146914721, 147149563, 147347689, 146965742, 146349669, 145560265, 144907475, 144889593, 144999743, 144848585, 144580841, 144153118, 143738270, 143568039, 143420935, 143123150, 142761946, 142308950, 141936779, 141920328, 141921759, 141594172, 141236782, 141049862, 140982151, 141121864, 141248941, 141127348, 140890360, 140543461, 140231848, 140186071, 140153885, 139903307, 139603853, 139385223, 139132500, 138751507, 138308287, 137808084, 137335777, 136924267, 136734724, 137121677, 137534857, 137464762, 137141943, 136450052, 135918140, 136252165, 136802435, 137151718, 137307882, 137049437, 136646271, 136261702, 135991812, 136049986, 136246681, 136527538, 136697769, 136450052, 136065006, 135718822, 135415792, 135259867, 135126829, 134759426, 134658813, 135531187, 136500835, 136765718, 136809587, 136881351, 136881590, 136757374, 136616707, 136637211, 136555195, 135967970]
3457A35967970m97580K27928M27485K52247K57492M22001K74181k98738l75510m6253
3467A36611223J25408L80755L15428k01702k43664J07050K53200L86477L36885m291
3477A38066769l2902K20060K71321J83343J88113K70843K56777J43766J12057J70469
3487A39850616J02759j91689r6082M65631N70536L04222K44856K66075K94447M02212
3497A42213583L73840K38419R3937j90258j90020J46151J85251L8385j06811n24521
3507A42277956l08990O70909R83000R22919P38620J95027j5498j25646J01328R61303
3517A46400928J031161L99113J32322o914j35422k31981k65837k39611j73568j77384
3527A46732807K05755J240731J409053Q97885M74214k41994m98057n35011j41859J034021
$$ y = [135967970, 135470390, 135698318, 136125803, 136378050, 136635542, 137057543, 137331724, 137032986, 136657476, 136611223, 136736631, 137117386, 137432814, 137231112, 136987448, 137094498, 137347698, 137734175, 138071060, 138066769, 138033867, 138253927, 138525248, 138708591, 138896704, 139167547, 139424324, 139568090, 139680147, 139850616, 139953375, 139761686, 139665604, 140131235, 140701771, 141005993, 141250849, 141516924, 141811371, 142213583, 142587423, 142825842, 142919779, 142729521, 142539501, 142685652, 142870903, 142909288, 142802477, 142277956, 141968966, 142639875, 143622875, 144545794, 145284414, 145479441, 145463943, 145338297, 145439625, 146400928, 147432089, 147831202, 147963524, 147956610, 147821188, 147589207, 147323370, 147083759, 146910191, 146732807, 146938562, 148179293, 149588346, 150486231, 150960445, 150718451, 150220394, 149685383, 149543524, 150577545]
3537A50577545J368523J141071Q57115L14951j84775j011848r91106j09434M05788
3546A52367830J050711J067638K96831J33276L37840M69684P26223P58410M73499N89371
3556A58271313J082897J328945J610050J420975R08356j1196j833916k491951k657175
3565A57628298j711846J081467K155066K306709J910210J79996j16596Q40435J002560
3574A65276299P35511O23703K96593O48727J915474K259484K346763J349202j291276
3583A74160480k513885l483772k604485Q70457K357025L192177K612114l01838j112461
3592A73175812n56717j23978R83010J061916J430n3405M48703J155377K738228K861023
3602A81691399J845131P41233j375427j857986r80378k94456R05762J346092R66568
$$ y = [150577545, 151946068, 153087139, 153944254, 154259205, 154074430, 153062582, 152071476, 151962042, 152367830, 153418541, 154486179, 154783010, 154916286, 155254126, 155723810, 156450033, 157208443, 157681942, 158271313, 159354210, 160683155, 162293205, 163714180, 164622536, 164611340, 162777424, 160285473, 157628298, 155916452, 156997919, 159152985, 161459694, 163369904, 163549900, 163433304, 164273739, 165276299, 166011810, 166635513, 166932106, 167580833, 169496307, 171755791, 174102554, 175451756, 174160480, 171646595, 168162823, 165558338, 166428795, 168785820, 171977997, 174590111, 174288273, 173175812, 172619095, 172495117, 173478127, 174540043, 174541473, 174488068, 174936771, 176092148, 178830376, 181691399, 183536530, 184277763, 182902336, 181044350, 180063972, 179769516, 180675278, 182021370, 182987938]
3611A82987938J281242K783070J986256j489392k639065k872695j556168K089996M313221
3620A86884403O933689O423474K842426n20935n802403p750759q273830m991779N289077
3629A81033363P411728K540818J173267R29584Q30193J444817J474132Q29697J161823
3638A98829422K327423L247509M868507M479886K823829l60965p135144q997917p696400
3647A92386150m743328K255898N232353O494026M876385j916180l537883j616726J3351
3656A99444046L497372M088649J704922J421929K367725K954254M381180L436565j05858
3665B23190784k130508m521122l858337R94911K070675J659870j436005j1374702j0329972
3674A94265594K391587O189823M420757M260788L659001L640174M521618M008999K944470
$$ y = [182987938, 184269180, 187052250, 189038506, 187549114, 184910049, 182037354, 180481186, 182571182, 186884403, 193818092, 200241566, 203083992, 202563057, 196760654, 189009895, 180736065, 175744286, 181033363, 188445091, 190985909, 192159176, 193088760, 193918953, 195363770, 196837902, 197667599, 198829422, 201156845, 204404354, 209272861, 213752747, 216576576, 216215611, 209080467, 200082550, 192386150, 187642822, 189898720, 195131073, 201625099, 206501484, 204585304, 201047421, 199430695, 199444046, 202941418, 207030067, 208734989, 210156918, 212524643, 215478897, 219860077, 223296642, 223190784, 221060276, 216539154, 212680817, 213675728, 215746403, 217406273, 215970268, 204595566, 194265594, 196657181, 202847004, 207267761, 211528549, 215187550, 218827724, 223349342, 227358341, 230302811]
3683B30302811K50816n423317p596245q255481n935669J475334M060268L229866L257504
3692B15365887L206005K549667J007538K28882K44636p20272l496418k985954O96182
3701B16096153K911110N831223N404014J643639j457443o071568p503509o854058m418621
3710B05580940J398335M508724P003326O604424K312183M01745n02357j175404j244793
3719B24887123j426201j741180j389733m72316O10103K173672L353825N644092L934612
3728B35573997k762069n387783n714894n712738n175838k957592J288185N028954J1227150
3737B25407372J0565509K932301j909714p966766q979569n718689j363525R842396
3745B22809315Q049965r182930j2241612n221119j356830L676414N810490O142864
$$ y = [230302811, 230553627, 225130310, 217534065, 209278584, 203342915, 204818249, 208878517, 212108383, 215365887, 218571892, 221121559, 222129097, 222357979, 222602615, 221882343, 218385925, 215399971, 216096153, 219007263, 224838486, 230242500, 231886139, 230428696, 224357128, 216853619, 209999561, 205580940, 206979275, 211487999, 218491325, 225095749, 227407932, 227809677, 227307320, 226131916, 224887123, 223460922, 221719742, 220330009, 219857693, 220467796, 222641468, 225995293, 231639385, 235573997, 232811928, 227424145, 221709251, 215996513, 210820675, 207863083, 209151268, 214180222, 225407372, 235972881, 238905182, 236995468, 229028702, 220049133, 214330444, 212966919, 222809315, 230859280, 221676350, 209434738, 204213619, 202856789, 206533203, 212343693, 218486557]
3753B18486557M349213j623154l240337j899243n46932K538433L415356K836227J732578
3762B26048698r88960j886368j123180j488686l155002k646675j40667J595020L975639
3771B20189819M107704J980305N30720j234055k281417l376008k493400J361141K184391
3780B20969200O51360O2713o32286n34782N55515R35078Q30879J035461J605511J519909
3790B26998558P24564M54177N61009L99342K42481l58334j157303k691974o815205
3799B18357315n581360K253533L765335P39326j044025n064717l184566O193161Q543014
3808B24977016O439209M108429p02381l209591n056381m455089J01814P93686j178742
3817B21817970k799034o911049n156746L908882O145478L478279K345085O24180L61919
$$ y = [218486557, 222835770, 221212616, 217972279, 216073036, 215526104, 218064537, 221479893, 224316120, 226048698, 225059738, 223173370, 222050190, 220561504, 217406502, 214759827, 214619160, 216214180, 220189819, 224297523, 226277828, 226808548, 225574493, 223293076, 219917068, 217423668, 218784809, 220969200, 221620560, 221683273, 221050987, 220516205, 221071720, 222006798, 222837677, 223873138, 225478649, 226998558, 227723122, 228177299, 228738308, 229137650, 229380131, 229021797, 227864494, 225172520, 218357315, 212775955, 215029488, 218794823, 219534149, 218490124, 213425407, 210240841, 216434002, 224977016, 231416225, 235524654, 234822273, 231612682, 226556301, 222101212, 222203026, 222996712, 221817970, 219018936, 212107887, 206951141, 210860023, 217005501, 220483780, 222828865, 223453045, 223814964]
3826B23814964J883736J840362M52519J84765J140842M40846j577626l385543o690979
3835B18103886o193867j558304N68390J911869K213478M04835J015892L528137N485039
3844B25479355Q816719Q257866M840622l01361r793759j4268169j7834892j3423920
3852A91772461K414474Q809090J0287285R610634M349479J459351r98497k228012k346268
3861B23129997j684437O96660J371383J531124j66893n592346n925426j675606L73611
3870B12058067K109299K764931J926899K015361L318787K259712j810074k720832j232605
3879B20689545m77333J067886M41551l665199l057022K792358L579388O45637j075267
3888B20941544m219284l176232L017674M896869M344712L293514P31716j226673l680706
$$ y = [223814964, 225698700, 227539062, 227991581, 228176346, 229317188, 229758034, 228180408, 224794865, 218103886, 211910019, 210351715, 210920105, 212831974, 215045452, 215450287, 216466179, 219994316, 225479355, 234296074, 242553940, 247394562, 247093201, 237299442, 223031273, 205196381, 191772461, 194186935, 202996025, 213283310, 222893944, 227243423, 228702774, 227704277, 225476265, 223129997, 221445560, 222142220, 223513603, 225044727, 224877834, 219285488, 213360062, 211684456, 212058067, 214167366, 216932297, 218859196, 220874557, 224193344, 226453056, 224642982, 221922150, 220689545, 220212212, 221280098, 221721649, 218056450, 214999428, 217791786, 221371174, 222016811, 220941544, 216722260, 213546028, 216563702, 221460571, 225805283, 229098797, 229830513, 228603840, 224923134]
3897B24923134m350433l125191k729645k904892j963139M7207J631260L903389L898621
3906B19330311J185417M53949J042118R04579N40734l357q90732j516800k483139j991272
3916B16571808M49409J077423L43094K04544K80877J34697l85762k37217Q72364P31469
3926B20042706n65529j188031j793155j586209m73022L73135J491546J898518J792202
3935B19992161J362324L74069m25091j543045j696587r52243l27111Q09899R50813
3944B18545189M2686j97410n3406j07288l19004k68460O428K37007O47774O06766Q3923
3955B19224205j71165l81012m08879j87874j22547k10037n9376M30584M60854K9812
3965B18604565n9834Q8196Q4877J5030p4616k84443k62508J1444J03245R0351R7046
$$ y = [224923134, 220572701, 217447510, 214717865, 211812973, 209849834, 209897041, 211528301, 215431690, 219330311, 220515728, 220969677, 222011795, 222916374, 223457108, 223453751, 222563019, 221046219, 218563080, 216571808, 217021217, 218098640, 218441734, 218646278, 218927155, 219061852, 218676090, 218438873, 219311237, 220042706, 219477177, 218289146, 216495991, 214909782, 214436760, 214809895, 216301441, 218199959, 219992161, 221354485, 221728554, 221303463, 219760418, 218063831, 217111588, 216784477, 217594376, 218545189, 218587875, 218390465, 218337059, 218229771, 217910767, 217642307, 217648735, 217885742, 218533516, 219140282, 219224205, 219053040, 218672028, 218263149, 218075275, 217952728, 217742691, 217683315, 218113899, 218574753, 218604565, 218544731, 218632927, 218717804, 218732834, 218658218, 218373775, 218111267, 218122711, 218225956, 218316307, 218413353]
3976B18413353Q0337Q4878J89075L3131n09491n74112k85874j0948N93186N21411l81221
3987B18153725m91143M9096J85012J54267N7945l08762k31018L68347M63009J70002
3997B18570480M5281l6240j33018
4000B18446503
$$ y = [218413353, 218493690, 218578568, 218767643, 218800774, 218291283, 217717171, 217431297, 217420349, 218013535, 218534946, 218153725, 217662582, 217711678, 217896690, 218050957, 218108902, 217800140, 217569122, 217937469, 218400478, 218570480, 218615761, 218579521, 218446503]
##END=$$ End of the data block
