##TITLE=ACC $$ Begin of the data block
##JCAMP-DX=5.00 $$ ACD/SpecManager v 10.08
##DATE=14 Dec 2016 11:32:38
##DATA TYPE=INFRARED SPECTRUM
##DATA CLASS=XYDATA
##ORIGIN=Marcelo Quint
##OWNER=
##NPOINTS=1765
##FIRSTX=399.77209473
##LASTX=3997.72216797
##MAXX=3997.72216797
##MINX=399.77209473
##MAXY=0.74132657
##MINY=0.33059716
##XFACTOR=1.0000000000
##YFACTOR=1.000000000000000e-9
##FIRSTY=0.67558891
##DELTAX=2.03965425
##XUNITS=1/CM
##YUNITS=ARBITRARY UNITS
##XYDATA=(X++(Y..Y))
399.8 675588906 675487459 675068796 675030112 675010383 674998343 674981952 674771070 673925996 672279000 670909703
420.2 670909703 670069933 669488251 668842256 668242037 667305648 666070223 664830148 663763404 662972748
438.5 662972748 661838651 660782516 660059094 659644127 659142852 658505976 657895386 657017291 656040907
456.9 656040907 655171335 654830337 654686093 654558718 654403687 654450059 654981375 655682921 656646192 657700062
477.3 657700062 659011185 660440505 661900818 663442492 664953411 666769147 668688357 670528293
493.6 670528293 671881020 672841370 673646629 674226820 674789608 675172687 675393164 675353706 675184190 674797118
514 674797118 674114585 673523843 673239350 673354506 673345268 673291326 673500299 673946559 674544215 675050795 675575793
536.4 675575793 675956547 676257610 676428199 676377952 676253736 676033735 675776780 675283849 674717307 674175858
556.8 674175858 673746169 673502147 673244536 673035681 672684491 672241271 671814203 671517611 671408594 671522498
577.2 671522498 672021270 672712207 673644483 674539506 675197244 675643921 675939620 676339388 676693559 677028835
597.6 677028835 677314460 677625477 677915454 678051710 678303838 678794026 679560959 680228293 680720150 681393981
618 681393981 682589650 684232533 685773671 687240183 688544512 689565778 690338373 690964401 691671431
636.4 691671431 692332387 692955971 693476677 693960845 694445789 694867730 695284247 695569336 695777714 695840001
656.8 695840001 695890903 696045399 696323454 696746409 696880043 697181880 698342085 699798405 701200724
675.1 701200724 702606738 704092622 705448627 706687152 707670271 708411276 709031641 709594131 710062146
693.5 710062146 710228384 710309148 710422099 710603952 710846424 711108267 711533725 712092519 712801278 713568449
713.9 713568449 714435160 715392411 716367662 717465758 718523383 719524860 720468640 721398771 722252369
732.2 722252369 722911298 723529398 724089205 724572420 724887967 725111127 725303471 725345016 725262165 725054562
752.6 725054562 724896729 724789023 724694550 724702120 724836826 725201964 725688875 726169884 726454377 726509154
773 726509154 726512432 726449549 726401925 726425052 726596057 726861060 727117360 727391124 727614105 727884591 728224218
795.5 728224218 728679955 729246378 729794621 730369329 730978012 731657505 732310891 732931733 733602583 734308839
815.9 734308839 735077977 735828459 736549914 737148583 737589955 737901509 738062203 738218307 738433003 738828540
836.3 738828540 739388883 740015209 740625083 741038024 741274416 741326571 741273165 741116822 740848541 740537405
856.7 740537405 740116298 739745498 739453435 739187717 738898575 738477528 737861335 736948669 735854328 734651268
877.1 734651268 733517289 732652843 731998920 731382608 730525374 729421139 728210807 727109432 726264060
895.4 726264060 725692630 725463092 725472152 725634873 725759864 725644112 725242794 724591374 723777890 722728968
915.8 722728968 721516907 720222116 718910515 717690587 716519475 715408623 714341700 713383138 712531328
934.2 712531328 711679935 710842609 710054696 709364116 708642244 707800806 706815600 705571175 704002976
952.5 704002976 702076852 699914038 697634995 695297301 692952514 690598845 688245773 685826540
968.8 685826540 683290422 680570185 677554369 674213171 670543313 666597307 662526309 658569217
985.2 658569217 654878795 651484251 648434639 645712972 643283308 641065717 638926148 636804819
1001.5 636804819 634653449 632383287 629841447 626960218 623764455 620300889 616780400 613443434
1017.8 613443434 610455096 607879996 605717361 603964925 602527618 601315677 600208521 599093735
1034.1 599093735 597906351 596559405 595035255 593345821 591682315 590324283 589535713 589484453 590115786
1052.5 590115786 591417432 593261778 595426142 597717583 599919260 601750672 602804184 602818727 601752996
1070.8 601752996 600001872 598267913 597100794 596773148 597170591 598063350 599174380 600330591 601505339
1089.2 601505339 602590382 603542447 604294538 604870021 605325043 605716050 606173277 606763482 607612908
1107.5 607612908 608726680 610141158 611848295 613688409 615548968 617276609 618888676 620454192
1123.9 620454192 622123063 624046028 626273334 628706872 630894005 632574737 633617580 633964479
1140.2 633964479 633726180 633004367 632012248 630893588 629827976 628938079 628356457 628259957 628659308
1158.5 628659308 629624486 631092072 633018434 635317683 637797117 640370131 642874181 645247519
1174.8 645247519 647368312 649157405 650655150 651891232 652955949 653805494 654425383 654754937 654808283
1193.2 654808283 654672682 654348850 653964400 653602123 653412819 653482556 653777540 654248476 654767036 655310690
1213.6 655310690 655784011 656149507 656437039 656672657 656914294 657111585 657297075 657468975 657671571 657976270
1234 657976270 658360898 658848643 659395576 660028279 660742700 661539733 662425578 663302958 664170384 664949000
1254.4 664949000 665610194 666203380 666789889 667444587 668115556 668839872 669613361 670442879 671406269 672501624
1274.8 672501624 673677802 674795330 675864518 676942229 678005576 679016888 679918408 680729687 681412578
1293.1 681412578 681950688 682336688 682566941 682669580 682608128 682429194 682125807 681684017 681116581 680449665
1313.5 680449665 679835021 679341257 679048359 678935826 678861201 678772986 678636551 678485751 678340435 678229213
1333.9 678229213 678134501 678096592 678413689 679134071 679922044 680474281 680756748 680848598 680771887 680582643
1354.3 680582643 680318832 679943562 679259777 678371608 677728117 677183568 676452041 675638199 674827158 674181223
1374.7 674181223 673908234 673673749 672956526 672191381 672577381 674499512 676825702 678372204 679013968
1393.1 679013968 679136574 679293513 679550707 679849923 680014074 679950893 679949641 679886460 679633558 679274797
1413.5 679274797 678708673 677778959 676854491 676591158 676619112 676723123 676928759 677177370 677716076 678346813
1433.9 678346813 678853869 679710269 680888236 681730747 681976497 681739628 681264102 681000412 680903256 680583715
1454.3 680583715 679918408 680048823 681400657 682551503 683356285 684695899 686595201 688558877 690835953
1472.6 690835953 693789303 696894705 699666500 701944292 703815401 705246806 706008971 706360579 706953049
1491 706953049 707628727 707559705 706634402 705848038 705396950 704668283 702718318 700039744 699384868 699710429
1511.4 699710429 699778974 699797690 700476646 702026010 704275429 706980109 709502697 711766660 713649869
1529.7 713649869 714876771 715768337 716724455 717098594 716557264 716711998 717860758 719015718 719719172
1548.1 719719172 719942033 720031738 719900906 719264090 718021572 717901111 718957961 719316781 718884826
1566.5 718884826 717838287 716571033 715590060 714007258 711511552 709576726 707930863 705627084
1582.8 705627084 702943981 700234473 697537899 694864094 692187846 689486980 686715245 683796346
1599.1 683796346 680644214 677397490 674420059 671778679 669331193 666952670 664433897 661148906
1615.4 661148906 657343626 654699504 652373016 649457514 646879613 644810438 643119872 642032981
1631.7 642032981 641159177 640543878 641276181 642835915 644325733 645515263 646546304 648159564 650019586
1650.1 650019586 651396692 653421044 656422675 659167171 661433995 663630664 666041613 668170273
1666.4 668170273 669814825 671523631 673408866 675009549 676419616 677614093 678210080 677991986 677610755
1684.8 677610755 678048909 678426027 678217411 677528024 675912321 673847437 672041476 670348465 669321001
1703.1 669321001 668188870 666681051 665335596 663912773 662171006 660050511 657911956 656861424
1719.4 656861424 656576216 656029046 655259609 654522717 653767228 653008461 652196527 652189910 652844012 653351367
1739.8 653351367 653939128 654824853 655811667 656826973 658183455 660183132 662433922 664622605 666934729
1758.2 666934729 669441640 672246218 675250530 678122401 680825233 683481455 686459601 689781368
1774.5 689781368 692875981 695542276 697926223 700102508 702078700 703851759 705277145 706290066
1790.8 706290066 707367539 708767295 710009813 710919201 711751401 712746561 713734925 714498878 715077817
1809.2 715077817 715655506 716348708 716993868 717516840 718013585 718395412 718590319 718766570 719015956 719255447
1829.6 719255447 719683349 720240057 720572472 720774055 720923603 720848143 720629334 720770061 721250772 721611202
1850 721611202 721810281 721917391 721968889 721988797 721985817 721997023 721925139 721656501 721352041 721423566 721758544
1872.4 721758544 721929073 721933722 721894920 721845210 721796274 721738756 721637726 721433997 721319616 721336782 721316397
1894.9 721316397 721288502 721260130 721192956 721072972 720943928 720783055 720613897 720533907 720468402 720287502
1915.2 720287502 719968140 719743788 719630837 719522893 719517887 719498575 719365656 719173193 718981564 718806446
1935.6 718806446 718618751 718360603 718010604 717787027 717716873 717608511 717448294 717271328 717097640 716908872
1956 716908872 716708958 716488242 716268837 716060698 715804279 715596020 715462923 715324819 715142667 714921176
1976.4 714921176 714712858 714521170 714342058 714137137 713900566 713644028 713365495 713152945 713022530 712895870
1996.8 712895870 712723315 712518573 712313890 712108374 711899519 711670637 711441994 711202741 710905015 710555017
2017.2 710555017 710133135 709524989 708398044 707238138 707326591 708295465 708828509 708838284 708729088 708583653
2037.6 708583653 708409131 708241582 708081126 707938194 707804918 707680762 707570314 707459927 707361996 707257628
2058 707257628 707147896 707023799 706894040 706786454 706687510 706587076 706484020 706393421 706287742 706157744
2078.4 706157744 706050754 705972791 705884635 705763519 705651045 705553055 705423295 705273688 705129087 704999626
2098.8 704999626 704882562 704765797 704634666 704481244 704324424 704154551 703973532 703789532 703624785 703495085
2119.2 703495085 703359604 703214467 703070521 702948332 702840745 702703834 702549636 702417254 702319026 702217758
2139.6 702217758 702097178 701971054 701862872 701797485 701720357 701613903 701514304 701420009 701343715 701271951 701178312
2162 701178312 701065838 700940371 700796008 700699270 700713992 700750709 700737894 700678885 700599551 700506985 700384080
2184.5 700384080 700269997 700191081 700134873 700060248 699960530 699855626 699726582 699581444 699426413 699283361
2204.9 699283361 699171364 699044645 698876739 698695600 698533416 698375165 698201418 698010743 697823167 697650611
2225.3 697650611 697460592 697265506 697067738 696859419 696664333 696465969 696262538 696062446 695860028 695644319
2245.7 695644319 695424676 695223033 695026398 694836020 694636524 694422305 694220901 694042861 693870604 693647563
2266.1 693647563 693396032 693179250 692996383 692811966 692599714 692384124 692182422 691993177 691777706 691511035
2286.5 691511035 691232562 690940917 690629184 690312445 690010130 689715803 689393103 689045429 688673317 688272357
2306.8 688272357 687843204 687407494 686997414 686585307 686125278 685615480 685097992 684590578 684087098 683564425
2327.2 683564425 683025897 682552278 682114840 681639671 681165814 680758238 680457771 680302441 680348516 680508077
2347.6 680508077 680481851 679970324 679009318 678040445 677292049 676740885 676376700 676187634 676174521 676280618
2368 676280618 676394701 676505685 676651061 676769197 676840425 676895022 676892459 676785111 676568568 676286697 675962269
2390.5 675962269 675602973 675232947 674856305 674483716 674099445 673694491 673289537 672897696 672520518 672118068
2410.9 672118068 671679556 671231568 670813978 670421302 669995427 669548273 669109702 668689311 668284237 667881548
2431.3 667881548 667483151 667083681 666672230 666223228 665747762 665279806 664831638 664403975 663969755 663522720
2451.7 663522720 663074255 662636757 662193775 661721468 661250412 660798967 660361469 659913898 659462452 659031332
2472.1 659031332 658602178 658172309 657726526 657252312 656782568 656347096 655921280 655455709 654971957 654514909
2492.4 654514909 654090822 653661191 653205037 652756095 652309358 651858270 651417196 650986075 650549293 650098085
2512.8 650098085 649665833 649265766 648871362 648475945 648095489 647717595 647309661 646892190 646496415 646122217
2533.2 646122217 645740628 645341396 644976377 644648850 644308567 643943310 643566906 643191874 642836213 642502427
2553.6 642502427 642153800 641801238 641462862 641129255 640814900 640509129 640190601 639853060 639511406 639161587
2574 639161587 638793290 638433337 638083756 637747109 637429714 637101293 636745453 636386335 636039853 635672629
2594.4 635672629 635270000 634863138 634486973 634139121 633784831 633420408 633061051 632707536 632338345 631949484
2614.8 631949484 631572306 631224632 630904794 630572438 630211949 629845619 629498363 629193783 628890276 628556550
2635.2 628556550 628233969 627943516 627629340 627257884 626891255 626568258 626275122 625983477 625675201 625356853
2655.6 625356853 625033557 624749005 624498188 624209166 623880625 623554170 623255789 622969270 622656345 622315109
2676 622315109 621982217 621649086 621260047 620836318 620447695 620105624 619742393 619339049 618961990 618608952
2696.4 618608952 618228316 617801070 617355645 616925538 616520882 616133630 615717769 615279853 614855826 614430189
2716.8 614430189 614005864 613606393 613232255 612859607 612452626 611998022 611547887 611145377 610799611 610484421
2737.2 610484421 610114217 609707594 609354913 609071195 608802676 608466387 608056366 607642055 607262909 606880009
2757.6 606880009 606465340 606057465 605682969 605319619 604925871 604517817 604147017 603783190 603333235 602797210
2778 602797210 602277577 601798296 601332724 600898266 600469530 599968374 599380732 598785102 598226368 597656846
2798.4 597656846 597013354 596317887 595642805 594996750 594357967 593685567 592959940 592222929 591490269 590764403
2818.8 590764403 590040624 589316666 588575363 587768555 586915195 586044014 585162163 584288716 583396673 582391679
2839.2 582391679 581209600 579930007 578628600 577275097 575894058 574656248 573688388 572926939 572288632
2857.5 572288632 571667612 570921600 570055187 569140673 568192124 567260444 566399813 565485537 564416707
2875.9 564416707 563346863 562396288 561514437 560650766 559792399 558950126 558137536 557371140 556662798
2894.2 556662798 555949748 555176020 554444432 553841174 553283393 552720368 552212954 551766872 551215291 550396383
2914.6 550396383 549370885 548317075 547365010 546588480 546037674 545752108 545666695 545574903 545433819 545432091
2935 545432091 545641840 545992315 546459258 547004938 547525346 547927916 548248827 548581839 548825204 548889875
2955.4 548889875 548898876 548917770 548853159 548642337 548339546 547974467 547542989 547136664 546864629 546783030
2975.8 546783030 547038734 547670186 548401415 549080729 549775541 550472558 551146805 551725328 552048981 552163899
2996.2 552163899 552161694 552012801 551827908 551674426 551522017 551448464 551455975 551388204 551101804 550616920 550065339
3018.7 550065339 549538016 549094319 548700631 548260987 547791243 547358155 546973944 546517491 545912623 545364797
3039 545364797 544960022 544463158 543751895 542971849 542297065 541683555 540987670 540246546 539485693 538679957
3059.4 538679957 537948370 537352383 536799252 536126912 535279870 534415126 533695638 533164322 532702386 532089770
3079.8 532089770 531291842 530439377 529557347 528688669 527850389 526913106 525920630 525039494 524295330 523536742
3100.2 523536742 522635877 521730721 520971894 520232856 519319654 518384576 517669976 517012119 516168952 515064776
3120.6 515064776 513779402 512560368 511529386 510598302 509627104 508565247 507529140 506642163 505764186
3139 505764186 504635751 503337502 502136230 501067519 500095546 499205381 498148322 496793866 495417476
3157.3 495417476 494179875 492997825 491801381 490567952 489313990 488078654 486863077 485627025
3173.7 485627025 484366506 483117044 481899381 480665416 479368448 478042066 476732641 475445390
3190 475445390 474147737 472793818 471391737 470017046 468699336 467389345 466052771 464694113 463323116
3208.3 463323116 461966753 460657597 459375918 458074301 456746399 455414385 454094231 452787668
3224.6 452787668 451495826 450258434 449131131 448030174 446731120 445275575 443912506 442662477
3241 442662477 441484213 440397412 439300835 438085556 436827064 435665399 434581101 433454007 432287276
3259.3 432287276 431147456 430049598 428996712 428035349 427203715 426285416 425111949 423851043 422644138
3277.7 422644138 421512961 420443416 419396937 418342113 417313933 416404486 415539086 414528638 413336694
3296 413336694 412031800 410763562 409711093 408819973 407815874 406486750 404888630 403284132 401833951
3314.4 401833951 400453180 399031579 397589624 396209449 394869238 393397599 391753525 390108138
3330.7 390108138 388561904 387139887 385845184 384452373 382814676 381105751 379426748 377859384
3347 377859384 376486689 375038862 373283595 371457845 369834810 368392467 366959274 365516871 364244163
3365.4 364244163 363075197 361658812 359903783 358154714 356671274 355342299 354034573 352722645
3381.7 352722645 351439446 350254953 349237472 348407656 347522646 346357286 345172554 344325125 343640625
3400 343640625 342625618 341317028 340214580 339395434 338600308 337752491 336875528 336029559 335297734
3418.4 335297734 334636956 334012449 333516419 333186358 332925528 332629830 332368791 332210928 331937879 331423491
3438.8 331423491 330953479 330745310 330687195 330638379 330597162 330645382 330793202 330979586 331238031 331593543
3459.2 331593543 331902504 332209140 332758635 333431005 333834469 333937258 334091604 334498078 335109204 335739911
3479.6 335739911 336215675 336664319 337254018 337877959 338469565 339118361 339837432 340578467 341292381 342009693
3500 342009693 342776000 343458682 344037741 344714344 345558763 346510142 347421408 348186612 348917514 349787235
3520.4 349787235 350810379 351764411 352581173 353455514 354455620 355526656 356660455 357755959 358746290
3538.7 358746290 359825879 361064970 362262219 363231421 364134490 365213275 366398484 367586166 368817061
3557.1 368817061 370112181 371308953 372268081 373271883 374737501 376480728 378077298 379510522
3573.4 379510522 380925745 382398307 383964598 385571986 387111098 388600618 390142232 391771257
3589.7 391771257 393397093 395023406 396756470 398607790 400464326 402209580 403775632 405223489
3606 405223489 406788558 408549756 410396278 412191421 413893998 415799379 417951882 419778854 421058685
3624.4 421058685 422266364 424077898 426316947 428321242 430146426 431878895 433507890 435014725
3640.7 435014725 436267436 437229484 438282371 440090567 442242503 443827868 445257008 446983367
3657 446983367 448670179 449962080 450858265 451482594 452059299 452867299 453703254 454466403 455595255
3675.4 455595255 456922472 458021611 458863616 459376842 459724933 460395873 461348414 462091595 462670356
3693.7 462670356 463123381 463352740 463554054 463973582 464333653 464313686 464062005 464096993 464647859 465159953
3714.1 465159953 465291977 465140104 464899242 464700401 464621454 464574903 464311123 463830590 463430077 463576943
3734.5 463576943 464195848 464369804 463869095 463425159 463434219 463398069 463352859 463764846 464299142 464447796
3754.9 464447796 464443922 464545637 464582056 464435548 464210242 464041889 464073956 464188367 464103639 463824123
3775.3 463824123 463639587 463608831 463444144 463175595 463013113 462953657 462863982 462565541 462089300 461562634
3795.7 461562634 461013794 460723490 460692286 460563600 460534990 460674614 460533321 459989846 459452212 459072530
3816.1 459072530 458678424 458555877 458722740 458772153 458586752 458210617 457780480 457337618 456941634 456713945
3836.5 456713945 456578076 456501514 456528306 456478924 456031859 455020487 453946799 453882545 454567105 454666823
3856.9 454666823 454319328 453854471 453422457 453021318 452664047 452545166 452564389 452527523 452318549 451881707
3877.3 451881707 451427251 451115757 451045185 451051027 450752884 450377256 450189263 449897498 449358284 448759317
3897.7 448759317 448287159 448094219 448187560 448304743 448249251 448031873 447640300 447145134 446776956 446573198
3918.1 446573198 446315259 445988506 445713282 445458055 445161968 444901973 444750607 444578767 444251388 443828970
3938.5 443828970 443445355 443142414 442874163 442619324 442387134 442164749 441931099 441667080 441360384 441040188
3958.9 441040188 440749049 440480351 440211564 439922750 439599931 439288378 439008594 438762218 438546181 438294917
3979.3 438294917 438018054 437760442 437452286 437066913 436721146 436473787 436260730 436024874 435746670
3997.6 435746670
##END=$$ End of the data block
