##TITLE=ACA $$ Begin of the data block
##JCAMP-DX=5.00 $$ ACD/SpecManager v 10.08
##DATE=14 Dec 2016 11:32:42
##DATA TYPE=INFRARED SPECTRUM
##DATA CLASS=XYDATA
##ORIGIN=Marcelo Quint
##OWNER=
##NPOINTS=1765
##FIRSTX=399.77209473
##LASTX=3997.72216797
##MAXX=3997.72216797
##MINX=399.77209473
##MAXY=0.72615665
##MINY=0.15219122
##XFACTOR=1.0000000000
##YFACTOR=1.000000000000000e-9
##FIRSTY=0.70541102
##DELTAX=2.03965425
##XUNITS=1/CM
##YUNITS=ARBITRARY UNITS
##XYDATA=(X++(Y..Y))
399.8 705411017 706299782 705439091 705134749 704619229 703965902 704424441 703366816 701681316 699993372
418.1 699993372 698410749 699107468 698991895 697990119 697533965 695946395 694779634 693842173 692494214
436.5 692494214 692297399 691313207 690044701 689459801 688254833 687955379 687517941 686399579 685972512
454.8 685972512 684599638 683743775 683882713 683200538 683226883 683150768 682635963 682875574 682785094 683587492
475.2 683587492 684931636 685481131 687003553 688483000 689702749 691720128 692755699 693895400 695431292
493.6 695431292 696101069 697342813 698047817 698055565 698746920 698694050 698707700 698767841 697885990 697503984
514 697503984 696580350 695328474 695268095 694749773 694261670 694185078 693856239 694498420 694993198 695137501
534.4 695137501 696065247 696336091 696509242 696852982 696385443 696343005 696001709 695128858 694873810 693979204
554.8 693979204 693009436 692447841 691395223 690925121 690354943 689252198 688698649 687652171 686723411
573.1 686723411 686641514 686484158 687097371 687957704 688523948 689687073 690327704 690651596 691266656 691299856
593.5 691299856 691698432 692096055 691870987 692271113 692427278 692352176 692832291 692890227 693365932 694176137
613.9 694176137 694302201 695101261 696234941 697340906 699063241 700233877 701277971 702385902 702570140
632.3 702570140 703023136 703530073 703595757 704179943 704294324 704208374 704644501 704561234 704741180 705020607
652.7 705020607 704741359 705056250 705199242 705087245 705482483 704887271 703632236 704129457 705802619
671 705802619 707604468 708776951 709397733 710548103 711312413 711908042 712766349 712961853 713374197 713853180
691.4 713853180 713733256 713946998 713899314 713654935 713894665 713726580 713794172 714347422 714590132 715288579
711.8 715288579 716016471 716472328 717451036 718234658 719043911 720109940 720625103 721365869 722153723 722413301
732.2 722413301 722940505 723217428 723256946 723562241 723370671 723168552 723040819 722374678 721862137 721189678
752.6 721189678 720271230 719807982 719214618 718840182 719044089 719173372 719708145 720339417 720538795 720866799
773 720866799 720838547 720584333 720617831 720360219 720293403 720475078 720343530 720480084 720614552 720621347 720967591
795.5 720967591 721128643 721423686 721983731 722187698 722567976 722990513 723193407 723691165 724041045 724362075
815.9 724362075 724951506 725231886 725601912 726018727 726030290 726156652 726080298 725803256 725830555 725665808
836.3 725665808 725620031 725833356 725765824 725820720 725685835 725162208 724869132 724342048 723671257 723150373
856.7 723150373 722270489 721624672 721346438 720974445 720892370 720688581 720207751 719823837 719056845 718271255
877.1 718271255 717714131 716823101 715901852 714697480 712996781 711400032 709590435 707815111 706572294
895.4 706572294 705402136 704664350 704330921 703852475 703614175 703243732 702450693 701623917 700389504
913.8 700389504 699036062 697794378 696182311 694712043 693344831 691765845 690563440 689419925
930.1 689419925 688194752 687259018 686194301 685255289 684561312 683656275 682965815 682294250 681318998
948.4 681318998 680346251 678821743 676794708 674680948 672106266 669512689 667029321 664269388 661656201
966.8 661656201 658918858 655889630 652970076 649612725 645801008 641830027 637420297 633010209
983.1 633010209 628684044 624273539 620335579 616760015 613506854 610814989 608182251 605698824
999.4 605698824 603469908 601038218 598600626 595957696 592795670 589493454 585927606 582291842
1015.8 582291842 579087198 576128125 573683321 571861207 570281267 569186389 568387568 567585289 567038357
1034.1 567038357 566438317 565700173 564963400 563882470 562767625 561858535 560976863 560521364 560484707
1052.5 560484707 560794711 561793864 563160658 564797461 566698015 568121672 568798184 568468332 566883206
1070.8 566883206 564813256 562868297 561570764 561496317 562224329 563409388 564902246 566192925 567384899
1089.2 567384899 568425238 568946421 569174647 569065392 568713784 568561256 568471491 568632007 569225252 569895387
1109.6 569895387 570862412 572122395 573343992 574666083 575810790 576705337 577738225 578720629 579826415
1127.9 579826415 581380963 582970023 584375262 585273743 585338295 584874570 583845556 582375348 580925465
1146.3 580925465 579401255 578008533 576978862 576186478 576004982 576469898 577350974 578853846 580696285
1164.6 580696285 582635581 584744692 586626172 588252604 589730561 590792060 591632009 592236340 592420876
1183 592420876 592521787 592495978 592274666 592016816 591484606 590776265 590057075 589205861 588527262 588059247
1203.4 588059247 587651968 587536693 587562501 587628365 587819695 587840497 587788641 587822556 587741017 587725878 587777853
1225.8 587777853 587736070 587799907 587885022 587988377 588277280 588545263 588859797 589321733 589776993 590403020
1246.2 590403020 591152012 591842651 592596769 593251228 593762279 594297051 594723642 595135093 595608056 595984221
1266.6 595984221 596430123 596966207 597509563 598212719 598932743 599590063 600289345 600870132 601378083 601908088
1287 601908088 602331519 602706015 602956712 603013873 603058517 602991164 602796197 602601230 602256179 601799905 601267099
1309.5 601267099 600545526 599817395 599081039 598304272 597749531 597326159 596897542 596475244 595921934 595339477
1329.9 595339477 594847560 594323695 593780279 593382597 593450427 593940854 594275832 594318926 594219863 593923748
1350.3 593923748 593499243 593057692 592514277 591703355 590579629 589617372 589066625 588340223 587344289
1368.6 587344289 586247981 585101366 584370613 584005237 583405197 582347274 581094980 580690205 582022488
1387 582022488 583884537 584482729 584118903 583787501 583664656 583713472 583639801 583153903 582740963 582480669
1407.4 582480669 582078695 581561327 580793858 579453528 578082025 577856541 578037322 577842057 577653348
1425.7 577653348 577394366 577329755 577444255 577111423 577276409 578640461 579498172 579536080 579212606 578628957
1446.1 578628957 578234076 577939570 576988697 575311363 574683547 576491475 577772260 577713251 578164399
1464.5 578164399 579558313 580335975 580703855 582606375 585821331 588580906 590570211 592057824 593155563
1482.8 593155563 593529046 593381643 593815684 594984770 595144749 594205499 593756378 593830526 592973053 590500891
1503.2 590500891 587630451 587207615 587967157 587653518 586736560 585936785 585837960 586504757 588549972
1521.6 588549972 590945244 592497349 593831956 594322443 594183266 594672024 594341099 592467904 592051566
1539.9 592051566 593827367 595118225 595610380 595313787 594650447 593850851 592431426 590121090 589707375
1558.3 589707375 592742383 593568981 592380226 590920031 589781702 589300692 587892115 585793078 585012317
1576.7 585012317 584363878 582569361 580403745 578238845 576036692 573798776 571524560 569239974
1593 569239974 566991091 564706028 562175810 559440196 556721747 554061651 551593840 549455643 547149122
1611.3 547149122 544052660 540919006 538825929 536492407 533433437 530911028 528916657 526973069
1627.7 526973069 525174022 522928655 520808876 520995498 522391737 522654772 522127926 521245062 521480262
1646 521480262 522683263 521989405 521963775 526198745 528892934 529115975 529251277 530352235 531774938
1664.4 531774938 531893194 531989694 533222497 533783793 534166515 535118699 534758806 532779872 531095386
1682.7 531095386 531918287 532580435 531345129 529458702 526753306 523868024 521373749 519341707 518564045
1701.1 518564045 517135680 514823616 512954056 510970950 508302152 505140960 502331078 501317024
1717.4 501317024 501216769 500110567 498599559 497291833 495845497 494041234 492264509 492338508 493477136
1735.8 493477136 493128866 492795467 493190944 493403852 493347466 493468583 494780660 496931702 498299479
1754.1 498299479 499424398 500920534 502543628 504946887 507198870 508669853 510095656 511881411
1770.4 511881411 515037119 518412113 520367622 521789491 523424745 524997890 526396215 527426541
1786.7 527426541 527560890 527817726 529420674 530754745 530887127 531014323 531756043 532566547 532896221
1805.1 532896221 532834589 532863975 533324063 533737183 533800840 533846498 533855855 533549130 533182681 533063114 532833219
1827.5 532833219 532969594 533585548 533629596 533275962 533033550 532408416 531374097 531367779 532187700 532259583
1847.9 532259583 531930983 531624377 531327903 531056225 530724406 530374885 529957950 529171705 528220952 528066158
1868.3 528066158 528559983 528540969 528048635 527611256 527269900 526870668 526415944 525933146 525290966 524847984
1888.7 524847984 524739444 524384081 523931146 523606122 523211539 522797942 522353351 521780312 521190405 520778537
1909.1 520778537 520499468 519960761 519079149 518551290 518371284 517929196 517576396 517327368 516849399 516308188
1929.5 516308188 515791714 515326917 514876246 514246166 513422430 512826383 512614429 512349963 511874199 511323273
1949.9 511323273 510776520 510248482 509756207 509291530 508793712 508225620 507593453 507083416 506766319 506354749
1970.3 506354749 505803406 505290568 504809141 504346490 503878593 503344953 502782822 502209425 501591980 501082897
1990.7 501082897 500761569 500361621 499839514 499351144 498889148 498401344 497867346 497354537 496880621 496375054
2011.1 496375054 495808005 495210707 494678915 494167030 493484080 492547095 491664231 491340429 491376907 491204351
2031.5 491204351 490802407 490355521 489856422 489324987 488886476 488506347 488096863 487662673 487191051 486715794
2051.9 486715794 486267298 485823512 485379279 484907597 484410375 483993888 483640999 483241946 482801139 482328683
2072.3 482328683 481866032 481441259 481004894 480580240 480172127 479728252 479283422 478860378 478439420 478009015
2092.7 478009015 477540612 477064401 476625413 476197600 475757033 475294828 474822432 474381387 473931432 473458290
2113.1 473458290 473022997 472575039 472090632 471628875 471187085 470759958 470326006 469870210 469429284 468986303
2133.5 468986303 468536586 468109161 467651278 467172742 466757417 466364473 465950042 465529889 465095699 464647532
2153.9 464647532 464196980 463768810 463371128 462953776 462507933 462049007 461577296 461172640 460840851 460474968
2174.3 460474968 460069954 459664613 459253073 458825797 458370537 457916886 457508206 457109183 456696004 456272334
2194.7 456272334 455811292 455343962 454904884 454469889 454038531 453588605 453095376 452619284 452178448 451723754
2215.1 451723754 451238155 450746536 450293541 449848413 449360818 448886633 448430181 447946608 447475106 447021961
2235.5 447021961 446553499 446058184 445540696 445035040 444561452 444100112 443634868 443133086 442596853 442097098
2255.9 442097098 441624105 441146702 440672368 440180451 439683139 439204216 438718170 438224673 437736899 437256694
2276.3 437256694 436824352 436389297 435862988 435276687 434683353 434096694 433519244 432927758 432317942 431706816
2296.7 431706816 431071907 430411637 429698586 428884268 428015202 427178979 426434666 425761759 424987912 424027056
2317 424027056 423073471 422311366 421717227 421039730 420175850 419455707 419008940 418458700 417672694 416931123
2337.4 416931123 416431248 416319370 416965306 417917699 417061388 414169103 411412954 410170227 409840047
2355.8 409840047 409719616 409695417 409802616 410065442 410450757 410914570 411336273 411618143 411769569 411765099
2376.2 411765099 411575556 411218345 410687149 410037905 409381658 408764571 408187181 407638401 407086194 406527251
2396.6 406527251 405967563 405406773 404844284 404272377 403703988 403148413 402596056 402039796 401477277 400900632
2417 400900632 400306731 399702996 399126381 398587078 398036152 397463769 396890610 396320760 395760149 395201266
2437.4 395201266 394620478 394019723 393403441 392794758 392230988 391683251 391118169 390536994 389936298 389345497
2457.8 389345497 388778180 388208807 387637466 387046397 386449248 385887325 385318249 384708673 384096146 383519769
2478.2 383519769 382981032 382439315 381862998 381268919 380681485 380105168 379528761 378950536 378385305 377824396
2498.6 377824396 377258629 376711756 376172632 375605255 375033796 374487728 373959243 373433053 372886807 372331381
2519 372331381 371800244 371273130 370731533 370197505 369666338 369137764 368620992 368108511 367605627 367101103
2539.4 367101103 366584301 366074711 365585655 365111679 364635289 364154696 363682628 363218307 362757087 362295717
2559.8 362295717 361823261 361329943 360827416 360338449 359881073 359441757 358983725 358502805 358008802 357526064
2580.1 357526064 357094824 356674582 356191009 355694652 355246812 354808599 354358256 353886187 353380769 352876663
2600.5 352876663 352399468 351943642 351497591 351039141 350568026 350100011 349647850 349222034 348781735 348312199
2620.9 348312199 347865015 347433746 346992642 346551210 346109152 345679313 345266044 344856203 344440877 343997508
2641.3 343997508 343539745 343116999 342722356 342323422 341940403 341567338 341165453 340758115 340382338 340004921
2661.7 340004921 339587778 339171231 338778526 338379353 337980419 337598234 337199599 336780816 336387873 336013585
2682.1 336013585 335613847 335157722 334668696 334225148 333828360 333412766 332975686 332537770 332091212 331640691
2702.5 331640691 331201077 330773354 330331415 329864830 329405397 328968346 328541726 328121662 327702284 327271104
2722.9 327271104 326846540 326413572 325948030 325497627 325071871 324642211 324222833 323822677 323418915 322997510
2743.3 322997510 322582871 322197676 321808785 321382701 320944190 320522159 320110142 319701046 319282800 318852901
2763.7 318852901 318443418 318053335 317664444 317284822 316898525 316446006 315929592 315437436 314985752 314541221
2784.1 314541221 314119816 313709438 313243449 312710971 312183321 311720997 311269403 310730487 310155272 309621751
2804.5 309621751 309100151 308563024 308006287 307430267 306863934 306335270 305820018 305264413 304653823 304029942
2824.9 304029942 303434283 302855134 302256107 301642358 301041007 300427288 299716651 298866808 297951072 297049016
2845.3 297049016 296158105 295277983 294502705 293910414 293443054 293025374 292609602 292133719 291589200 290988266
2865.7 290988266 290334851 289712697 289190650 288642496 287937313 287188411 286526114 285897553 285254210 284631521
2886.1 284631521 284015298 283371985 282739490 282144636 281557709 280964732 280396700 279862940 279326707 278764635
2906.5 278764635 278210878 277689010 277115911 276381850 275524557 274688303 273966283 273399174 272997379 272775710
2926.9 272775710 272671729 272503525 272252053 272065431 271978050 271928638 271917433 271959424 271995693 271932304 271779984
2949.3 271779984 271639049 271493286 271286249 271090716 270996898 270989716 270985067 270931005 270849288 270778537 270744592
2971.7 270744592 270716429 270634770 270543188 270473391 270362288 270225465 270146936 270121783 270105511 270050079 269905269
2994.2 269905269 269693792 269404948 269045740 268741876 268518269 268284380 268066913 267941386 267797321 267482311
3014.6 267482311 267040759 266589344 266151011 265725553 265309811 264877975 264489293 264227182 264022917 263677657
3035 263677657 263162971 262701392 262367636 261991769 261477321 260947466 260536343 260123342 259585232 259030581
3055.4 259030581 258511096 257986873 257487386 257069200 256738752 256360233 255802602 255183220 254672885 254289597
3075.8 254289597 253957748 253552705 253058791 252539635 251977712 251415610 250880182 250274211 249650106 249141991
3096.2 249141991 248686150 248172805 247587755 246997178 246515304 246090144 245557338 245007709 244611815 244259059
3116.6 244259059 243772224 243099779 242299885 241529644 240896001 240341499 239764810 239179298 238625541 238101363
3136.9 238101363 237546980 236872464 236146912 235483915 234874651 234358251 233921811 233341202 232546404 231749490
3157.3 231749490 231075242 230450630 229804561 229133025 228441998 227764875 227113917 226441503 225763395 225151062
3177.7 225151062 224552065 223881453 223193705 222533509 221876249 221219108 220539227 219812229 219084680 218413919
3198.1 218413919 217792094 217178822 216528922 215803653 215057939 214374617 213749707 213135004 212489948 211838916
3218.5 211838916 211187959 210489020 209791616 209182188 208646506 208155498 207634121 206955373 206195235 205512449
3238.9 205512449 204885468 204306930 203819692 203283831 202599689 201914281 201347768 200835928 200260907 199629068
3259.3 199629068 199028492 198486984 197974384 197506294 197088569 196602508 196013123 195386440 194743663 194141939
3279.7 194141939 193603814 193076730 192534074 192011878 191578761 191187888 190702707 190094709 189436346 188826248
3300.1 188826248 188377410 188051328 187629461 186988935 186181322 185368717 184677109 184054896 183427855 182779804
3320.5 182779804 182137132 181536466 180905282 180189103 179453433 178763315 178182557 177688763 177102715 176385924
3340.9 176385924 175658658 174934730 174248934 173672080 173056155 172263876 171468362 170840934 170297176 169693202
3361.3 169693202 169073611 168604001 168226302 167666510 166853011 166040778 165398628 164827958 164229259 163629636
3381.7 163629636 163102314 162631959 162188709 161818668 161447376 160918921 160362884 160016239 159734890 159226000
3402.1 159226000 158562243 158019990 157626584 157263368 156886503 156458110 155985981 155583844 155314878 155078501
3422.5 155078501 154807627 154584646 154415533 154228866 154059872 153925419 153705418 153339311 152992949 152751312
3442.9 152751312 152591884 152597144 152599722 152446359 152313620 152243406 152193666 152191222 152238980 152336672 152489319
3465.3 152489319 152661353 152686328 152539372 152431458 152448729 152501717 152584121 152732849 152846694 152910292
3485.7 152910292 153022408 153144315 153209880 153315842 153518647 153640926 153645024 153846994 154172912 154199481
3506.1 154199481 154193804 154508516 154854566 154981673 154996663 155012548 155080855 155346036 155705690 155981198
3526.5 155981198 156341821 156695098 156818807 156977087 157314926 157511324 157474384 157559901 158109367 158814281
3546.9 158814281 158993289 159029007 159480587 159840241 159901872 160024688 160042375 159592733 159708053 161506653
3567.3 161506653 163074285 163018927 162737697 162999183 163457900 163907841 164020687 163571015 163714662 165530846
3587.7 165530846 166880697 166587844 166620389 167493328 168155938 168670669 169096619 168767378 168387190 169270590
3608.1 169270590 170573920 171317101 171577081 171332702 172359407 174623162 174932122 172973141 171578392
3626.4 171578392 174447313 178329974 178558141 178074956 178270638 178492546 178653151 178055614 176448077
3644.8 176448077 176141053 179877460 183831125 183359250 182346076 183762923 184621722 184214592 183790550
3663.2 183790550 182653591 181377470 182606548 184092373 183491349 185767159 188845024 188373178 187057152
3681.5 187057152 185435608 183468848 183941230 187339336 189123094 188393012 187276244 186411038 186331436
3699.9 186331436 187606826 188140526 186557293 184918568 185686916 188676730 189620063 187826246 186079681
3718.2 186079681 185393587 185293153 185443923 185528696 184139609 181882173 181299925 183273554 185969263
3736.6 185969263 185745239 182152882 180645108 184269384 185338169 183982760 186799064 189695463
3752.9 189695463 188438565 186688125 187173888 187792495 186850712 186165109 186262488 187176809 188320130
3771.2 188320130 187839046 186375216 185815960 186691955 187151998 186681643 186660767 186706856 186314628 185535938
3791.6 185535938 184579432 184215888 183491990 183293670 185469806 185803607 185237572 186609641 186000273
3810 186000273 183005422 181446940 182688639 182971522 183438703 185776904 185533643 183965772 182943135
3828.4 182943135 182021618 181437969 180635795 180918455 183070362 184124619 183874562 183451965 181696042
3846.7 181696042 178064421 175182879 179033369 185784012 185217872 181520268 179417521 179471582 179981083
3865.1 179981083 179121360 179360211 181093737 181468293 180721611 179050401 178323627 178839684 178632036
3883.4 178632036 179358840 179576933 178507939 179165140 179530621 177476987 175671726 175851241 177259460
3901.8 177259460 179111913 179976344 178999841 177669704 176738977 175912514 175886169 176689640 176902533
3920.1 176902533 176372513 176253662 176279679 175646499 175326899 175922304 176165670 175546199 174765527 174375623
3940.5 174375623 174574703 174601793 174217701 174240962 174432367 174207911 173817649 173545972 173350155 173270464
3960.9 173270464 173250869 173043832 172754392 172563031 172407061 172303200 172273710 172160417 171914682 171712920
3981.3 171712920 171623930 171475768 171215340 171018705 170909807 170778155 170639396 170488045
3997.6 170488045
##END=$$ End of the data block
