##TITLE=AC3 $$ Begin of the data block
##JCAMP-DX=5.00 $$ ACD/SpecManager v 10.08
##SPECTROMETER/DATA SYSTEM=Alpha
##DATE=04 Dec 2015 11:34:10
##DATA TYPE=INFRARED SPECTRUM
##DATA CLASS=XYDATA
##ORIGIN=
##OWNER=
##NPOINTS=1765
##FIRSTX=399.76428223
##LASTX=3997.64306641
##MAXX=3997.64306641
##MINX=399.76428223
##MAXY=0.86076975
##MINY=0.22063087
##XFACTOR=1.0000000000
##YFACTOR=1.000000000000000e-9
##FIRSTY=0.76649255
##DELTAX=2.03961372
##XUNITS=1/CM
##YUNITS=ARBITRARY UNITS
##XYDATA=(X++(Y..Y))
399.8G66492546j836777l740072m085958j610637J79469P02858O03497j233518m572868
418.1G50898540p103801q323431r667575q211076l576339K945304J0291457J3159037
434.4G40412116R840906N943417M103184J626551M8995Q49903K26497j173079l54528
452.8G61523962L37601r09150j163065o77824j641870j630425q03233j631796k325773
471.2G51078427j776993k499938l964842m718661p186413j0408461n990565M429817
487.5G18962371P749915L084481k422750p732391j3982058k2731542l2435894k1583021
503.8F28909111J6577423M2940020L4531534J5482426M493832j781344o852687j2027263
520.1G22273052j7857790j5694797L373205K1759808J9560934Q506357J758397j070082
$$ y = [766492546, 764655769, 760915697, 756829739, 755219102, 755398571, 756101429, 756704926, 755471408, 750898540, 743794739, 735471308, 725803733, 717592657, 714016318, 716961622, 727253079, 740412116, 750253022, 756196439, 760299623, 761926174, 761975169, 762825072, 763051569, 761878490, 761523962, 761861563, 760952413, 759789348, 759111524, 757469654, 755839229, 755035996, 753404200, 751078427, 749301434, 746801496, 742836654, 738117993, 730931580, 720523119, 714532554, 718962371, 726712286, 729796767, 727374017, 719641626, 705659568, 682928026, 650492132, 628909111, 645486534, 688426554, 722958088, 738440514, 742934346, 741153002, 734300315, 722273052, 704415262, 688720465, 692093670, 713853478, 733414412, 741920769, 743679166, 742609084]
536.4G42609084j805783j691103k308011l028214k916753l189504m244328m746258
552.7G18679130n353272p126450r329379j2125671j7051339k3412764k4417520q987426
569.1F10875309J7583072K9620766J7297328n050957j8145204p411182J7340243K4033844
585.4F86143219Q167685r554029k2644699l2875537l3536435j2073636K7252913N2596867
601.7F63476348M5679986K5057197J0755897M107117O71625n30481m72784j015067
618G47729838j218557o45400j137852k304435k546489k973378m099786m899383n477071
636.4G22427487n491912n846262r101629j7203748l0845345l9714694j3959944M0277660
652.7F40541613O2259138L7265181Q961380k090216l880322l949165n041480o375313
$$ y = [742609084, 740803301, 739112198, 736804187, 733775973, 730859220, 727669716, 723425388, 718679130, 713325858, 706199408, 696870029, 684744358, 667693019, 644280255, 619862735, 610875309, 628458381, 658079147, 675376475, 670325518, 652180314, 644769132, 662109375, 686143219, 694310904, 684756875, 662112176, 629236639, 595700204, 583626568, 610879481, 663476348, 709156334, 734213531, 744969428, 749076545, 749748170, 749217689, 748744905, 747729838, 746511281, 745865881, 744728029, 742423594, 739877105, 736903727, 732803941, 727904558, 722427487, 716935575, 711089313, 701987684, 684783936, 653938591, 614223897, 600263953, 640541613, 702800751, 740065932, 749027312, 746937096, 743056774, 739107609, 734066129, 727690816]
669G27690816n273521m909813m827977m537463n010247m436731k788842j697183k51233
687.3F93957806K159416L302276L118098L160358K280533n5194j767337l560603p896066
705.7F94699287j1222779p367373J71781K488672l19123l841877o286323o922603p952153
724.1F53447509j1391103j5320540j9363880k6009202l0940712j9141912J2736082
738.3E44016242L5957217K7938903N104720j0785043j7305613j9823551k1997094k3431361
754.7E19674420k1924704j5821785l149539J3494551K4925560K7023077K5529623K4498701
771E94249904K2135794J7687440J2113691M117190q428931k5316775l5382390j7145097
787.3E64030826K2819638M5658648L8422943K2092163J0717273K753675n187571j3204694
$$ y = [727690816, 722417295, 717507482, 712679505, 708142042, 703131795, 698695064, 695906222, 694209039, 693957806, 696117222, 699419498, 702537596, 705697954, 707978487, 707923293, 706155956, 702595353, 694699287, 683476508, 676109135, 676280916, 678769588, 678450465, 674608588, 668322265, 661399662, 653447509, 642056406, 626735866, 607371986, 581362784, 550422072, 531280160, 544016242, 579973459, 607912362, 613017082, 602232039, 584926426, 565102875, 543105781, 519674420, 497749716, 481927931, 478778392, 492272943, 517198503, 544221580, 569751203, 594249904, 616385698, 634073138, 646186829, 650304019, 641875088, 616558313, 581175923, 564030826, 586850464, 632509112, 670932055, 693024218, 703741491, 706495166, 701307595, 688102901]
803.6F88102901k1109641k4807274j3443291R694755K0048022R282947n414605p699609
819.9F54654205P006824K3304343K0779073L214062j2230754j2756169M380941K0053506
836.2G08406031J6050518K367079o951809j1814177j4953613j4175952l988266J2898505
852.6F87838316K3102820K0185828J1094630K781689k963722o332576r489179j3683021
868.9G12534785j5472054r304285M619896J6888380J8978834J3091743O520808K884030
885.2G50742137J135707k56300p62283m84646o70135j014590q03769q91030j397430
903.5G45597661j321018j148343j582682j792252j574457j842022k265811k343059
919.9G31728017k786457l500760l137648j630962m87327m04656j304567l337801o180405
$$ y = [688102901, 666993260, 642185986, 628742695, 638437450, 658485472, 667768419, 662353814, 654654205, 661661029, 684965372, 705744445, 708958507, 696727753, 683971584, 688352525, 708406031, 724456549, 726823628, 719871819, 708057642, 693104029, 678928077, 674939811, 687838316, 710941136, 731126964, 742221594, 745003283, 742039561, 735706985, 726217806, 712534785, 697062731, 687758446, 692378342, 709266722, 728245556, 741337299, 747858107, 750742137, 751877844, 751621544, 750859261, 750374615, 749704480, 748689890, 747886121, 746995091, 745597661, 744276643, 743128300, 741545618, 739753366, 738178909, 736336887, 734071076, 731728017, 728941560, 725440800, 722303152, 720672190, 720184863, 719780207, 718475640, 715137839, 708957434]
938.2G08957434o633520r19342O031632N808115R50038k261161l295601l941536n912661
956.6F98783398j0389030j3159395l327846J1756897J1709869J795470l467500m477739
972.9F89224124m681528n115986n739092o067992o029248n402267m243314l599107
989.2F48345590m289329n948306q226037j0721147j1318206o591142L485620J2217105
1005.5F16954148J2925446O878972l36945n698025j0737360j8789232k1425724j0098397
1021.8E69672883l619254j2990892j7383933m835188J4409303K6676178K7113855K0078361
1038.2F19121313J1806786N742788K174795K18988q13365j189053j373351j827955
1054.5F33860946k663315l662705m522860n102694n505920n910873o275177o625831
$$ y = [708957434, 702323914, 701404572, 707436204, 713244319, 714194357, 711933196, 708637595, 704696059, 698783398, 688394368, 675234973, 671907127, 683664024, 695373893, 697169363, 693701863, 689224124, 684542596, 679426610, 673687518, 667619526, 661590278, 656188011, 651944697, 648345590, 644056261, 638107955, 629881918, 619160771, 607842565, 601251423, 604737043, 616954148, 629879594, 636758566, 636421621, 630723596, 619986236, 601197004, 579771280, 569672883, 566053629, 553062737, 535678804, 530843616, 545252919, 571929097, 599042952, 619121313, 630928099, 636670887, 638845682, 639064670, 638251305, 637062252, 635688901, 633860946, 631197631, 627534926, 623012066, 617909372, 612403452, 606492579, 600217402, 593591571]
1070.8E93591571p124365p883667q751393r731889j0894596j2037277j2839735j2979031
1087.1E11349618j2246936j0996997j0386438j1204898j3120502j5610129j8601388
1101.4D19182330k1672994k3760080k3592979k0342558j6031623j5037000j5998274
1115.7B82746822j1135787p3999J0191917K2154331M1259885N9259623O6104234O2150955
1132E32657981N1326692L6203265J9628763N166948n127370j1545181j5438021j8176972
1148.3E94696105k0540536k2576570k4002314k4142802k2944599k2595406k5422990
1162.6D32470888l0598849l5327166l8524539m0532470l7925794k2596598N155102
1176.9B32120574K4134278J4414191r096265j3354689M756272J3490349k042174j7254427
$$ y = [593591571, 586467206, 578583539, 569832146, 560100257, 549205661, 537168384, 524328649, 511349618, 499102682, 488105685, 477719247, 466514349, 453393847, 437783718, 419182330, 397509336, 373749256, 350156277, 329813719, 313782096, 298745096, 282746822, 271611035, 271537036, 281728953, 303883284, 345143169, 404402792, 470507026, 532657981, 583984673, 620187938, 639816701, 644983649, 639856279, 628311098, 612873077, 594696105, 574155569, 551578999, 527576685, 503433883, 480489284, 457893878, 432470888, 401872039, 366544873, 328020334, 287487864, 249562070, 226965472, 232120574, 256254852, 270669043, 261572778, 248218089, 252974361, 266464710, 264422536, 247168109]
1193.2B47168109j3578430k64063J2231618K4016484L5678834M3715775M5549542M2367220
1209.5D36885089L6802709L0927270K5893212K1686673J8145800J5452563J3193787
1223.8E98987103J1110365R895384R544850Q910119P320523M466415l51131o505728
1240.1F43377900j1261105j3057471j2731671r708703k180993N875766P588267M517794
1256.4F12419784K533615J694739O84440J113355K199352m0651p674634j8591225k9256523
1274.8E65082252l8406014m5646012m6228469l1414330Q60721L7222713N8386147N7886482
1291.1E57743490M5002818K9681086J2887478p869065k3354053j4222145J2518048
1305.4F12387657K3556471J2099087k469361j1075556j5389621j9185841k5123239
$$ y = [247168109, 233589679, 233325616, 245557234, 269573718, 305252552, 348968327, 394517869, 436885089, 473687798, 504615068, 530508280, 552194953, 570340753, 585793316, 598987103, 610097468, 619992852, 629537702, 638447821, 645768344, 650234759, 649883628, 643377900, 632116795, 619059324, 606327653, 596618950, 594437957, 600313723, 607901990, 612419784, 614953399, 616648138, 617332578, 618445933, 620645285, 620604634, 612930000, 594338775, 565082252, 526676238, 481030226, 434801757, 403387427, 404248148, 441470861, 499857008, 557743490, 602746308, 632427394, 645314872, 637445807, 614091754, 599869609, 612387657, 635944128, 648043215, 645573854, 634498298, 619108677, 599922836, 574799597]
1319.6E74799597l1276405l4392356l0765385j4443129J1912703K8023541J9488991
1333.9E23347557L963589Q137584L0291021M4383824M1380882L0442238J7651319O980837
1350.2G06578851r03726p707775j4031827j9124865k4767817l3249259l9781153m1416347
1366.6E25596082l6933630j6491145J4130830L3875108L2611191K2634387R187937
1380.8E84610760o374836j5950978j8244445j5018701q665264n00500J0383248J6819000
1397.1E47058284J4868260Q981764L679454O4135k809525m559099n354226n363107
1413.5E56565940n168974n961776p542431o960273n417645l628552o73234J897096
1429.8E23110151K723873J496851k373874q538306j2539506j5947222j8583238j8208862
$$ y = [574799597, 543523192, 509130836, 478365451, 463922322, 475835025, 503858566, 523347557, 527311146, 535448730, 565739751, 610123575, 651504457, 681946695, 699598014, 706578851, 705675125, 697967350, 683935523, 664810658, 640042841, 606793582, 567012429, 525596082, 488662452, 472171307, 486302137, 520177245, 552788436, 575422823, 584610760, 578235924, 562284946, 544040501, 529021800, 520356536, 519856036, 530239284, 547058284, 561926544, 570908308, 574587762, 574651897, 571842372, 567283273, 561929047, 556565940, 551396966, 545435190, 537892759, 530932486, 525514841, 521886289, 521213055, 523110151, 525834024, 527330875, 524957001, 516418695, 503879189, 487931967, 469348729, 451139867]
1446.1D51139867j6280949j3802916j0498762n654514l553301q022606r855598p747829
1462.4C75723392m162878K296001Q183479J2976378J9515068K4021208K6082963K7381330
1478.7D92016941K7398736K5533199K1366656J8294573J6414284J2727738Q182525
1493F21934652O657839O454170L873765L69907k430439r820104k6801705k0560503
1509.3E79677582O418288K5362670K8500915K0249187R813011L739119J295447Q18968
1525.6F75875187M39942l81589j759768m411757n200922n039752q786976j2215912
1542F38518453j1368513j1243642j1487484j2964666j4261007j5041173j5419363k3534775
1558.3E23197830l2800257k3707927k3122102k7305424l1797945l6019445k7465731
$$ y = [451139867, 434858918, 421056002, 410557240, 404902726, 401349425, 393326819, 383471221, 375723392, 371560514, 373856515, 382039994, 395016372, 414531440, 438552648, 464635611, 492016941, 519415677, 544948876, 566315532, 584610105, 601024389, 613752127, 621934652, 628592491, 635046661, 638920426, 639290333, 636859894, 627039790, 600238085, 579677582, 586095870, 611458540, 639959455, 660208642, 670021653, 673760772, 675056219, 675875187, 676315129, 675933540, 674173772, 669762015, 664561093, 659521341, 650734365, 638518453, 627149940, 615906298, 604418814, 591454148, 577193141, 562151968, 546732605, 523197830, 490397573, 466689646, 443567544, 416262120, 384464175, 348444730, 320978999]
1572.6C20978999j2219578Q664936K1317512J7975419J8707097K9874027M1498482
1586.8D46796894M3720633L8598329L1450629K4584711J8259108J3002991R031356
1601.1F25444651N690932K631068l58105l125965l774405j929938p4625p54834k805412
1619.5F20943367n118012q562207j0203719r904564q160114m655063k939999n897105
1635.8E65502584r486556j1109710j3463855j6352713k2884369k6534646j7545253
1650.1D48125482r367854l121406j298219n830049j3807505k6003868l4393936l4632862
1666.4C19669783l9081097l9309814k0648003J009420J7355800K4841129K7995736
1680.7B91832954L5663455M8403114M0295959K9844582K7934432K3204625K2126764
$$ y = [320978999, 308759421, 317424357, 338741869, 356717288, 375424385, 405298412, 446796894, 490517527, 529115856, 560566485, 585151196, 603410304, 616413295, 625444651, 631135583, 633766651, 633408546, 630282581, 626508176, 624578238, 624503613, 623748779, 620943367, 615825355, 607263148, 597059429, 587154865, 578994751, 574339688, 571399689, 565502584, 556016028, 544906318, 531442463, 515089750, 492205381, 465670735, 448125482, 438757628, 435636222, 434338003, 428507954, 414700449, 388696581, 354302645, 319669783, 280588686, 241278872, 220630869, 221640289, 238996089, 263837218, 291832954, 327496409, 375899523, 416195482, 446040064, 473974496, 497179121, 519305885]
1694.9E19305885K1722078J7797828J6069233J0923267Q120537R442210J1363148J4346481
1711.3F29090667J7603159K1118641K4643719K1202922J4950931J3046562J1996389
1725.5G53652990J0215819R269535Q185208P576704N794943L811538L434419L170610
1741.9H05111766K841174K753795K817332K785445K498626K339065K784074K941608
1758.2H26872885K714336K592087K396643K426267K645314K747952K479017J994431
1774.5H46868932J993716K290130K023458J365364O68585k22385j039564j443923n95093
1792.8H51909220J350343K241672J735210J125932R66012Q48472M97282R5606j82808
1811.2H60586941l03328k14577r2089O914L3319O5446M5240l0160l96788p48575n08070
$$ y = [519305885, 541027963, 558825791, 574895024, 585818291, 593938828, 603381038, 614744186, 629090667, 646693826, 667812467, 692456186, 713659108, 728610039, 741656601, 753652990, 763868809, 773138344, 781323552, 788900256, 794695199, 798506737, 801941156, 805111766, 807952940, 810706735, 813524067, 816309512, 818808138, 821147203, 823931277, 826872885, 829587221, 832179308, 834575951, 837002218, 839647532, 842395484, 844874501, 846868932, 848862648, 851152778, 853176236, 854541600, 855210185, 854987800, 853948236, 852504313, 851909220, 853259563, 855501235, 857236445, 858362377, 859328389, 860176861, 860674143, 860769749, 860586941, 860283613, 860069036, 859976947, 859983861, 860017180, 860082626, 860127866, 860097706, 859700918, 858952343, 858444273]
1833.6H58444273k44915j89185r9361j41442p95662j487077j559496j379668r00388
1852H51647079k91407K2530R6500J35064N1439J7643Q9109l39210j213670j405775
1872.4H48809302j199484j220524j239896j014590o97494m22060k19524o20544j777232
1890.7H40397954l041565m710496o848693o918847k234400M616201P541180N899608
1907.1H34700942L308833J452624N88775M08530P2062m72724n61655m64856n55814
1925.4H38476717o23345o37352p15137p28190n50032l50832j74821j12593m04596q36194
1945.8H33343625j057446j110256j184284j175523r95279r99629j211107j119971o56843
1964.2H23833287l47793l41595l41892l18765k08915P2301K02954O7412P511j3590
$$ y = [858444273, 858199358, 858010173, 857910812, 857769370, 856973708, 855486631, 853927135, 852547467, 851647079, 851355672, 851378202, 851474702, 851609766, 851661205, 851678848, 851767957, 851428747, 850215077, 848809302, 847609818, 846389294, 845149398, 844134808, 843437314, 843015254, 842795730, 842175186, 840397954, 837356389, 832645893, 825797200, 818878353, 816643953, 821260154, 828801334, 834700942, 838009775, 839462399, 840051174, 840459704, 840531766, 840059042, 839497387, 839032531, 838476717, 837853372, 837216020, 836500883, 835772693, 835222661, 834871829, 834697008, 834584415, 834179819, 833343625, 832286179, 831175923, 829991639, 828816116, 827820837, 826821208, 825610101, 824490130, 823833287, 823485494, 823143899, 822802007, 822483242, 822274327, 822346628, 822549582, 822616994, 822624505, 822610915]
1984.6H22610915j82927k50816k04802l91841n69105m23551k94745k96890j52767N7459
2005H19900930J2278j14917j30058k67088n21183o77764q64327j128793j214087r64642
2025.4H14030349m31835j3769Q8394k1637j74820j69456j90735l73125m27902l44753
2045.8H11970711l97802m21404k91288k71380l05236j16288Q8095R1553J11759J30474
2066.2H10589194m6909k26259k20716k57790l86953l98398l84509n14150n90920n47588
2086.6H07015002o34670p85888q32140r08852j000404q62360o42538n82636n43832
2104.9H00221682m57228m72903m48882j97173J4484M4048R8825J88410J29878O9380
2125.3G99190521J42753J57416J06275J37151J57535J07169J51992K07066Q1361r0361
$$ y = [822610915, 822427988, 822177172, 821972370, 821580529, 821011424, 820587873, 820293128, 819996238, 819843471, 819900930, 819913208, 819798291, 819668233, 819401145, 818879962, 818202198, 817337871, 816209078, 814994991, 814030349, 813598514, 813584745, 813673139, 813651502, 813476682, 813307226, 813116491, 812743366, 812315464, 811970711, 811572909, 811151505, 810860217, 810588837, 810283601, 810167313, 810255408, 810346961, 810458720, 810589194, 810542285, 810316026, 810095310, 809837520, 809450567, 809052169, 808667660, 808153510, 807562590, 807015002, 806380332, 805594444, 804762304, 803853452, 802853048, 801990688, 801348150, 800765514, 800221682, 799764454, 799291551, 798842669, 798645496, 798659980, 798704028, 798802853, 798991263, 799121141, 799190521, 799333274, 799490690, 799596965, 799734116, 799891651, 799998820, 800150812, 800357878, 800439239, 800348878]
2145.7H00348878j72854l05116m60624m63248m03523l76821k90334k06709k84910m25339
2166.1G96959400m85182m56392m18008l94583l27944k34306j14322j9431o5327j77800
2186.5G94266105k24054k95818m32134m66704m21703m50849m83692m59969m96805n51283
2206.9G89983094n12302n25177o72579q00371q84831r95755j051605j003503r46880
2225.2G82590091r00268p76649n98669l90172n3525K95520M15981L65555L10302K66075
2245.6G81524241K20001K08735K02596J48714Q3446N0307J7881j0669j79k861m0233
2268.1G82401979o0618j07467k43485l62933m11212m87805n51581n08070m57108m53174
2288.5G78758526m22836l66032l33666l04223k38597k16961k68340l10302l24726l00288
$$ y = [800348878, 800176024, 799870908, 799410284, 798947036, 798543513, 798166692, 797876358, 797669649, 797384739, 796959400, 796474218, 796017826, 795599818, 795205235, 794877291, 794642985, 794528663, 794509232, 794443905, 794266105, 794042051, 793746233, 793314099, 792847395, 792425692, 791974843, 791491151, 791031182, 790534377, 789983094, 789470792, 788945615, 788273036, 787472665, 786587834, 785592079, 784540474, 783536971, 782590091, 781689823, 780913174, 780314505, 779924333, 779870808, 780166328, 780582309, 780947864, 781258166, 781524241, 781744242, 781952977, 782155573, 782304287, 782387733, 782438040, 782455921, 782445252, 782445073, 782442212, 782401979, 782341361, 782233894, 781990409, 781627476, 781216264, 780728459, 780176878, 779668808, 779211700, 778758526, 778335690, 777969658, 777635992, 777331769, 777093172, 776876211, 776607871, 776297569, 775972843, 775672555]
2308.9G75672555j36972J41085L32355L67224L08514J91927O7592N2035Q4280k1159
2329.3G77059436k26200l81529n35786o81758o88553o75619q46982r98437o13809o7472
2349.7G71343291R2208j05679m35233p59304r63091j042903j129925j227021j216531
2368G64555812j094878r12547o58691m47154l51787k90632k14696j66297j27196k3246
2388.4G60268688R0122J75417K55406K64108J98245J50025J08838J9312o2585o3598
2408.8G61403978k9326m7922r7394j51753k53678l88145m93526n62907n95033n79119
2429.2G58205175n81145o60479p48336p72953q07941q81970r08911q55744p42734n76496
2449.6G50668466l75211j81556j490J35958J36137M4227o437p2420k27451l77834m82142
$$ y = [775672555, 775535583, 775676668, 776009023, 776376247, 776684761, 776876688, 776944280, 776996315, 777080595, 777059436, 776833236, 776451707, 775915921, 775234163, 774545610, 773869991, 773023009, 772024572, 771410763, 771343291, 771435499, 771329820, 770894587, 770135283, 769172192, 768129289, 766999364, 765772343, 764555812, 763460934, 762548387, 761889696, 761442542, 761090755, 760800123, 760585427, 760419130, 760291934, 760268688, 760358810, 760534227, 760789633, 761053741, 761251986, 761402011, 761510849, 761530161, 761467576, 761403978, 761374652, 761326730, 761229336, 761077583, 760823905, 760435760, 759942234, 759379327, 758784294, 758205175, 757624030, 756963551, 756215215, 755442262, 754634321, 753752351, 752843440, 751987696, 751244962, 750668466, 750293255, 750111699, 750110209, 750246167, 750382304, 750426531, 750420094, 750347674, 750120223, 749742389, 749260247]
2472G49260247o03080p16567p54714p52926p37727o88672o61015o61791o06179n27561
2492.4G42550015m55141k59816R2625M15802N46277N15640L76701J65999L6538L0398
2512.8G44015038J8656k265K6524M7148L5762M4465M5836j3828p9393q9467j34706
2535.3G43913770k23398k40624k68877l79801m55737n10335o23584p07447p42614q11100
2555.6G38950253q52526p91192p36952p60197p43747p18176q36134r75073r85086r76145
2576G30575025r46522p68959n45502l91543j78516J49787M51803O63519P75575O97077
2596.4G30481744M67479K97964K25246J38282J2219j54018l72112n58734o51002p47025
2616.8G29140043q33809q14259p96318q98719j026988j062632j006066q75712p05182
$$ y = [749260247, 748657167, 747940600, 747185886, 746432960, 745695233, 745006561, 744345546, 743683755, 743077576, 742550015, 742094874, 741835058, 741927683, 742343485, 742889762, 743405402, 743782103, 743948102, 743984640, 744015038, 744033694, 744031429, 744057953, 744105101, 744140863, 744185328, 744231164, 744217336, 744137943, 744048476, 743913770, 743690372, 743449748, 743180871, 742801070, 742345333, 741834998, 741211414, 740503967, 739761353, 738950253, 738097727, 737306535, 736569583, 735809386, 735065639, 734347463, 733511329, 732536256, 731551170, 730575025, 729628503, 728859544, 728314042, 727922499, 727743983, 727893770, 728345573, 729009092, 729784667, 730481744, 730949223, 731247187, 731472433, 731610715, 731622934, 731468916, 731096804, 730538070, 729887068, 729140043, 728306234, 727491975, 726695657, 725796938, 724769950, 723707318, 722701252, 721825540, 721120358]
2635.2G21120358n90921n10156l47972k23875k44021k43128j26719J6510J55211L08811
2655.6G19314098L53456K41101J50144R4473n5313j93119k40207l27646m28319m20690
2676G18487978m19557n07355n49376n48243o16610p03156p38562q15153q93533q06034
2696.4G11890399o94096p37846p97808q17001q90553r42170r24707r46879r97841j023293
2716.8G03118205j160145j483798j901150k264976k197802j331568k9743Q46565J012385
2735.1F94607973P90835L91721q4579m48227o59704q00192q43585p88271p36654p21514
2755.5F90707803o98090o98685p75159q77499r75609j083374j121998j037657r26793
2773.9F82512939q63969p97451p06613o21557n19812m31180m18902l98993k83480j90735
$$ y = [721120358, 720529437, 720019281, 719671309, 719447434, 719203413, 718960285, 718833566, 718850076, 719005287, 719314098, 719667554, 719908655, 720058799, 720153272, 720097959, 719904840, 719664633, 719336987, 718908668, 718487978, 718068421, 717561066, 717011690, 716463447, 715846837, 715143681, 714405119, 713589966, 712696433, 711890399, 711196303, 710458457, 709660649, 708843648, 707953095, 707010925, 706086218, 705139339, 704141498, 703118205, 701958060, 700474262, 698573112, 696308136, 694110334, 692778766, 692749023, 693595588, 694607973, 695398808, 695790529, 695705950, 695257723, 694598019, 693797827, 692954242, 692165971, 691429317, 690707803, 690009713, 689311028, 688535869, 687658370, 686682761, 685599387, 684477389, 683439732, 682512939, 681648970, 680851519, 680144906, 679523349, 679003537, 678572357, 678153455, 677754462, 677470982, 677280247]
2794.3F77280247k12014k87294m22656o15359p97272r97006j234115j420855j510680
2812.6F69782996j570046j647115j694440j733065j792312j808583j836658j979351
2828.9F55721426k183795k392769k633273k882243l130674l396988l584206l639698
2845.3F31877780l605306l496468l297627l000617k704263k521992k486050k669215
2861.6F08096242l144264l879130m612029m416227k294183P58350K257526J472592
2877.9E94238877j92702j492738k192080k480448k634942k838492l054262l245890
2894.2E76107323l464758l606737l202259j813710J18673J461863J725018J485646
2910.5E68811059J336873J152336M99427n87046j423120j304746l72648K21848m17232
$$ y = [677280247, 677068233, 676780939, 676358283, 675742924, 674945652, 673948646, 672714531, 671293676, 669782996, 668212950, 666565835, 664871395, 663138330, 661346018, 659537435, 657700777, 655721426, 653537631, 651144862, 648511589, 645629346, 642498672, 639101684, 635517478, 631877780, 628272474, 624776006, 621478379, 618477762, 615773499, 613251507, 610765457, 608096242, 604951978, 601072848, 596460819, 592044592, 589750409, 590508759, 592766285, 594238877, 594046175, 592553437, 590361357, 587880909, 585245967, 582407475, 579353213, 576107323, 572642565, 569035828, 565833569, 564019859, 564138532, 565600395, 567325413, 568811059, 570147932, 571300268, 571799695, 571212649, 569789529, 568484783, 568112135, 568333983, 567916751]
2928.9E67916751j788080k349198o67214K746761N119562M609704K373636L31282r41932
2947.2E77351272j716673k262891k726674l239453l900826m682600n574763o618261
2963.6E46629131p352650o909311n403042m298091m641235n727529n793989l672779
2979.9E02830505p033L171027M455745M311264M160702M668295N345106N558491N120635
2998.2E39614737M360616L731430L297925L031134K871156K448380J454592Q0645j280427
3016.6E59610188k400875l176034l496170k982139r01044K746463O214798P576286
3032.9E63191473O807745N276620L896535K597272J225889Q4400n02825n00738j59025
3051.3E81917346K59101P68661J287997J372576P12693m91023j827002l005147l850579
$$ y = [567916751, 566128671, 563779473, 563112259, 565859020, 570978582, 575588286, 577961922, 578293204, 577351272, 575634599, 573371708, 570645034, 567405581, 563504755, 558822155, 553247392, 546629131, 539276481, 532367170, 526964128, 522666037, 518024802, 512297273, 506503284, 502830505, 502823472, 505994499, 510450244, 514761508, 518922210, 523590505, 528935611, 534494102, 539614737, 543975353, 547706783, 551004708, 554035842, 556906998, 559355378, 560809970, 560890615, 559610188, 557209313, 554033279, 550537109, 547554970, 546653926, 549400389, 555615187, 563191473, 569999218, 575275838, 579172373, 581769645, 582995534, 583079934, 582577109, 582076371, 581917346, 582176447, 582945108, 584233105, 585605681, 586318374, 585827351, 584000349, 580995202, 577144623]
3069.6E77144623m341126m573822m658520m813015n187512n580246n812884n981862
3085.9E36195636o039381n862355n528808n038142m415930l857374l399968k820820
3102.2D99232858j903444o90431O47277K043575L515035M933179O051659O733656O903052
3120.6E27466416O511450N621255M361629K836287J164854m91619j942218l009140
3136.9E42518914l674686m129648m575313n046546n600095o353438p199764p913291
3153.2D98026133q453846q755088q628786q086741p348060o537348n655855m622907
3169.6D39937502l272772j526951M83900K509951M302472N714953O778121P509232
3185.9D62436408P891297P992059P904261P685870P375837O976783O507754O016255
$$ y = [577144623, 572803497, 568229675, 563571155, 558758140, 553570628, 547990382, 542177498, 536195636, 530156255, 524293900, 518765092, 513726950, 509311020, 505453646, 502053678, 499232858, 497329414, 496638983, 497286260, 499329835, 502844870, 507778049, 513829708, 520563364, 527466416, 533977866, 539599121, 543960750, 546797037, 547961891, 547470272, 545528054, 542518914, 538844228, 534714580, 530139267, 525092721, 519492626, 513139188, 505939424, 498026133, 489572287, 480817199, 472188413, 464101672, 456753612, 450216264, 444560409, 439937502, 436664730, 435137779, 435621679, 438131630, 442434102, 448149055, 454927176, 462436408, 470327705, 478319764, 486224025, 493909895, 501285732, 508262515, 514770269, 520786524]
3202.2E20786524N509376N000890M512131M043877L606379L234327K921939K665400
3218.5E52280843K456606K284348K191901K216101K335310K485632K519310K341866
3234.8E71111917K183438K193689K180755K034843J809895J482129J063645P30157
3251.1E84790468N32449K65598j75894o07907r50098j275599j565457j812398k102077
3269.5E77099085k507448k962530l391385l819823m237652m654527n095422n474448
3285.8E44955850n721689n795657n705893n527199n383253n527615o147325p261306
3302.1D97885913q850783j0826052j3000667j5195220j7279387j9036382k0090580
3316.4C93606842k0015806j8216193j4078051p350683J594484J1472642K0354241K6630283
$$ y = [520786524, 526295900, 531296790, 535808921, 539852798, 543459177, 546693504, 549615443, 552280843, 554737449, 557021797, 559213698, 561429799, 563765109, 566250741, 568770051, 571111917, 573295355, 575489044, 577669799, 579704642, 581514537, 582996666, 584060311, 584790468, 585322917, 585588515, 585412621, 584804714, 583854616, 582579017, 581013560, 579201162, 577099085, 574591637, 571629107, 568237722, 564417899, 560180247, 555525720, 550430298, 544955850, 539234161, 533438504, 527732611, 522205412, 516822159, 511294544, 505147219, 497885913, 489035130, 478209078, 465208411, 450013191, 432733804, 413697422, 393606842, 373591036, 355374843, 341296792, 333946109, 335540593, 347013235, 367367476, 393997759]
3332.7C93997759K9827833L0249506K8481513K5400549K1802187J8221975J4973104
3347E62954426J2198329J0040045Q374512O875455N461931M227519L228665K384245
3363.3F15745127J593948R46700N38409K75433M2021j55806k87712l65198l69012l33071
3383.7F17630839l81529m88818n73158p43747r96887j142323j224697j441896j836777
3402.1F08801007k213001k324581k132714j594126p61032k384L78668L67463Q5353
3420.4F00604653k36451l68476l36826l28243l79205k68638l3498m112j21355p3433
3440.8E98454416J55985L80635M33028L25680K99215L76225M39524N41926O25908N37336
3461.2F02569878N20587P83205R16183O03199K47896L35455O66976R19103R04143O14524
$$ y = [393997759, 423825592, 454075098, 482556611, 507957160, 529759347, 547981322, 562954426, 575152755, 585192800, 593567312, 600442767, 605904698, 610132217, 613360882, 615745127, 617339075, 618285775, 618824184, 619099617, 619141638, 618985832, 618698120, 618332922, 617963910, 617630839, 617249310, 616760492, 616187334, 615443587, 614446700, 613304377, 612079680, 610637784, 608801007, 606588006, 604263425, 602130711, 600536585, 599775553, 599773169, 600151837, 600519300, 600604653, 600368202, 599999726, 599662900, 599334657, 598955452, 598686814, 598653316, 598649204, 598527849, 598454416, 598610401, 598991036, 599424064, 599749744, 600048959, 600425184, 600864708, 601406634, 602032542, 602569878, 603090465, 603873670, 604789853, 605393052, 605640948, 605976403, 606643379, 607562482, 608466625, 609081149]
3481.6F09081149N49972P79569P94232O83904P91430R47714R57787Q84354R22561R78708
3502F17371380P77781O33419Q02994J029014J213372J221895J056493J052737J247465
3520.4F26406550J411438J273334J003385R96530J141012J295805J458406J380980
3536.7F36367440J193762J400530J735211J615882J111865R01758J075566J146376
3553F46548390J166046J348794J559913J610994J505673J440287J474201J454413J396179
3571.3F59504890J449407J593113J726448J942754K205729K324343K138436J667678
3587.7F74552798J498044J697480J803399J841127J939297J924217J803517J758099
3604F88817978J723528J669764J664341J709640J726210J587868J438915J418055J353621
$$ y = [609081149, 609631121, 610410690, 611204922, 611888826, 612680256, 613627970, 614585757, 615470111, 616392672, 617371380, 618149161, 618782580, 619585574, 620614588, 621827960, 623049855, 624106348, 625159085, 626406550, 627817988, 629091322, 630094707, 631091237, 632232249, 633528054, 634986460, 636367440, 637561202, 638961732, 640696943, 642312825, 643424690, 644326448, 645402014, 646548390, 647714436, 649063230, 650623143, 652234137, 653739810, 655180097, 656654298, 658108711, 659504890, 660954297, 662547410, 664273858, 666216612, 668422341, 670746684, 672885120, 674552798, 676050842, 677748322, 679551721, 681392848, 683332145, 685256362, 687059879, 688817978, 690541506, 692211270, 693875611, 695585251, 697311461, 698899329, 700338244, 701756299, 703109920]
3622.3G03109920J371145J357496J021266P71821Q24987Q36134P82729P56859Q12173
3640.7G11644530R84848J185000J105964N57899k1755j17123m5240R0420J29163j51634
3661.1G15362072k35319K34663O22928N08130M23551L30388k74241n71966k48969O8427
3681.5G16219664M38630Q06987Q69394J84297m66346k08736J51932J98484P2598j10626
3701.9G18156278o8188K14458L31819m5478n68450m08470k4498J00970O0737p9751
3722.3G17669427k61366k77817J1980K96235K98143n9247l96490k47598j15871n17965
3742.7G16399431q21411j52290L2603o28709p37071k42055r5188k73526k78533j07824
3763.1G13095427o2705j44839l27825m25280k50458M7803J93238m8697l57389l71755
$$ y = [703109920, 704481065, 705838561, 706859827, 707631648, 708456635, 709292769, 710075498, 710832357, 711644530, 712629378, 713814378, 714920342, 715478241, 715456486, 715339363, 715294123, 715384543, 715513706, 715362072, 715126753, 715361416, 715984344, 716492474, 716916025, 717246413, 716972172, 716400206, 716151237, 716219664, 716658294, 717465281, 718334675, 718518972, 718052626, 717843890, 717995822, 718194306, 718266904, 718156278, 718088090, 718302548, 718634367, 718588889, 718020439, 717611969, 717587471, 717688441, 717749178, 717669427, 717408061, 717130244, 717142224, 717438459, 717736602, 717677355, 717280865, 717033267, 716917396, 716399431, 715578020, 715425730, 715458333, 714829624, 714092553, 713850498, 713755310, 713481784, 713203251, 713095427, 713032722, 712887883, 712560058, 712134778, 711884320, 711932123, 712125361, 712076664, 711719275, 711347520]
3783.5G11347520l19302k75612j82986r1791p4685m9471J04427M411k79487k24590
3803.9G09958434m05788o80983l28422Q4043M9471o0975N2810l39866q18849n39541
3824.3G06970334k87473k43008k00987p2479R7274j06155m86494m08470k52009j95145
3844.6G04815388K4736K89857J15037q49187j048327j18792J51336M5181j43648j61945
3865G03119636k5809j78099l08335k84314k78234j54734j33276j00255r3579l17574
3885.4G01245427k96831k02239l41177k22563P5936J11938j4842j93238m33266m88580
3905.8F99240565l46303k37584q9705P1705k2650k75493l12805k37823k69174k26081
3926.2F97294652j00374j56164l03149k99513k39850j81496j36554j82211j72437j08778
$$ y = [711347520, 711028218, 710752606, 710569620, 710477829, 710403144, 710353673, 710458100, 710462511, 710183024, 709958434, 709552646, 708871663, 708543241, 708627284, 708676755, 708615780, 708668590, 708328724, 707509875, 706970334, 706682861, 706439853, 706238866, 706166387, 706263661, 706157506, 705671012, 705262542, 705010533, 704815388, 704840124, 705129981, 705245018, 704395831, 703347504, 703228712, 703380048, 703425229, 703281581, 703119636, 703093827, 702915728, 702607393, 702323079, 702044845, 701890111, 701756835, 701656580, 701563001, 701245427, 700948596, 700746357, 700405180, 700182617, 700258553, 700370491, 700355649, 700162411, 699729145, 699240565, 698894262, 698656678, 698566973, 698638678, 698616028, 698340535, 698027730, 697789907, 697520733, 697294652, 697194278, 697038114, 696734965, 696435452, 696195602, 696014106, 695877552, 695695341, 695522904, 695414126]
3946.6F95414126j79589k59876j99497j26779j08719j41442k26318k52128j43886l2902
3967F93742990k7358p5877j47521j83046j71244j60814j16765j24514k34485l09586
3987.4F92191780l21806l24428k86579k09689j32263
3997.6F90917015
$$ y = [695414126, 695234537, 694974661, 694775164, 694648385, 694539666, 694398224, 694171906, 693919778, 693775892, 693742990, 693715632, 693639755, 693492234, 693309188, 693137944, 692977130, 692860365, 692735851, 692501366, 692191780, 691869974, 691545546, 691258967, 691049278, 690917015]
##END=$$ End of the data block
