##TITLE=AC3 $$ Begin of the data block
##JCAMP-DX=5.00 $$ ACD/SpecManager v 10.08
##SPECTROMETER/DATA SYSTEM=Alpha
##DATE=27 Nov 2015 09:01:52
##DATA TYPE=INFRARED SPECTRUM
##DATA CLASS=XYDATA
##ORIGIN=
##OWNER=
##NPOINTS=1765
##FIRSTX=399.76428223
##LASTX=3997.64306641
##MAXX=3997.64306641
##MINX=399.76428223
##MAXY=0.86890268
##MINY=0.46788931
##XFACTOR=1.0000000000
##YFACTOR=1.000000000000000e-9
##FIRSTY=0.81175435
##DELTAX=2.03961372
##XUNITS=1/CM
##YUNITS=ARBITRARY UNITS
##XYDATA=(X++(Y..Y))
399.8 811754346 812802374 811265409 809413612 809585929 809217691 809166789 810026169 808578193 805600882
418.1 805600882 803012788 798324943 793307364 790583670 789046824 790830255 797224224 803107083
434.4 803107083 807298243 811290145 812682986 812376499 813109279 812972307 812321305 812891901 812338233
452.8 812338233 810873151 810858130 810586035 809726417 809998691 809502721 807839572 807384551 806472063 804104507
473.2 804104507 802812994 800851464 796768606 792861819 788664699 785639405 788630664 793956459
489.5 793956459 795152545 793489516 789992750 782205105 770045221 754021049 742992103 751849711
505.8 751849711 775294721 793519855 801442862 804059863 802392900 798008144 792240322 783244014
522.1 783244014 775734127 779372931 790973067 799780190 803850830 804483712 803179860 802470744 801504433
540.5 801504433 799399674 798115492 796949029 794477403 792488515 790717185 787398756 783677876
556.8 783677876 779306710 772271037 763124704 751808047 739211679 734444797 743992507 758934617
573.1 758934617 767434299 765599072 757068694 754380286 765060723 777444363 780262828 775246918
589.4 775246918 764102459 747107208 729742169 722376525 734361231 761264801 786287904 800249159
605.8 800249159 806631625 809459984 809596181 809083104 808872938 807853580 807038844 806948304 805962980
624.1 805962980 804647624 803865492 802087724 799573362 797433257 794557214 791463196 789025426 784622073
642.5 784622073 775704861 760496259 739347160 728957176 747808397 780537903 800559640 806288898
658.8 806288898 806329608 804061234 801606655 798958063 795183957 793089390 791922212 789588511 786834717
677.2 786834717 784756005 782536507 780335665 779387951 779096305 779216588 780670345 782642126 784078717
695.5 784078717 785414398 786054075 785178721 783406496 779957712 774149895 769816220 770067453 771871448
713.9 771871448 772083938 770656049 767760336 764039516 759921908 754214466 746321976 736292779
730.2 736292779 722680032 706351340 696552992 703813732 723123789 738042057 740763068 734941363
746.5 734941363 725728691 714846730 702098250 688203394 674880922 665091217 663631380 672359645
762.8 672359645 686777711 701777160 716059804 729446352 741445482 751547158 758465469 760839045
779.1 760839045 757232785 744761169 725843012 716166914 728162527 752256513 772443175 784052491
795.4 784052491 789008796 789512634 786309242 778576374 766486168 753604889 747568011 753370702
811.8 753370702 764306486 769425988 766682804 763628185 769150734 782358229 793290675 795193911
828.1 795193911 789154172 782859206 785452366 795524478 803152144 804206967 800616503 794106007
844.4 794106007 786137402 779350281 778261840 785739541 798051655 808444738 814040005 815476418
860.7 815476418 814003229 810720980 805698514 798526108 790723860 786393046 789206445 798079908
877 798079908 807717443 814139903 817318320 818776011 819203436 818951190 818600535 818169355 817565560
895.4 817565560 817136228 816797018 816217661 815628409 815114677 814375877 813551307 812786102 811794281 810637176
915.8 810637176 809525907 808148265 806454062 804805338 803309143 802269220 801986158 801756501 800706446
934.1 800706446 798734307 795549333 791979849 791388094 794443369 797079504 797209620 795969844 794040382
952.5 794040382 791563451 788180232 782414258 775352597 773921251 780095398 785638869 786163092 784177065
970.9 784177065 781464517 778584838 775585234 772193849 768638134 765221834 762066245 759452522
987.2 759452522 757236362 754627943 751175582 746706188 740991354 735034168 731729090 733579099
1003.5 733579099 739640176 745859981 748743713 747765541 744198501 738046050 727492571 715874076
1019.8 715874076 710552752 708307326 701010823 691898882 689838171 698076665 712572396 726696014
1036.1 726696014 736786842 742730439 745509863 746310651 746361554 746048033 745427668 744820297 744027615
1054.5 744027615 742550969 740574300 738346279 735737324 732917666 730036855 726890922 723511636
1070.8 723511636 719998121 716038883 711538374 706672490 701302707 695352137 689050436 682509959
1087.1 682509959 675916374 669573367 663191915 656075776 647809565 637965977 625975013 611821234
1103.4 611821234 596174181 580308199 566279709 554966450 543914139 531678379 522954345
1117.7 522954345 522725880 530175924 545884907 574273407 613603115 655473471 692827940 722105682
1134 722105682 741974115 752528906 755112052 752134383 745841980 737386823 727331340 716031909
1150.3 716031909 703484416 689904511 676223457 663124263 649872005 634643912 615830541
1164.6 615830541 593040764 566656530 536850631 506611526 487026691 490424186 510587692
1178.9 510587692 523331285 516597092 505800366 509723008 521254539 519731045 504374385 491353959
1195.2 491353959 489867747 499020308 517007589 542851090 573327243 603835106 631224453 654198527
1211.5 654198527 672725141 687667072 699933469 710222363 719110370 726682127 732976019 738608658
1227.9 738608658 743993998 748848259 752778888 755091846 754645586 751019120 745070517 738105357
1244.2 738105357 731284082 726114988 724788845 727742314 731954396 734624922 736057818 737204969
1260.5 737204969 738154769 739613056 741991460 743053436 739370346 729471326 713608205 692007363
1276.8 692007363 665379107 637457252 617560804 617393255 640119433 675226033 708587706 733649135
1293.1 733649135 749877095 756771624 752692699 740627944 733390570 740321755 753330410 760591149
1309.4 760591149 760362446 755380094 747181773 735966325 721287966 703300953 683437824 665394306
1325.8 665394306 656392157 662486434 678365648 689757347 691850364 695477009 711258233 734961927
1342.1 734961927 757047832 773257315 782630444 786480010 786398232 782753766 775773644 766105890
1358.4 766105890 753081024 735139787 713687062 690769553 669020891 658010602 664495111
1372.7 664495111 683129430 701948404 714969575 719865978 716106594 707516015 698000848 690575480
1389 690575480 686568022 686286509 691632628 701082349 709772468 715224385 717691720 717910588 716453314
1407.3 716453314 714167655 711387217 708375812 705392718 701806426 697298884 693786979 691467166
1423.7 691467166 689940035 689828932 691042483 692656398 693369746 691584885 686465204 679477274 670357764
1442 670357764 659207165 647673428 637052953 628354430 621936500 618322372 615466833 610052943
1458.3 610052943 604663432 600387812 597420394 598524213 603875220 611880898 623368740 637909770
1474.7 637909770 653901160 670303762 686263621 700752497 712428272 721958756 730293453 737142682
1491 737142682 742017806 745579898 748356462 750174940 750649631 749277353 742738605 726205289 715330541
1509.3 715330541 719866574 733646929 748168349 758132041 762971938 764853358 765913248 767030656
1525.6 767030656 767901719 768158019 767321289 765164852 763007581 760418355 754967868 748564661 743812621
1544 743812621 739258528 734060764 727411509 719935596 712040305 703549743 689405203 670764208
1560.3 670764208 658711493 645895600 629354835 608436704 583140850 563259423 552892506
1574.6 552892506 556234419 569814861 581774116 593627751 611981928 636763453 661826193
1588.9 661826193 682975888 699482679 711881101 720621884 726097047 728915155 729892313 729873121
1605.2 729873121 729221106 727928162 726560652 725689948 724877834 723374069 721563280 718613148 713573635
1623.5 713573635 708093941 703212976 699493825 697509170 695643961 691588283 686703563 681700945
1639.9 681700945 675223112 666658938 653394103 637870193 628378928 622644365 619414508 618512511
1656.2 618512511 614899993 605650365 588116348 565207124 541791320 513112187 482773036 467889309
1672.5 467889309 471469402 488603830 510312438 532412946 557661355 589855790 615882099
1686.8 615882099 634407878 651262879 664806068 676720500 687848449 696715891 704813123 711172938
1703.1 711172938 716716588 723452866 731198728 739832044 749186635 759362876 771012545 781680167
1719.4 781680167 789481640 795963407 801782191 806617916 810726881 814116895 817405403 820713878
1735.7 820713878 823453665 826132059 828922212 831493735 833765864 835870087 838153183 840783417
1752 840783417 843152285 845217764 847176015 848949432 850689173 852430761 853907406 855107069 856220663
1770.4 856220663 857559681 859268188 860898733 862281442 863426983 864363015 864960194 865058064 864499927
1788.8 864499927 863363743 862903833 863961458 865359724 866209209 866849720 867673934 868374527 868678391
1807.1 868678391 868674934 868611038 868666708 868810177 868888438 868902683 868862927 868726075 868533134 868364692 868175209
1829.6 868175209 868152559 868276298 868281603 868200421 868067622 867674887 866894305 866204560 865786254 865384102
1850 865384102 865029395 864864051 864863276 864906311 864988148 865038991 864923418 864554584 864020526 863594353 863314748
1872.4 863314748 862935364 862340629 861655414 861078382 860668778 860388517 860143423 859615028 858629167 857093453
1892.8 857093453 854562521 850912571 847365141 846226096 848489344 852273285 855280936 856953323
1909.1 856953323 857792616 858270526 858391166 858156502 857896924 857657075 857378721 857249618 857108772 856754303
1929.5 856754303 856360793 856023669 855680346 855432987 855287194 855021775 854733109 854521692 854107678 853479683
1949.9 853479683 852856994 852224708 851586163 851026654 850401878 849706471 849238455 848977208 848734140 848567069
1970.3 848567069 848432839 848265886 848242104 848354042 848350286 848293424 848284602 848132014 847862959 847642720 847391009
1992.7 847391009 847146153 847003937 846818447 846606255 846556962 846560478 846462309 846390128 846305311 846035540 845665395
2015.2 845665395 845229924 844590843 843740642 842523873 841281354 841216981 842119277 842616796 842596054 842566669
2035.6 842566669 842501163 842305183 842118204 841909945 841630816 841431916 841265738 840999663 840808868 840742409
2056 840742409 840622723 840557396 840630352 840649307 840622783 840645373 840555847 840367436 840225160 840011239 839710951
2078.4 839710951 839507997 839309692 838969886 838626325 838275611 837800503 837329447 836899459 836364388 835848749
2098.8 835848749 835489690 835143805 834820807 834603369 834326565 834007204 833869278 833830237 833807111 833901167
2119.2 833901167 833988070 833957851 833991110 834085822 834073246 834080517 834203124 834268868 834305048 834424615 834461451
2141.6 834461451 834401369 834384441 834286332 834063470 833875895 833652973 833344936 833145499 833024681 832844257
2162 832844257 832695305 832523525 832179129 831878245 831727207 831487536 831232250 831151664 831101894 831030309
2182.4 831030309 831020057 830938041 830741823 830572605 830356717 830036104 829795301 829586685 829244316 828951418
2202.8 828951418 828776002 828503728 828193069 827924848 827499628 826973677 826519310 825978935 825350225 824840963
2223.2 824840963 824337900 823764265 823334813 823034823 822781146 822753549 822919905 823036969 823147476 823300779
2243.6 823300779 823372841 823459506 823620737 823662937 823642015 823701680 823664844 823520184 823482513 823450923 823330522
2266 823330522 823303640 823298156 823131859 822965145 822833955 822542965 822223842 822004020 821685910 821315646
2286.4 821315646 821061492 820763469 820420742 820226312 820030749 819744468 819551766 819344521 818959653 818591297
2306.8 818591297 818296313 818004906 817933500 818060756 818013012 817807913 817654073 817455411 817279398 817256033
2327.2 817256033 817107379 816765845 816519141 816253364 815831006 815503538 815221667 814804316 814565718 814598262
2347.6 814598262 814500034 814120591 813535094 812712848 811833680 811149061 810489774 809930205 809701025 809492648
2368 809492648 809234321 809200108 809209108 809167683 809319258 809529543 809580922 809656143 809772491 809742630 809761167
2390.4 809761167 809961021 810082674 810142398 810281038 810298145 810202241 810203075 810142934 809960008 809901178 809863567
2412.9 809863567 809662282 809487343 809339345 809030771 808721185 808460474 808040023 807619631 807335258 806946158
2433.3 806946158 806477666 806084394 805580616 804961383 804450989 803954422 803426325 803094983 802891970 802687466
2453.7 802687466 802673101 802771449 802722394 802664816 802669466 802538872 802329540 802137613 801828027 801440954 801083267
2476.1 801083267 800630510 800125718 799754500 799391508 798943639 798580766 798248112 797818184 797494590 797360301
2496.5 797360301 797283649 797385991 797698498 797931373 798026979 798096120 798079014 798021555 798035681 798001885 797900140
2518.9 797900140 797889650 797892630 797827005 797831297 797838688 797707260 797583103 797494888 797314703 797148585 797034323
2541.4 797034323 796782255 796429396 796155393 795842230 795404553 794979572 794515848 793970942 793520451 793123543
2561.8 793123543 792642713 792217076 791846871 791334510 790761411 790213704 789566100 788914204 788431764 788031936
2582.2 788031936 787709713 787584186 787590027 787717462 788057387 788431466 788676500 788895786 789065301 789116025
2602.6 789116025 789180517 789216161 789028406 788718343 788422287 788026512 787540317 787088871 786594152 786041558
2623 786041558 785539985 784993708 784362614 783810616 783301890 782764196 782364428 782096982 781810403 781602740
2643.4 781602740 781503320 781344533 781192124 781162977 781173885 781250834 781437695 781550705 781531394 781510055 781430960
2665.8 781430960 781246006 781082511 780899167 780606687 780333459 780092001 779744506 779357970 778982580 778510094
2686.2 778510094 778016448 777586222 777096152 776568830 776125550 775668800 775137484 774636328 774120986 773548007
2706.6 773548007 773023725 772485971 771854401 771256149 770677090 769961357 769123495 768135428 766891301
2724.9 766891301 765634596 764832735 764653206 764943361 765454650 765879035 766035080 765976906 765749693 765388608
2745.3 765388608 765014231 764601767 764080048 763590872 763198674 762772143 762310803 761866450 761336088 760711432
2765.7 760711432 760090411 759449303 758838117 758349299 757832587 757222354 756706655 756311595 755942822 755659223
2786.1 755659223 755452693 755174637 754862845 754628420 754407167 754136443 753779769 753281891 752699733 752108932
2806.5 752108932 751424372 750579834 749662995 748693585 747655809 746637940 745632946 744588435 743573129
2824.9 743573129 742531419 741322160 740018308 738672316 737180710 735578179 733834982 731762528
2841.2 731762528 729502380 727321029 725142300 722914815 720862269 719092548 717548788 716245174
2857.5 716245174 715027869 713610172 711934328 709899366 707361519 704890847 703603923 703836501
2873.8 703836501 704762101 705340326 705060959 704083145 702829957 701438189 699896514 698260784 696488619
2892.2 696488619 694558322 692500770 690299273 688270986 687108040 687082052 687747657 688596129 689414978
2910.5 689414978 690120399 690626621 690710008 690116167 689024806 688081563 687730014 687794328 687694669 686918080
2930.9 686918080 685712993 685322106 686766386 689522445 692160428 693758607 694209754 693830967 692977488
2949.3 692977488 691812098 690324068 688483357 686247289 683580816 680469453 676807523 672781289
2965.6 672781289 669110954 666263461 663899004 661294103 658086896 654926479 653176486 653534412
2981.9 653534412 655403197 657763004 660087109 662474990 665172577 668111026 671015918 673565328
2998.2 673565328 675653696 677483320 679144919 680716753 682319105 683733821 684563816 684556127 683681130
3016.6 683681130 682152271 680227637 678169549 676517844 676151276 677747548 681044459 684949040
3032.9 684949040 688325942 690778077 692640305 694001913 694568872 694380701 693856657 693461716 693400264
3051.3 693400264 693599761 694002032 694575608 695146620 695377171 695012331 694059014 692487359 690288067
3069.6 690288067 687785268 685260713 682773113 680271327 677492976 674353004 671062589 667649150
3085.9 667649150 664141119 660742819 657506406 654436886 651699066 649370015 647258401 645329058
3102.2 645329058 643921077 643270493 643326163 644040525 645564854 647972584 651004314 654304206 657570004
3120.6 657570004 660583794 663214326 665319860 666735709 667255104 666796446 665589571 663925588 661862791
3139 661862791 659374297 656592131 653599977 650286078 646576524 642443538 637818277 632748067 627451777
3157.3 627451777 622191012 617181420 612540364 608308136 604537606 601352572 598929465 597488701
3173.6 597488701 597203851 598083079 600022614 602824271 606230021 610014439 614025474 618103147 622068942
3192 622068942 625851333 629454374 632860601 636045218 638960183 641554654 643856406 645895779 647667110
3210.3 647667110 649215996 650596976 651824117 652902901 653810322 654573143 655310452 656110466 656996131
3228.7 656996131 658002257 659047246 659843147 660382986 660945594 661585271 662226200 662831366 663248599
3247.1 663248599 663306832 663142920 662980556 662743032 662219465 661395550 660410643 659310460 658084571
3265.4 658084571 656816304 655499816 653879941 651832759 649500668 646993339 644353986 641545534
3281.7 641545534 638487756 635203660 631811678 628438234 625097692 621716738 618198693 614415526
3298 614415526 610265672 605602860 600173056 593664110 585826337 576664388 566367388 555141270
3314.4 555141270 543181002 530870140 519210219 509972692 505306304 506841302 514817595 527864158
3330.7 527864158 543681026 560160220 575880527 589980006 602070808 612203360 620627701
3345 620627701 627587795 633305073 637940586 641601205 644427299 646572888 648124874 649150312 649782062
3363.3 649782062 650156200 650279820 650110304 649696469 649169624 648669124 648217678 647735417 647176266 646596014
3383.7 646596014 646060944 645594895 645199478 644669712 643791080 642795026 642020404 641303718 640181899
3402.1 640181899 638665676 637203455 635986209 635020256 634310842 633699417 633080184 632506073 631947517
3420.4 631947517 631348372 630773365 630298018 629880905 629413784 629002392 628792107 628529191 628014207 627594471
3440.8 627594471 627572775 627808332 628088355 628302813 628463745 628634393 628848433 629186392 629635215 629996240
3461.2 629996240 630347073 631002128 631823778 632312238 632374048 632475972 632941008 633712411 634487271 634987414
3481.6 634987414 635450602 636132240 636845171 637516737 638251483 639066756 639971673 640845239 641623735 642441034
3502 642441034 643194258 643794715 644512475 645531833 646769524 647922337 648807049 649601400 650561392
3520.4 650561392 651783347 652928531 653742492 654588878 655699849 656948447 658316493 659638047 660753846
3538.7 660753846 661951363 663328946 664612830 665613234 666493475 667523205 668715239 669929564
3555 669929564 671132028 672401369 673635960 674568117 675403237 676890075 678875208 680510521 681848109
3573.4 681848109 683249652 684782505 686495125 688297451 689881086 691172600 692554712 694287062
3589.7 694287062 695955634 697440505 699083269 700965941 702823102 704534888 706037819 707268298
3606 707268298 708556712 710117996 711791515 713526011 715078950 716639996 718662620 720509350 721617639
3624.4 721617639 722187102 723176241 725192428 727079511 728537679 729798734 730909944 731976271 732943177
3642.7 732943177 733537853 733814657 734701931 736377597 737511575 738195896 739216506 740280688 740769386
3661.1 740769386 740869105 740927160 740901232 740957677 741392016 741675496 741943181 742755771 743604898 744221449
3681.5 744221449 744579017 744704247 744851768 745162129 745556831 746001065 746354520 746427655 746266305 746264637
3701.9 746264637 746515334 746506274 746070743 745617867 745727420 746187508 746362090 746192932 745874584 745562673
3722.3 745562673 745371342 745342135 745279729 744883418 744255781 744047940 744520366 744853973 744424105 743448198
3742.7 743448198 742840111 742781937 742483318 742401958 742980063 743366659 743305385 743244708 743398428 743385077
3763.1 743385077 743120790 742858768 742760599 742911041 743073583 743022323 742854774 742736995 742613614 742412150
3783.5 742412150 742296040 742281139 742195249 741966188 741575062 741094410 740604639 740056396 739801645 739894211
3803.9 739894211 739875436 740008414 740210533 739993155 739393651 738860548 738498330 738107502 738086224 738233984
3824.3 738233984 738149524 737963021 737674892 737366080 737115502 736721754 736329079 736329138 736626685 736965895
3844.6 736965895 736998022 736401558 735170960 734164953 734671950 735439003 735514700 735146642 734714508 734530985
3865 734530985 734362781 734051287 734004855 734186411 734295309 734129310 733709157 733498573 733524680 733574927
3885.4 733574927 733539820 733259022 733053267 733074129 732847750 732243121 731652379 731427550 731580973 731938243
3905.8 731938243 732155859 732097208 731877744 731571555 731247008 731054068 730956912 730745256 730498135 730383039
3926.2 730383039 730223417 729983330 729925096 730004787 729932308 729672313 729346156 729087830 728935957 728771746
3946.6 728771746 728613913 728555560 728522241 728434265 728284419 728059292 727826238 727682590 727582037 727453351
3967 727453351 727314353 727177441 727029741 726917565 726850450 726764262 726675510 726586103 726379275 726041079 725723624
3989.5 725723624 725498557 725324512 725213826 725125790
3997.6 725125790
##END=$$ End of the data block
