##TITLE=AC2 $$ Begin of the data block
##JCAMP-DX=5.00 $$ ACD/SpecManager v 10.08
##SPECTROMETER/DATA SYSTEM=Alpha
##DATE=27 Nov 2015 09:01:52
##DATA TYPE=INFRARED SPECTRUM
##DATA CLASS=XYDATA
##ORIGIN=
##OWNER=
##NPOINTS=1765
##FIRSTX=399.76428223
##LASTX=3997.64306641
##MAXX=3997.64306641
##MINX=399.76428223
##MAXY=0.88854510
##MINY=0.49789199
##XFACTOR=1.0000000000
##YFACTOR=1.000000000000000e-9
##FIRSTY=0.82691616
##DELTAX=2.03961372
##XUNITS=1/CM
##YUNITS=ARBITRARY UNITS
##XYDATA=(X++(Y..Y))
399.8H26916158K026022J424491J84238J54614K57135l39270p70509k400458k890646
418.1H24561775m66466R79304K39551q50439o28233q61704j097799l99828l41057J12176
438.5H21247280J39653K20597Q84414L69429L50833k34305j155913q10922o55710M81724
458.9H20837080P36773m02569j071811k424717k828121j622617J012623L572822K863109
477.3H20672572J471102M32849n84781m60983p91430j097858r63390j104653j011371
495.6H16562057j651049k124667j447380m24921L70025K9803n39959j189589k598823
514H06985497l328323k926290j038074O03854o38723l059745m962325n599678n130469
532.3G80905724o461084j0117650j2653709r091198L99768P432759P815242N186259
$$ y = [826916158, 828942180, 830366671, 830550909, 830705523, 830962658, 830623388, 829852879, 827452421, 824561775, 824095309, 825074613, 825314164, 824463725, 823835492, 822973788, 821875989, 821476161, 821135104, 821247280, 821386933, 821607530, 822491944, 822861373, 823212206, 822977901, 821821988, 821011066, 820355356, 820837080, 821573853, 821171284, 820099473, 817674756, 814846635, 813224018, 814236641, 817809463, 820672572, 822143674, 822576523, 821991742, 821530759, 820739329, 819641471, 818678081, 817573428, 816562057, 814911008, 812786341, 811338961, 810914040, 811284065, 811313868, 810773909, 809584320, 806985497, 803657174, 800730884, 799692810, 800296664, 799657941, 796598196, 791635871, 786036193, 780905724, 774444640, 764326990, 751673281, 742582083, 742981851, 750414610, 758229852, 763416111]
548.7G63416111L896296M249216L638863K036512J96695j758277l411531n514324p553160
567G59196401p486582m572630j253367q48472n56230K847135M342615m89950q863985
585.4G42314935j2867391m816592J1600494K0954132J6790986R288609O707907P624686
601.7G97597766Q204222O995439M814267L272236K141177J081467M02451L64422R86398
620H25859845R77277M67182K26497k59936p82847j204312k081871m072904p330895
638.4H11798036p002830j023651J855135j865506n831241n831302j524746O306410
654.7G96880305J2824178J2082397O846428K986253n14865m590214j899957M057109
671H28671634K780318K47539l27707q7678o9142J33276M17471M11749L86238N9009
$$ y = [763416111, 767312407, 771561623, 775200486, 777236998, 777433693, 775675416, 772263885, 766749561, 759196401, 751709819, 747137189, 745883822, 745035350, 744479120, 747326255, 751668870, 751178920, 742314935, 729447544, 724630952, 736231446, 757185578, 773976564, 783265173, 789973080, 797597766, 805801988, 812797427, 817611694, 820883930, 823025107, 824106574, 824509025, 824873447, 825859845, 826837122, 827304304, 827530801, 827270865, 826488018, 825283706, 823201835, 819128931, 811798036, 804795206, 803771555, 805626690, 803761184, 797929943, 792098641, 790573895, 796880305, 809704483, 821786880, 828633308, 831619561, 831104696, 826514482, 824614525, 828671634, 831451952, 831699491, 831371784, 831284106, 831214964, 831348240, 831765711, 832177460, 832563698, 832622707]
691.4H32622707l90232p99834j240552j366079j391470j352787j146972j126826j247108
709.8H22560847j668632k402723l109217l691792l309131k471387k845705l981054
726.1G99081206m773318n102575n451203n351543l845930k246380j800895j507461
742.4G69001901p60019L60430J522064K318561K657235K191841J179815N92768J210570
760.8G80275166K792776L972470N104185O763517O901920N400777M248679L832161
777.1H19291651L686726L210783K465964J561403J12057q99613o5088K367317M029274
795.4H35760474L071845R34958p97212k282202l418923m437506n653620p272660j0036707
813.8H05868447j3531387j7281830k3405731k8707504j7330110J1207461K8747559
$$ y = [832622707, 832232475, 831432641, 830192089, 828826010, 827434540, 826081753, 824934781, 823807955, 822560847, 820892215, 818489492, 815380275, 811688483, 808379352, 805907965, 803062260, 799081206, 794307888, 789205313, 783754110, 778402567, 774556637, 772310257, 770509362, 769001901, 768241882, 768602312, 770124376, 772442937, 775100172, 777292013, 778471828, 779064596, 780275166, 783067942, 787040412, 792144597, 798908114, 805810034, 811210811, 815459490, 819291651, 822978377, 826189160, 828655124, 830216527, 830328584, 829428971, 829363883, 831731200, 835760474, 838832319, 839767277, 838970065, 836687863, 833268940, 828831434, 823177814, 815905154, 805868447, 792337060, 775055230, 751649499, 722941995, 705611885, 716819346, 745566905]
828.1G45566905K2912561Q724153k161085n828321m65989J0773420J9786060J9768298
844.4H19076002J2583911M930496l06546l078342l487229j586616K539754N600154
860.7H36271584L956616r26793m196822j947701L585398P116258P784903O645739M610121
879.1H62899303K798140J340509M86493N543m00126m36842n58555o92904o71745q68916
899.5H63900900r66311j157403j491546j731992k397954l188134m147291n644679o765723
917.8H36409867o161750k250433L276110N763471M443646J470387j521826l822088
934.1H37607384n824447o987870o754040m818201q9169N486548Q155703O933511L635525
952.5H37344944J370550L59296j383125l429771m339635l091037p57516L38614L01600
$$ y = [745566905, 768479466, 777203619, 775042534, 769214213, 768748224, 779521644, 799307704, 819076002, 831659913, 836590409, 836283863, 833205521, 829718292, 828131676, 830671430, 836271584, 840228200, 839301407, 835104585, 833156884, 836742282, 843858540, 851643443, 858289182, 862899303, 865697443, 867037952, 867524445, 867529988, 867129862, 866693020, 866134465, 865441561, 864769816, 863900900, 862934589, 861777186, 860285640, 858553648, 856155694, 852967560, 848820269, 843175590, 836409867, 830248117, 827997684, 831273794, 837037265, 841480911, 842951298, 841429472, 837607384, 831782937, 824795067, 818041027, 813222826, 813133657, 818620205, 826775908, 833709419, 837344944, 838715494, 839074790, 837691665, 834261894, 829922259, 826831222, 826073706, 826412320, 826713920]
970.9H26713920j25945k71499l78013j745403l472805m835188o257415p246911p369757
989.2G95010984n193353k94208M126310N562246M336953K212524N2810k958715n497753
1007.6G97357798n111576l305554l767371o906092j0127604j2688875j5507162j7958641
1023.9G21984923j8883407j6480208r703636k479732Q76784K130032O299913J3920009
1040.2F97664678J8764913J7520189J4626682J3706148J3325930J0904848O808162
1054.5G93321550L117263J33574k088308l559649n089164o716728q789241j1629582
1070.8G58699715j5152812j9886315k3894787k1745622r411692Q490145J9914210J9063472
1087.1G16076314J0539771O07431p334829j3220668j9099235k6334822l2113553k6476442
$$ y = [826713920, 826587975, 826316476, 825938463, 824193060, 820720255, 815885067, 809627652, 802380741, 795010984, 789817631, 789523423, 793649733, 799211979, 803548932, 805761456, 805814266, 802855551, 797357798, 792246222, 788940668, 785173297, 778267205, 768139601, 755450726, 739943564, 721984923, 703101516, 686621308, 676917672, 674437940, 675314724, 677444756, 683744669, 697664678, 716429591, 733949780, 748576462, 762282610, 775608540, 786513388, 793321550, 796438813, 796572387, 794484079, 790924430, 785835266, 779118538, 770329297, 758699715, 743546903, 723660588, 699765801, 678020179, 668608487, 677098632, 697012842, 716076314, 726616085, 727223516, 719888687, 706668019, 687568784, 661233962, 629120409, 602643967]
1103.4F02643967l455937K1745860K6134193P846058j5346051k5020003j3630748R322286
1119.8F10239625K6013911K9248476K4611532J8477381J2987375P643461J793683l512025
1136.1G27503419p317901r372413r677529r588301j0355235j1797845j2472570j0575771
1152.4F46345854p002175n100548o426573q994877j0309935j1367738j4022112j6952038
1168.7E66169858j8306017j7607808j1664212L740192K2440493L2395065L3035159
1183F10202730L1315565K7621269J9878209J1086344M830003K307177K964139M325211
1199.3G14530647M232347K315700m73023l466546o368339q054555q500099r424329
1215.6F84791803j1754095j4442921j5539825j4292002j1212229p048011l031850l86238
$$ y = [602643967, 599188030, 620933890, 647068083, 654914141, 639568090, 614548087, 600917339, 610239625, 636253536, 665502012, 690113544, 708590925, 721578300, 729221761, 731015444, 727503419, 720185518, 710813105, 701135576, 691547275, 681192040, 669394195, 656921625, 646345854, 639343679, 634243131, 627816558, 618821681, 608511746, 597144008, 583121896, 566169858, 547863841, 530256033, 518591821, 522332013, 544772506, 577167571, 610202730, 641518295, 669139564, 689017773, 700104117, 704934120, 707241297, 710205436, 714530647, 718762994, 721078694, 720605671, 717139125, 710770786, 702716231, 694216132, 684791803, 673037708, 658594787, 643054962, 628762960, 617550731, 610502720, 607470870, 607084632]
1231.9F07084632m66287l863514p364034n785227K002120J0415554J2729883Q795679
1248.2F23548806J861036o610990j4560878j8112660j2933194J319348J7502070K7993202
1264.6F20006740L1177163K9518604K6630044K3381055J8608808J2421072N821228
1278.8G67564714J38462l694356m962325k908468J732230O233275O771207K282738
1295.2G73157477m332006j1188864j7335236j8987239j0556757O626904J8883526J7982423
1311.5G54250228J1942506Q118272O539285N516231L552020R16064j533091l207565
1327.8G86093950m086375n241454o640970q403123j2065410j6202093j6602098j1486650
1344.1G05365777j739860Q598924J4573217J4886856J2012779Q910716N541325J014649
$$ y = [607084632, 606618345, 602754831, 595390797, 589605570, 591607690, 602023244, 614753127, 623548806, 625409842, 618798852, 604237974, 586125314, 573192120, 574511468, 592013538, 620006740, 651183903, 680702507, 707332551, 730713606, 749322414, 761743486, 767564714, 767703176, 764008820, 759046495, 756138027, 757870257, 764103532, 770874739, 773157477, 768825471, 757636607, 740301371, 721314132, 710757375, 717384279, 736267805, 754250228, 766192734, 774311006, 780850291, 786366522, 789918542, 790834606, 789301515, 786093950, 782007575, 776766121, 770125151, 761722028, 749656618, 733454525, 716852427, 705365777, 703625917, 712224841, 726798058, 741684914, 753697693, 762608409, 768149734, 769164383]
1360.4G69164383m587173j0113716j3068080j1762798o874204k184927L012717R985506
1376.7G33571708J4078558J2038529N752742m19557l773153k820253q7440K399087
1393.1G60740221N501687P261276P062137N272210K584040R85623K00927r03905k281188
1411.4G86423028l674925n320966q121789j0303080r239673p072330j082241O483078
1427.7G48091102Q139789K525270n070687r720504o362021m18246j175224l887713
1444.1G32121766k449453J883805L525674J327574l006935r775221j2048245n493939
1460.4G06085026k018273R26614P415235J1286438J0098696P083535L482997J232863
1476.7G45593131J989662L110349J898289j766741o451011j0267675j1061132j0535776
$$ y = [769164383, 764577210, 754463494, 741395414, 729632616, 722758412, 720573485, 723586202, 733571708, 747650266, 759688795, 765441537, 765021980, 761248827, 758428574, 758341134, 760740221, 766241908, 773503184, 780565321, 785837531, 788421571, 789407194, 789608121, 788704216, 786423028, 782748103, 777427137, 769305348, 759002268, 749762595, 742690265, 741608024, 748091102, 756230891, 758756161, 753685474, 743964970, 737602949, 737184703, 736009479, 732121766, 729672313, 731556118, 735081792, 736409366, 733402431, 723627210, 711578965, 706085026, 704066753, 704993367, 712408602, 723695040, 733793736, 740877271, 744360268, 745593131, 747582793, 750693142, 752591431, 750824690, 744373679, 734106004, 723044872, 712509096]
1493G12509096j3888538k0183206k2570908k1739542k2311271l0731499m3711602k8984130
1509.3E08388400j0496408L59953J3885110K7323664L2913267L6959291L4033358K6422560
1525.6F69789195K3135305J7466485J2085021J0104596O910324J964987o96600Q96812
1542G41656125J453161o54638l968120q077621j1764526j5119136j8548786k8885186
1558.3F56091273l3032656j9038677j5416086j1197746K600432K0642340K7156830
1572.6F27805710K8584003L4118951K8495252J8215000J0275424P56085m819811J615108
1588.9G45045722J4735758J9064665J2574136M943728J5796k797485m640996p445097
1605.2G81496227j2007416j6393899j4976323o654918M216015J3767541J2914896P602334
$$ y = [712509096, 698620558, 678437352, 655866444, 634126902, 611815631, 581084132, 537372530, 508388400, 497891992, 498251945, 512137055, 539460719, 572373986, 609333277, 643366635, 669789195, 692924500, 710390985, 722476006, 732580602, 739490926, 741455913, 740759313, 741656125, 743109286, 742454648, 738486528, 730408907, 718644381, 703525245, 684976459, 656091273, 623058617, 604019940, 588603854, 577406108, 580006540, 600648880, 627805710, 656389713, 690508664, 719003916, 737218916, 747494340, 748250425, 743430614, 745045722, 759781480, 778846145, 791420281, 796364009, 796379805, 793582320, 788941324, 781496227, 769488811, 753094912, 738118589, 731463671, 735679686, 749447227, 762362123, 769964457]
1621.5G69964457N369424M050017K666116K140581J089513n46515l15368K287031K395629
1639.9G89100885N48661j401245k456487l89278Q02458j454950m50611K449155L84867
1658.2G87133455k401352l914952k816319p62344J075566N005002P018685O765783
1674.5G97103524O734669M799843J845718k31147R80317L256381K006352K19822j433194
1692.9H15282285l472090k714872M15981K655625J801133q26537j764775j703023l081084
1711.3H06592643n277931p734716j0057867r178460r101688j2337208j5598834j9984066
1727.6G17321873k7888835l9430380o0786485n5381060j2094080K9840946N7198882
1741.9F08780861N9205413M8833847L7200451K9963553K3932695J6276538J1621058
$$ y = [769964457, 775333881, 779383898, 782050014, 784190595, 785280108, 784733593, 784418225, 786705256, 789100885, 789649546, 788248301, 785791814, 785402536, 786204994, 784750044, 784299433, 786748588, 787133455, 784732103, 780817151, 778000832, 777238488, 778314054, 783319056, 790337741, 797103524, 803838193, 808638036, 810483754, 810252607, 811232924, 814489305, 816495657, 816715479, 815282285, 811810195, 809095323, 809511304, 812166929, 813968062, 813141525, 811376750, 809673727, 806592643, 801314712, 793579996, 783522129, 774343669, 765241981, 752904773, 737305939, 717321873, 689433038, 650002658, 589216173, 533835113, 521741033, 551581979, 608780861, 667986274, 716820121, 754020572, 783984125, 807916820, 824193358, 835814416]
1756.1H35814416R559453O949603N776525M778564K799213J369536P73251J723170
1772.4H69543731L267586K747715J506865J014292J095414J202047Q89302J12533q57234
1790.8H80522251n4240J461267R19462m9234J09554Q18610Q59499J75953l75212J10388
1811.2H84498298P42138P70330N09679L71933J67251m18007m55380k66313k07067Q08299
1831.6H86521161J122713L18646J57476M2677p40350j000702K33292J084328O56903
1850H88396144J48952p6056k23398k19345j25408j95265m72247j194418j126885L99768
1870.3H85311842Q83043J67727m49419o31273n55694o38127p98762j124859j469016
1888.7H80695462n65648N87464P44283O34908K93136m8757k40206m36008n50211l57747
$$ y = [835814416, 845373869, 852323472, 858099997, 862878561, 865677774, 867047310, 867820561, 869543731, 872811317, 875559032, 877065897, 878080189, 879175603, 880377650, 881266952, 881379485, 880522251, 880468011, 881929278, 882848740, 882799506, 882909060, 883727670, 884587169, 884763122, 884387910, 884498298, 885240436, 886010766, 886520445, 886892378, 887059629, 886641622, 886186242, 885919929, 885712862, 886521161, 887643874, 887962520, 888119996, 888162673, 887422323, 886421621, 886654913, 887739241, 888396144, 888545096, 888469040, 888245642, 888026297, 887900889, 887705624, 887233377, 886038959, 884912074, 885311842, 886194885, 886362612, 885913193, 885281920, 884726226, 884088099, 883289337, 882164478, 880695462, 880129814, 880717278, 881461561, 882096469, 882389605, 882340848, 882100642, 881664634, 881114423, 880756676]
1909.1H80756676L78609R15229N24104J39713L53933L12566K02775K35975J4246k90573
1929.5H83543253m43578l83377k70188j40607j62840k97785J35601N42283L68774K13146
1949.9H83104682O1333m2379m7087j51694j94311k11358l53158m20630j99020P0572
1970.3H81616950M530j85728k02000k43068k88427k60830l36408m49121o02901p15614
1990.7H78337383m17530m8459k2292n6624j4782Q3446R8944K3305n3704k09093l57031
2013.1H77363563n33641o25968m81665m35829n90086m30048L89338R80139O53267J88172
2033.5H76477242J3649j38879k81036l51071l67940l15010k07722m6313O2048r894
2053.9H74835074j44839l20316n02348n86211n15998j45554L31223O03974P09354O34253
$$ y = [880756676, 881135285, 882050514, 882574618, 882714331, 883068264, 883380830, 883583605, 883819580, 883833826, 883543253, 883099675, 882716298, 882446110, 882305503, 882142663, 881844878, 881980479, 882522762, 882891536, 883104682, 883166015, 883123636, 883076549, 882924855, 882730544, 882519186, 882166028, 881745398, 881546378, 881616950, 881621480, 881435752, 881233752, 880990684, 880702257, 880441427, 880105019, 879655898, 879052997, 878337383, 877919853, 877871394, 877849102, 877792478, 877777696, 877861142, 877960086, 877983391, 877929687, 877720594, 877363563, 876829922, 876203954, 875722289, 875286460, 874696374, 874266326, 874655664, 875635803, 876289070, 876477242, 876490891, 876352012, 876070976, 875719905, 875351965, 875036955, 874829233, 874782920, 874844968, 874835074, 874690235, 874369919, 873867571, 873281360, 872765362, 872619808, 872951031, 873555005, 874264359, 874898612]
2074.3H74898612M68851L52561K35915J41859N1916k5928j7583M6670J01924P6115
2094.7H76330912J4842K8491M8756M9889M3333j0610j5258n007l4809l0935n305J2040
2119.2H76426339J0312o020n544o258j0192j6213n5253m5896P570L0517Q762m7564
2143.7H76290560o1631l7969m8756n9962l7611m0293q3685j05202o2585m8279j09852
2166.1H75594735j24514J8001K01344J92702O3002j1146m1068l5345J1623L6239L3915
2188.5H75939488K2889K9206M1365m827m9770p4804j15454j55926j87755k10225k35796
2211H74998391k62916k56598k35200k23458j89662j24455m1723K2650P3552J00851
2231.4H73861432Q0228L5584l0100q8156j16765j47104j47880j21712j28091j36494
$$ y = [874898612, 875367463, 875720024, 875955939, 876097798, 876149714, 876123786, 876106203, 876152873, 876254797, 876330912, 876345754, 876374245, 876423001, 876472890, 876516223, 876505613, 876490355, 876485348, 876450539, 876419604, 876414299, 876426339, 876436651, 876430631, 876425087, 876418829, 876408637, 876392424, 876337171, 876291275, 876298845, 876329362, 876338124, 876290560, 876228929, 876190960, 876142204, 876082242, 876044631, 876004338, 875920653, 875815451, 875752866, 875704587, 875594735, 875470221, 875488222, 875689566, 875882268, 875945270, 875934124, 875893056, 875857711, 875869334, 875905573, 875939488, 875962377, 875991583, 876032948, 876028121, 875978351, 875903547, 875788093, 875632167, 875444412, 875234187, 874998391, 874735475, 874478877, 874243677, 874020219, 873830557, 873706102, 873664379, 873687029, 873760581, 873861432, 873941660, 873977244, 873947144, 873858988, 873742223, 873595119, 873447239, 873325527, 873197436, 873060942]
2251.8H73060942j59264k03311k42234k85565l18408l63410m02927l66807k68698j67966
2272.2H70282352q9586K563J09256J60872J28389l2246k78294m57526n66721o40809
2292.5H68618250o60718o54161o65664p34449q75950j134455j459717j645625j639307
2310.9H59148204j467585j350403j740098k352595k409816j829863j318812j458705
2327.2H45220327j711964j277209o84857p40290j034617j014531n75423P24375L160775
2345.6H42066586L752887N81861l458858n212903m427671k926290j402915J5795J248956
2363.9H30237448K292514L136694L675163L886164L875553L859639L867448L638506
2380.2H58469129L013074K121151J200497N20825J63317O020n0664q6069r5129r0063
$$ y = [873060942, 872901678, 872698367, 872456133, 872170568, 871852160, 871488750, 871085823, 870719016, 870450318, 870282352, 870192766, 870195329, 870304585, 870465457, 870593846, 870561600, 870283306, 869825780, 869259059, 868618250, 867957532, 867303371, 866637707, 865903258, 865027308, 863892853, 862433136, 860787511, 859148204, 857680619, 856330216, 854590118, 852237523, 849827707, 847997844, 846679032, 845220327, 843508363, 842231154, 841546297, 840806007, 839771390, 838756859, 838181436, 838905811, 842066586, 845819473, 846401334, 842942476, 837729573, 833301902, 830375612, 828972697, 828988492, 830237448, 832529962, 835666656, 839341819, 843227983, 847103536, 850963175, 854830623, 858469129, 861482203, 863603354, 864803851, 865324676, 865487993, 865494013, 865443349, 865357280, 865262151, 865172088]
2400.6H65172088j33216j77384k02477k28345k26617k14398j87874j91629k39431k38181
2421H63132536k33233k30789k11060k45094k82705k77936k11835n7578O8068J39594
2441.4H61589968J82629J54972R1672j8716j08659j21057j61588k02239k31326k83301
2461.8H60892355k86161k85805k91049k72393k77281k41101j88887j49965q2255n8174
2482.2H58759284o9857r8347j62661j83404j59740j01269r53Q2373J64986J97589J62661
2504.7H58590662J30356N4955l2067q4758j47879j59502j26779j12772q3029q5116
2525.1H57944071r1910q4698j49310k31504l23177m07994m24325m13895l37660j89543
2545.5H55290055n5134K0564P450l397N662k2471j8179m4704j14619j47880k04920
$$ y = [865172088, 865038872, 864861488, 864659011, 864430666, 864204049, 863989651, 863801777, 863610148, 863370717, 863132536, 862899303, 862668514, 862457454, 862212360, 861929655, 861651719, 861439884, 861382306, 861450374, 861589968, 861772597, 861927569, 862019241, 862000525, 861891866, 861770809, 861609221, 861406982, 861175656, 860892355, 860606194, 860320389, 860029340, 859756947, 859479666, 859238565, 859049678, 858899713, 858817458, 858759284, 858689427, 858591080, 858428419, 858245015, 858085275, 857984006, 857983053, 858065426, 858230412, 858428001, 858590662, 858721018, 858775973, 858743906, 858659148, 858511269, 858351767, 858224988, 858112216, 858029187, 857944071, 857852161, 857767463, 857618153, 857386649, 857063472, 856655478, 856231153, 855817258, 855479598, 855290055, 855234921, 855255485, 855262935, 855259538, 855265200, 855242729, 855224550, 855179846, 855065227, 854917347, 854712427]
2567.9H54712427k43903k44259k61426k69652l18527l93808m46915n04852n26190n18798
2588.3H50984097m68493l37124k33233j73032j27435j07944o0677l2604m8339m3393
2608.7H49351823m2021l7253l9756o9440o6578o9797p5638n1976n7160n9963q1777
2631.1H48700464j16050j00971j05262j25885j63316k49028k87056k69592k41161k09927
2651.5H46832216j97709j56700j13190j04069j12951j62959j90556k17736l12090l78549
2671.9H44885707m05252l97623l60191l92556m23193l75688k97844k16901j62542j04666
2692.3H41749251l0577q107l1888n4359m8459k4021o914M3571Q2076N9962K9862k4498
2716.8H41735899r3162j49369k05636k52187l40283m20451l64125k58267j78814j51098
$$ y = [854712427, 854468524, 854224265, 853962839, 853693187, 853374660, 852980852, 852533937, 852029085, 851502895, 850984097, 850515604, 850178480, 849945247, 849772215, 849644780, 849536836, 849476159, 849443555, 849395216, 849351823, 849309802, 849272549, 849232793, 849163353, 849096775, 849026978, 848951340, 848899364, 848842204, 848782241, 848700464, 848584414, 848483443, 848378181, 848252296, 848088980, 847839952, 847552896, 847283304, 847042143, 846832216, 846634507, 846477807, 846364617, 846260548, 846147597, 845984638, 845794082, 845576346, 845264256, 844885707, 844480455, 844082832, 843722641, 843330085, 842906892, 842531204, 842233360, 842016459, 841853917, 841749251, 841718674, 841710567, 841678679, 841624320, 841575861, 841551840, 841544926, 841588497, 841670573, 841730535, 841760397, 841735899, 841642737, 841493368, 841287732, 841035545, 840695262, 840274811, 839910686, 839652419, 839473605, 839322507]
2737.2H39322507j95682k15053k04504j76430j52349k30849l40462l98099m37796m75168
2757.6H36496115n46456o03258n69761m88579l89636k97725j89900p8857q3149j54436
2778H33094358j73211j74880k03430k07782j93060k93970m62293n18680m78566m51862
2798.4H29936624n05209n56052n47886n30541n15401n95570p35223p78020q06927r05395
2818.8H23460400j027644j231968j616180k211213k981246l821730m524231m612148
2835.1H01434040l684044k066672k13205J828253L611803M295051L654063K366066
2851.4H11225355J178741L33190j93238n62310r25303j250625j512050j706124j679778
2869.7H04907858j391530j154065j157164j238466j397907j697243j991987k241433
$$ y = [839322507, 839126825, 838911772, 838707268, 838530838, 838378489, 838147640, 837807178, 837409079, 836971283, 836496115, 835949659, 835346401, 834776640, 834288061, 833898425, 833600700, 833410800, 833331943, 833248794, 833094358, 832921147, 832746267, 832542837, 832335055, 832141995, 831848025, 831385732, 830867052, 830388486, 829936624, 829431415, 828875363, 828327477, 827796936, 827281535, 826685965, 825950742, 825172722, 824365795, 823460400, 822432756, 821200788, 819584608, 817373395, 814392149, 810570419, 806046188, 801434040, 797749996, 795683324, 795470119, 797298372, 800910175, 805205226, 808859289, 811225355, 812404096, 812737286, 812544048, 811981738, 811056435, 809805810, 808293760, 806587636, 804907858, 803516328, 802362263, 801205099, 799966633, 798568726, 796871483, 794879496, 792638063]
2886.1G92638063k419591k472043k487301k570808k752245k898216k761543k301276
2902.4G71975040j688540j032531l63529J79649L57330J43826j63019l22938l93569
2920.7G68691719n39601q84116j389921j994490k708674l285229l365815k962351k398669
2939.1G49162853j903355j520634j167953o42419N7697M61221l3259j288593k505183
2957.4G40620375l252149l521323l344715k797782j940668r09269M3631N90563M39822
2975.8G25928485k58624j001597j459121j739681k212703k544105j398027J633405
2992.1G16948032M664421N542696M359424K858818K309620K658308L193020L520847
3008.4G46055186L767729M070341M277945M104137L501177K773106K172709J758813
$$ y = [792638063, 790218472, 787746429, 785259128, 782688320, 779936075, 777037859, 774276316, 771975040, 770286500, 769253969, 768890440, 769070089, 769427419, 769571245, 769408226, 769085288, 768691719, 768152118, 767268002, 765878081, 763883591, 761174917, 757889688, 754523873, 751561522, 749162853, 747259498, 745738864, 744570911, 743928492, 743986189, 744447410, 744414151, 743125558, 740620375, 737368226, 733846903, 730502188, 727704406, 725763738, 724854469, 724898100, 725488663, 725928485, 725669861, 724668264, 723209143, 721469462, 719256759, 716712654, 715314627, 716948032, 721612453, 727155149, 731514573, 734373391, 736683011, 739341319, 742534339, 746055186, 749822915, 753893256, 758171201, 762275338, 765776515, 768549621, 770722330, 772481143]
3024.7G72481143J500845J277328J100600J042664R81807P99180M78327O7353l13282
3043.1G79415965n79894o99520p53224r51230j348853j790106k182484k476156k576768
3061.5G66057730k509773k448618k591253k957761l280938l239929k732754k012253
3077.8G44284451j583636j649380j983106k336681k455473k327501k178252j859963
3094.1G27910459j176774l95060K09391O71625J079202J339316J239419P27892J27852
3112.4G31733322l20434p86305j333117j818240k180934k427220k606035k818107l137946
3130.8G14304984l482759l716827l870785m094660m427076m722178m911959n059123
3147.1F80019617n125165n189776n462349n768299n795658n653142n554677n500733
$$ y = [772481143, 773981988, 775259316, 776359916, 777402580, 778384387, 779183567, 779661894, 779729247, 779415965, 778836071, 778136551, 777383327, 776432097, 775083244, 773293138, 771110654, 768634498, 766057730, 763547957, 761099339, 758508086, 755550325, 752269387, 749029458, 746296704, 744284451, 742700815, 741051435, 739068329, 736731648, 734276175, 731948674, 729770422, 727910459, 726733685, 726338625, 726548016, 727219641, 728298843, 729638159, 730877578, 731605470, 731733322, 731412888, 730626583, 729293466, 727475226, 725294292, 722867072, 720261037, 717442930, 714304984, 710822225, 707105398, 703234613, 699139953, 694712877, 689990699, 685078740, 680019617, 674894452, 669704676, 664242327, 658474028, 652678370, 647025228, 641470551, 635969818]
3163.4F35969818n428315n305528n110860m847348m509926m119634l737092l313244
3179.8E99597871k857804k430916j976967j534342j166702q01563m67956j37687L13342
3198.1E88537276P72714J164377J561999J932264K211511K418399K536058K537072
3214.4F03671670K442658K243459J972675J751960J587868J407384J308978J414895
3230.7F17801547J527250J372039J254201J470149J741767J968860K286077K442956
3247.1F31864846K267182K143561K279401K387464K218247J959860J770735J550913
3263.4F48442209J358449J276911J117825N66423j57118o19292r35555j304626j721442
3281.7F48023784k142906k532363k860308l089070l358483l725589l956198l883660
$$ y = [635969818, 630541503, 625235975, 620125115, 615277767, 610767841, 606648207, 602911115, 599597871, 596740067, 594309151, 592332184, 590797842, 589631140, 588829577, 588361621, 588223934, 588537276, 589309990, 590474367, 592036366, 593968630, 596180141, 598598540, 601134598, 603671670, 606114328, 608357787, 610330462, 612082422, 613670290, 615077674, 616386652, 617801547, 619328797, 620700836, 621955037, 623425186, 625166953, 627135813, 629421890, 631864846, 634132028, 636275589, 638554990, 640942454, 643160701, 645120561, 646891296, 648442209, 649800658, 651077569, 652195394, 652761817, 652604699, 651985407, 651049852, 649745226, 648023784, 645880878, 643348515, 640488207, 637399137, 634040654, 630315065, 626358867, 622475207]
3298F22475207l393531k461970j401782n75781J79053J247108K662956M175484N406976
3316.4F28313720O175935O481946O397545O005407N281269M488766L926576L470361
3332.7F70541525L109217K815485K277135J649499J215577Q25108N85615N56410K33769
3351.1F83809340l98040p14719o20723n78821p90476r73225q49187p11859j029253
3369.4F77143037j584351j719415j430511j219631j185417j231074j203776r87827
3385.7F66581035o80209m58955n89848r63509r98676n33402k72095p28130j187504
3404.1F60168707r65416n94795n40256o15478p26759p86603o88135n58675m83036l41773
3424.5F53867781q2254P8678m3512j52349j28567k75254m08531J7286Q31306J284122
$$ y = [622475207, 619081676, 616619706, 615217924, 614642143, 614821196, 616068304, 618731260, 622906744, 628313720, 634489655, 640971601, 647369146, 653374553, 658655822, 663144588, 667071164, 670541525, 673650742, 676466227, 678743362, 680392861, 681608438, 682433546, 683019161, 683575571, 683809340, 683411300, 682696581, 682075858, 681497037, 680706561, 679733336, 678884149, 678172290, 677143037, 675558686, 673839271, 672408760, 671189129, 670003712, 668772638, 667568862, 666581035, 665900826, 665441871, 664852023, 663888514, 662889838, 662356436, 662084341, 661356211, 660168707, 659203291, 658608496, 658068240, 657452762, 656726003, 655939400, 655251265, 654692590, 654209554, 653867781, 653785527, 653864205, 653820693, 653668344, 653539777, 653264523, 652855992, 652873278, 653704584, 654988706]
3444.9F54988706J329482J285016J064539P54655O97732J025378J505971J811683K006710
3463.2F66469872K158165K107859J857221J569688J451731J447201J384675J243293
3479.6F79689705J178921J270651J308740J271963J352370J443803J421034J442731
3495.9F90379918J413762J266003J263022J431465J469732J412570J635969K023995
3512.2G02296436J991510J622439J462578J543701J736999J741886J541138J739203
3528.5G15675890K173186K256572K148569K068758J973867J865804J674712J544833
3544.8G31382191J730263J941145J870155J939297K146363K031267J845062J660347
3561.1G46546090R76026L88741J688421L673136L495336K435803K126277K341926K559185
$$ y = [654988706, 656318188, 657603204, 658667743, 659422398, 660120130, 661145508, 662651479, 664463162, 666469872, 668628037, 670735896, 672593117, 674162805, 675614536, 677061737, 678446412, 679689705, 680868626, 682139277, 683448017, 684719980, 686072350, 687516153, 688937187, 690379918, 691793680, 693059683, 694322705, 695754170, 697223902, 698636472, 700272441, 702296436, 704287946, 705910385, 707372963, 708916664, 710653663, 712395549, 713936687, 715675890, 717849076, 720105648, 722254217, 724322975, 726296842, 728162646, 729837358, 731382191, 733112454, 735053599, 736923754, 738863051, 741009414, 743040681, 744885743, 746546090, 747522116, 747910857, 749599278, 753272414, 756767750, 759203553, 761329830, 763671756, 766230941]
3579.5G66230941K535701J910388J058042J576960L075659K954364K139151K269686
3595.8G83750892K691447K725304K758145K345860J372218J287997K062142K192080
3612.1H01186085K037704J653313J454652K576589K980829J501441m19557l15309K679884
3630.5H15335631L553450K591253J950800J498103J176536P45297m25398j879514q85486
3648.8H23660672K761006L270626J552344J313805J834691J180529L01898m17948j612961
3667.2H33844662k111495o88553n15759q20517J458645K528488J799822Q73804l48568
3685.6H36020529j387715o58810J473546K142072J337409K69055n08368l31521N66006
3703.9H38922203K70068j139641j675069K60651K174020J416862k27034j170456j158357
$$ y = [766230941, 768766642, 770677030, 771735072, 773312032, 776387691, 779342055, 781481206, 783750892, 786442339, 789167643, 791925788, 794271648, 795643866, 796931863, 798994005, 801186085, 803223789, 804877102, 806331754, 808908343, 811889172, 813390613, 812971056, 812655747, 815335631, 818889081, 821480334, 823431134, 824929237, 826105773, 826851070, 826425672, 824546158, 823660672, 826421678, 829692304, 831244648, 832558453, 834393144, 835573673, 835875571, 835457623, 833844662, 831733167, 831044614, 830528855, 829708338, 831166983, 833695471, 835495293, 836369097, 836020529, 834632814, 833974004, 835447550, 837589622, 838927031, 839196086, 838687718, 838356197, 838922203, 839192271, 838052630, 836377561, 836638212, 838812232, 840229094, 840002060, 838831604, 837673247]
3722.3H37673247n88894K17915M83810o31630k152085j680196J183391K467096P04646
3740.6H37677300j689196j699030Q9943m31299m54306J890122K115071O01232J77980
3759H38277817Q61823N73933l31580n60343j87040O95586J045466K28882o74308n33282
3779.4H39396954J87218J55270R5844M34041L65853j49726r50933j468658j288712
3797.7H36777151j345575o72221P41481N94676P67827J315176L18826j349509j758814
3816.1H35389018j032770q82089M68731J598180Q17775J16647m00901p95722q90494
3834.4H34388375j259029r26256N23389J409232J531422Q70765p47204k863646l331363
3852.8H29595685O79195K858818J382648l85403j116753l88086j41024p88391j44243
$$ y = [837673247, 837084353, 837302268, 837786078, 837154448, 835002363, 833322167, 834505558, 836972654, 837677300, 835988104, 834289074, 834379017, 833947718, 833493412, 835383534, 837498605, 838099837, 838277817, 839139640, 839713573, 839381993, 838821650, 838634610, 839330196, 840375662, 840604544, 839930236, 839396954, 839584172, 839739442, 839835286, 840269327, 840635180, 840485454, 839534521, 838065863, 836777151, 835431576, 834759355, 835500836, 836095512, 836863339, 838178515, 838497341, 837147832, 835389018, 834356248, 833474159, 833942890, 835541070, 836358845, 836475492, 836074591, 835278869, 834388375, 833129346, 832203090, 832726479, 834135711, 835667133, 836537898, 835790694, 832927048, 829595685, 830274880, 833133698, 834516346, 834130943, 833014190, 832626104, 832485080, 831696689, 831552446]
3871.2H31552446Q91387J091779M15802q24929o32226J67668K68340M54485j02758
3889.5H33281994l54171O32167M80175j007438j797914j092673L66271J692355J782000
3907.9H33982766Q43644l1471o25015r34124m71234K00212J15514j03176J11520k5630
3928.3H33063006m40895q2314N86033M37975j56343n38648m32670j5497p2360k13861
3948.7H32134426J72138L71158J35899o7234j24515j42097q3506j669l7611j17123
3969.1H32239866j01268j5855N2214N3942j8775l4988J1563o6638k16365k32100j02163
3991.5H31569433l4392r1314o2525
3997.6H31381202
$$ y = [831552446, 832443833, 833535612, 833951414, 833126485, 832494259, 832661927, 832930267, 833384752, 833281994, 832927823, 833559990, 834040165, 833032727, 831234813, 830142140, 830508411, 832200766, 833982766, 834826410, 834794939, 834169924, 833235800, 832764566, 832964778, 833080292, 832977116, 833088636, 833063006, 832622111, 832539797, 833125830, 833563805, 833407462, 832868814, 832436144, 832420647, 832348287, 832134426, 832306564, 832677722, 832813621, 832746387, 832621872, 832479775, 832396269, 832394600, 832356989, 832239866, 832138598, 832122743, 832174957, 832228899, 832210124, 832175136, 832186699, 832120061, 831903696, 831671596, 831569433, 831535041, 831443727, 831381202]
##END=$$ End of the data block
