##TITLE=AC-3 $$ Begin of the data block
##JCAMP-DX=5.00 $$ ACD/SpecManager v 10.08
##SPECTROMETER/DATA SYSTEM=Alpha
##DATE=11 Nov 2015 08:55:44
##DATA TYPE=INFRARED SPECTRUM
##DATA CLASS=XYDATA
##ORIGIN=
##OWNER=
##NPOINTS=1666
##FIRSTX=601.68615723
##LASTX=3997.64306641
##MAXX=3997.64306641
##MINX=601.68615723
##MAXY=0.89407670
##MINY=0.69414580
##XFACTOR=1.0000000000
##YFACTOR=1.000000000000000e-9
##FIRSTY=0.81539077
##DELTAX=2.03961372
##XUNITS=1/CM
##YUNITS=ARBITRARY UNITS
##XYDATA=(X++(Y..Y))
601.7H15390766J1744797R858429P467449M572094J839697TJ411855N97179K48671
620H54970634L69132M64856L72648K16783J59144K24769L78072M39942k16544j661300
640.4H55718136k660990k441168j489520m20987M60207J139820J818895K462089K981544
658.8H57568026L326773L397942K789676J187384m90427r36568m87983j88768j74761
677.2H65991294j91867k14875l11196m62234m94659m48763m00662l03805j70768j78456
697.5H62814009l69787n24879n13076m62294m93467n36740m95255m15206l75390l73005
717.9H58254910n26309j125575k126157k929449l044367k600193j986980j376808p91073
736.3H41747999l04997l3915j78516j092195k894640n070985o688416o990015n954444
$$ y = [815390766, 827135563, 836993992, 844461441, 849033535, 850873232, 852712929, 854124784, 854721963, 854970634, 855339766, 855804622, 856177270, 856394053, 856553197, 856777966, 857156038, 857595980, 857379436, 855718136, 853057146, 850615978, 849126458, 848705471, 849165678, 850305498, 852124393, 854586482, 857568026, 860894799, 864292741, 867082417, 868269801, 867779374, 866842806, 866354823, 866166055, 865991294, 865799427, 865584552, 865273356, 864811122, 864316463, 863867700, 863467038, 863163233, 862992465, 862814009, 862444222, 861919343, 861406267, 860943973, 860450506, 859913766, 859418511, 859003305, 858627915, 858254910, 857728601, 856603026, 854476869, 851547420, 848503053, 845902860, 843915880, 842539072, 841747999, 841443002, 841409087, 841230571, 840138376, 837243736, 832172751, 825484335, 818494320, 812539876]
754.7H12539876m156113k050698K11000K476216M553377O310881P496357P520198N886198
773H40787292L203809R98676J26242K45452P09951J225650J759947K316415K856433
791.4H54229867L216863L028631J672626j274586m961312p433414p593334o005645
807.7H34879696l779828j551509P00712L140509N418241O880224P234395O509423M773617
826H64205480K555489J039565P66337P39395j10149j486778k359152k208114j358926
844.4H61783147m51386K71201J017451J925588K859652L494442L459215K636552J273036
862.8H78268898j01924q59082p95543k71559L40938Q86560J296282J557290J661480
881.1H81983340J519024J035571L39687k21073m34816m19319l62575l09944k62380
$$ y = [812539876, 808383763, 806333065, 806544065, 809020281, 813573658, 819884539, 827380896, 834901094, 840787292, 843991101, 844989777, 845116019, 845361471, 846071422, 847297072, 849057019, 851373434, 854229867, 857446730, 860475361, 862147987, 860873401, 855912089, 848478675, 840885341, 834879696, 831099868, 829548359, 830249071, 833389580, 838807821, 845688045, 852922440, 859431863, 864205480, 866760969, 867800534, 868566871, 869306266, 869196117, 867709339, 865350187, 863142073, 861783147, 861331761, 861602962, 862620413, 864546001, 867405653, 870900095, 874359310, 876995862, 878268898, 878166974, 877307892, 876512349, 876240790, 876581728, 877468288, 878764570, 880321860, 881983340, 883502364, 884537935, 884877622, 884656549, 884221733, 883802414, 883439839, 883129895, 882867515]
899.5H82867515k44141k47061k37584k25902k57790l33011m02927m44830m79221n06520
919.9H79488528m94182m44532m13060m48942n27978n88000o22153o54936o74486o69122
940.3H73951137o45220n73814m80235n85198r51290j228392j210928j073301r53317
958.6H66249442q24690o64711n01930l70563k88307k61665l29256o01947j124918j638890
979H59642565j891792k095460k464712k782226k768755k385258j757801j042783l83079
997.4H42070699J10268M20094N81443M77553j02222j097381k229691l201902l641486
1015.7H33387375l347576k503633j444638m11928M92871J244128J820147K144873K114773
1034.1H33496392J789808J413167J088202Q20398P26700P77840P71880O23286L86119
$$ y = [882867515, 882623374, 882376313, 882138729, 881912827, 881655037, 881322026, 880919099, 880474269, 879995048, 879488528, 878994346, 878549814, 878136754, 877687812, 877159834, 876571834, 875949681, 875294745, 874620259, 873951137, 873305917, 872732103, 872251868, 871666670, 870715380, 869486988, 868276060, 867202759, 866249442, 865424752, 864760041, 864258111, 863887548, 863599241, 863337576, 863008320, 862406373, 861281455, 859642565, 857750773, 855655313, 853190601, 850408375, 847639620, 845254362, 843496561, 842453778, 842070699, 842180967, 842601061, 843182504, 843660057, 843557835, 842460454, 840230763, 837028861, 833387375, 830039799, 827536166, 826091528, 825679600, 826172471, 827416599, 829236746, 831381619, 833496392, 835286200, 836699367, 837787569, 838607967, 839334667, 840112507, 840884387, 841507673, 841893792]
1052.4H41893792J18971j62423m38690o65009q24451r45270j048863j144529j270175
1070.8H35513353j480519j795054k180099k600611l033101l415823l665984l772437
1087.1H13569725l821314l921628m124999m485965n004465n417407n530596n667746
1103.4G75595605o139457o599426o566227o061852n269169m034818k006054R12965
1119.8G39831567M377425P821619J0828376J3184666J4514387J4370680J2896299J0689974
1136.1H28514993P982791M688382J104414k056062m195869n225003n565464n899430
1152.4H19348752o692528p832825r220541j1195421j3378561j4140248j2518227r668470
1168.7G34701931p565677o765365n800128l330767l04044J293123R59039k96295j695752
$$ y = [841893792, 842012763, 841850340, 841411650, 840746641, 839922190, 838976920, 837928057, 836783528, 835513353, 834032834, 832237780, 830057681, 827457070, 824423969, 821008146, 817342162, 813569725, 809748411, 805826783, 801701784, 797215819, 792211354, 786793947, 781263351, 775595605, 769456148, 762856722, 756290495, 750228643, 744959474, 740924656, 738918602, 739831567, 744208992, 752030611, 762858987, 776043653, 790558040, 804928720, 817825019, 828514993, 836497784, 841186166, 842290580, 840234518, 836038649, 830813646, 825248182, 819348752, 812656224, 804823399, 795602858, 784407437, 771028876, 756888628, 744370401, 734701931, 727136254, 720370889, 714570761, 711239994, 710935950, 712229073, 713188112, 712891817, 711196065]
1187.1G11196065k882183k791881l86834L483891O667435Q136154Q913636J0461092
1203.4G42797375J2475311J3276756J2187779J0152757Q320392P035255O066263N194425
1219.7H17506313M445613L917575L539383L140450K600073J769305N73814p46489j826167
1238.1H34919870k465785k689659k694428k624870k406418j887441j052856m0591R70960
1256.4H20028782J802862K261519K234221J757562Q26597p87139l177404n732060p328868
1274.8H11886072p268309n718589l235579k81334K770067N442976P297576Q168995
1291.1H19061875P971347O713092M631817K216757K71797n81443m51386N5670L32713
1309.4H40222239j06215j408756l145993m591405n209625m948914m094422l014564
$$ y = [711196065, 708313882, 705522001, 705135167, 708619058, 715286493, 723422647, 732336283, 742797375, 755272686, 768549442, 780737221, 790889978, 799210370, 806245625, 812311888, 817506313, 821951926, 825869501, 829408884, 832549334, 835149407, 836918712, 837492526, 836746037, 834919870, 832454085, 829764426, 827069998, 824445128, 822038710, 820151269, 819098413, 819057822, 820028782, 821831644, 824093163, 826327384, 828084946, 828911543, 828124404, 824947000, 819214940, 811886072, 804617763, 798899174, 795663595, 795382261, 798152328, 803595304, 810892880, 819061875, 827033222, 833746314, 838378131, 840594888, 840866685, 840285242, 839833856, 839889526, 840222239, 840116024, 838707268, 835561275, 830969870, 825760245, 820811331, 816716909, 813702345]
1325.8H13702345j783609j77146J814902L873647N521774O303012O013394N023658
1342.1H40291977M034758L370285K842784J968204L78550j741052m004479o139755
1358.4H41001272p708907q142829p479071o098629m316687k449632p15196P26163J658679
1376.7H06475163J916766J580834R56774J57118n26071n78642J81854J294255K283335
1395.1H13741386K942979L119588K805472K091527J145958J51575o43134r89378j016914
1413.5H23349059r10640p20382m66764j35779K36571M18007L29435k6286o60360j509905
1433.9H19902956k625584l843963m798830n221367m935205m403591l962576l446937
1450.2G86664903k767861k132237j582682j038670k93374N99026J453936K409160L696025
$$ y = [813702345, 811918736, 811741590, 813556492, 817430139, 822951913, 829254925, 835268319, 840291977, 844326735, 847697020, 850539804, 852508008, 852886558, 851145506, 847141027, 841001272, 833292365, 825149536, 817670465, 811571836, 807255149, 804805517, 804090321, 804816484, 806475163, 808391929, 809972763, 810929537, 811086655, 810560584, 809981942, 810163796, 811458051, 813741386, 816684365, 819803953, 822609425, 824700952, 825846910, 825998485, 825355351, 824365973, 823349059, 822438419, 821718037, 821251273, 821115494, 821352065, 821770072, 822099507, 822073221, 821412861, 819902956, 817277372, 813433409, 808634579, 803413212, 798478007, 794074416, 790111840, 786664903, 783897042, 781764805, 780182123, 779143453, 778850079, 779449105, 780903041, 783312201, 787008226]
1468.5G87008226N262494O694257P498980P831871P743538P162094O281614N326927
1484.9H40810001M349053L361285K331435J558066N42760r57191k318919l107429l100633
1503.2H43468428k463281j632035o84381L53039J328945J979828K324461K634049K708852
1521.6H50017905J743138L67761l41237o34968q00133r70840j157523j367330j729667
1539.9H45127106k175093k376437k182007k498865l201008l976643m572213n115092
1556.2H19029748o467402q429169j0205209j0916770j0630965r655714p689059m420817
1572.6G50614643m27663L159404O587445R534121J1488139J2054146J0945141Q716107
1588.9H12671483N904316K744079q19087m054844n922675o254197n402445l992260
$$ y = [787008226, 792270720, 798964977, 806463957, 814295828, 822039366, 829201460, 835483074, 840810001, 845159054, 848520339, 850851774, 852409840, 852952600, 851995409, 849676490, 846569061, 843468428, 841005147, 839373112, 838688731, 839041770, 840370715, 842350543, 844675004, 847309053, 850017905, 851761043, 852128804, 851787567, 851152599, 850352466, 849381626, 848224103, 846856773, 845127106, 842952013, 840575576, 838393569, 835894704, 832693696, 828717053, 824144840, 819029748, 812562346, 804133177, 793927968, 783011198, 772380233, 762724519, 755035460, 750614643, 750186980, 753346384, 759933829, 769467950, 780956089, 793010235, 803955376, 812671483, 818575799, 821319878, 820500791, 816445947, 810523272, 804269075, 798866630, 794874370]
1605.2G94874370k502561r95516L70383J373470J917898J810968R62794k02000j149177
1623.5G96460629j744509j989782k089441k124607k278209k714515l035843k972842
1639.9G77510881l307759m026175m748642n279363n798459o845653q444786r946346
1656.2G29113698j0524213r949982q135379n114317j244008K942204O702840J0020733
1672.5G13811576J2186170J2451053J0635316P577539M769980L075421K380133J634479
1688.8G68521667P32183J42992J74641J101375K715766M153669M768372M885673M907191
1707.2G92103529N334675O388009P527649P827103O875933N288779M017353L368020
1723.5H38731050L018439K801001K719582K803981L009140L101707L124177L127933
$$ y = [794874370, 792371809, 791376293, 791746676, 793120146, 795038044, 796849012, 797811806, 797609806, 796460629, 794716120, 792726338, 790636897, 788512290, 786234081, 783519566, 780483723, 777510881, 774203122, 770176947, 765428305, 760148942, 754350483, 747504830, 739060044, 729113698, 718589485, 708639503, 700504124, 695389807, 694145799, 697088003, 703790843, 713811576, 725997746, 738448799, 749084115, 756661654, 761431634, 764507055, 766887188, 768521667, 769253850, 769396842, 769571483, 770672858, 773388624, 777542293, 782310665, 787196338, 792103529, 797438204, 803826213, 811353862, 819180965, 826056898, 831345677, 835363030, 838731050, 841749489, 844550490, 847270072, 850074053, 853083193, 856184900, 859309077, 862437010]
1739.8H62437010L046155K918482K794921K721608K712547K499521K112270J806676
1756.1H83049190J630962J508832J344502J177072J058221Q89540O65843M97818L57867
1774.5H92179847K24709J62125J31011Q7857Q5592J73927K66850K03550M3571p6294
1794.9H93482745j00196p7009r8884j78337k04146j18494n0128n7458k3246J04427
1815.3H92679274K53797K74300K07603J86622J94550J33395M6730M8518N1916k0325
1835.7H94056380j03653j31607j35123j34409j18673j49667k34366l21447l31402k03550
1856.1H92192483k1815R8645J05501O3896O258p4386j54317k18689k67446k92659l02672
1878.5H91134799k73347j65940o4075p6830j48416k25246l23474m17531m61816m73023
$$ y = [862437010, 865483165, 868401647, 871196568, 873918176, 876630723, 879130244, 881242514, 883049190, 884680152, 886188984, 887533486, 888710558, 889768779, 890658319, 891324162, 891821980, 892179847, 892404556, 892566681, 892697692, 892785549, 892871141, 893045068, 893311918, 893515468, 893559039, 893482745, 893382549, 893305540, 893206656, 893028319, 892824173, 892705679, 892655551, 892598093, 892574847, 892679274, 892933071, 893207371, 893414974, 893601596, 893796146, 893929541, 893976271, 894024789, 894076705, 894056380, 893952727, 893821120, 893685997, 893551588, 893432915, 893283248, 893048882, 892727435, 892396033, 892192483, 892170668, 892269313, 892374814, 892438710, 892444968, 892370582, 892216265, 891997576, 891730130, 891437471, 891134799, 890861452, 890695512, 890631437, 890554607, 890406191, 890180945, 889857471, 889439940, 888978124, 888505101]
1898.9H88505101m72665l95894k08437l6597O7830J56998K17200K27272J89841J24514
1919.3H88375163N8115p093p9394j25766r1552o438N0426M4286J7584j5319p2300j23501
1943.8H88024211j47343j67489k11537k54869k51830k09749j70648j60396j63018j73152
1964.2H86114180j93179j96695j70767j44124j36972j24454p4566q642K5809K4259
1984.6H85114849J6629P809j8836m9293n8472o6578r9659j38283j45078j24752j08302
2007H84330034j09195j39773k18809l03924l24071k80916k19524j68204j21534o3420
2027.4H82380664j311M7326P6771Q5294O6221R54q7202j17481q7261o5386n8353l6776
2051.9H82203460j1087p75J371M471L636o617j6927j7524j7226k7895l9518l8445l2246
$$ y = [888505101, 888032436, 887636542, 887428105, 887391508, 887459338, 887616336, 887833536, 888060808, 888250649, 888375163, 888433278, 888426185, 888346791, 888221025, 888129473, 888123035, 888173461, 888217747, 888235331, 888220012, 888147712, 888024211, 887876868, 887709379, 887497842, 887242973, 886991143, 886781394, 886610746, 886450350, 886287332, 886114180, 885921001, 885724306, 885553539, 885409415, 885272443, 885147989, 885073423, 885064781, 885090590, 885114849, 885131478, 885139287, 885120451, 885071158, 885012686, 884946108, 884846449, 884708166, 884563088, 884438336, 884330034, 884220839, 884081066, 883862257, 883558333, 883234262, 882953346, 882733822, 882565618, 882444084, 882380664, 882379353, 882426679, 882503450, 882588744, 882654965, 882655919, 882568717, 882451236, 882363975, 882298589, 882240236, 882203460, 882192373, 882191598, 882192969, 882197440, 882201076, 882194459, 882177532, 882160008, 882142782, 882114887, 882075369, 882036924, 882004678]
2078.4H82004678l5405m8876n9843o7174p9751q8871q5354q1300q7738r5368r1016
2100.8H81183982p5936o0022m6313k8908p987N900J1206K1279L8922M8578M5061M0412
2125.3H81176174L7610K9981J8418J4544J7881J5915O258n36j252l398j0788j5020
2149.8H81285787j0908r954k5749m7326n7102n8174n9068n8770n3644m5479l6180k2173
2174.3H80801260k086J3829J4543M351r596k4438l5942m1782m2737m8101o1512o7055
2198.7H80500734n7876n0545n7280p0036p9751q8453j01685j15753j24335j30236j38402
2221.2H79486382j42276j33038j14024r4652p7247n7519m1127l1590k1399n304M172
2243.6H78772378k325j0311j0073j1623k2173l0518l1054l5703n1677o5565o6579o5028
$$ y = [882004678, 881969273, 881920397, 881860554, 881793380, 881713629, 881624758, 881539404, 881458104, 881370366, 881274998, 881183982, 881108046, 881048024, 881001711, 880972803, 880964816, 880970716, 880981922, 881003201, 881042123, 881090701, 881135762, 881176174, 881213784, 881243765, 881262183, 881276727, 881294608, 881310523, 881316781, 881316245, 881314993, 881311595, 881300807, 881285787, 881274879, 881264925, 881239176, 881191850, 881134748, 881076574, 881017506, 880958736, 880905092, 880859613, 880823433, 880801260, 880799174, 880813003, 880827546, 880831897, 880822301, 880797863, 880761921, 880720139, 880677402, 880629301, 880567789, 880500734, 880442858, 880392313, 880335033, 880264997, 880185246, 880096793, 879995108, 879879355, 879755020, 879624784, 879486382, 879344106, 879211068, 879097044, 879002392, 878925145, 878867626, 878826499, 878794909, 878773510, 878768206, 878772378, 878770053, 878759742, 878749669, 878738046, 878715873, 878685355, 878654301, 878618598, 878566921, 878501356, 878434777, 878369749]
2268.1H78369749p3076q6248r3996r6917j02938j07824j02580r1016q2016p2062n3644
2290.5H77407432l3856k3544j8358r596q35J312M172J3590K0504K1636K5809M0531
2315H77448797N9724P0989P1109O3478M2379O557k6167m3988o5326j06574j47998j52528
2339.5H77220452j22428r0778o2048l0578j6212k6167m1544m9055n8114q5890j39535
2361.9H76498103k02656k54035k86996l10719l26872l25739l12865k90692k40564j68145
2382.3H73778820j02222m9353k622K8491K7358M828j8179m0233o6400r1195j06573
2404.7H73362720j10626j11401j13905j12653j06990j05679j13070j22189j25111j25527
2425.1H72215569j27077j27137j28090j37687j52588j64032j71602j79231j82688j76012
$$ y = [878369749, 878296673, 878210425, 878116429, 878019512, 877916574, 877808750, 877706170, 877615154, 877533138, 877461076, 877407432, 877373576, 877350032, 877331674, 877322078, 877321243, 877322555, 877326727, 877340317, 877360821, 877382457, 877408266, 877448797, 877508521, 877579510, 877650619, 877714097, 877756476, 877763033, 877736866, 877692878, 877627552, 877520978, 877372980, 877220452, 877098024, 877007246, 876945198, 876914620, 876898408, 876872241, 876830697, 876781642, 876723528, 876637638, 876498103, 876295447, 876041412, 875754416, 875443697, 875116825, 874791086, 874478221, 874187529, 873946965, 873778820, 873676598, 873627245, 873624623, 873653114, 873680472, 873685300, 873667121, 873626888, 873560488, 873469293, 873362720, 873252094, 873140693, 873026788, 872914135, 872807145, 872701466, 872588396, 872466207, 872341096, 872215569, 872088492, 871961355, 871833265, 871695578, 871542990, 871378958, 871207356, 871028125, 870845437, 870669425]
2445.5H70669425j64688j51932j31727r9599o5684m5598l9935l7074l7193n0843p2956
2467.9H69772196q8692r8228j11163j24395j26362j19865j16229j17421j13368r9599
2488.3H68656874q2910o7652n0604l2186k0743j3649n37J2458J0907m351k1458l3795
2512.8H68352354m2975m8042m5180m0412m3094n2452n8413n3406m8100n3704o4612
2535.3H67801964p5578q8811j00315j06811j14322j25528j37150j44601j49071j53184
2555.6H66606593j53184j48833j48058j58131j75833j89722k02179k23160k41577k40565
2576H64725351k25067k06411j78396j32084p8261l7313j0729J3769L3736L7969L0219
2598.5H63972783K0266N006k5033n9724q5354j08183j34408j58787j76906j87457j92344
$$ y = [870669425, 870504737, 870352805, 870221078, 870121479, 870055795, 870010197, 869970262, 869933188, 869895995, 869845152, 869772196, 869683504, 869585276, 869474113, 869349718, 869223356, 869103491, 868987262, 868869841, 868756473, 868656874, 868573964, 868506312, 868455708, 868423522, 868402779, 868389130, 868388593, 868401051, 868411958, 868407607, 868386149, 868352354, 868309379, 868261337, 868216157, 868175745, 868132651, 868080199, 868021786, 867968380, 867920280, 867866576, 867801964, 867726386, 867637575, 867537260, 867430449, 867316127, 867190599, 867053449, 866908848, 866759777, 866606593, 866453409, 866304576, 866156518, 865998387, 865822554, 865632832, 865430653, 865207493, 864965916, 864725351, 864500284, 864293873, 864115477, 863983393, 863905132, 863867819, 863857090, 863870859, 863904595, 863942564, 863972783, 863993049, 863998055, 863973022, 863913298, 863827944, 863719761, 863585353, 863426566, 863249660, 863062203, 862869859]
2620.9H62869859j95444j89960j73032j59025j51337j37507j17720j06752j01983q6129
2641.3H61450970o4254n3763m9710m2081l6240l4511l5226l8028m4048n6386o7293
2663.7H60929430o6758o4552p4446r2923j10150j29521j59621j91569k12670k28881
2684.1H59598339k45333k52664k44439k28345k16365k09034k03788k10643k35796k68936
2704.5H57282996k96712l15845l30746l36528l34859l47316l79562m09901m13955l94404
2724.9H53723168l80575l81232l77655l57806l13282k39313j48892o3181p16L7671
2745.3H51498187P1108J05560J30772J39714J22964P1883l218o7831j03175j32919
2765.7H51833045j78456k28703k66731k94029l08633l03865k88188k73764k59042k34723
$$ y = [862869859, 862674415, 862484455, 862311423, 862152398, 862001061, 861863554, 861745834, 861639082, 861537099, 861450970, 861386716, 861332953, 861283243, 861241162, 861204922, 861170411, 861135185, 861097157, 861053109, 860996723, 860929430, 860862672, 860798120, 860723674, 860630751, 860520601, 860391080, 860231459, 860039890, 859827220, 859598339, 859353006, 859100342, 858855903, 858627558, 858411193, 858202159, 857998371, 857787728, 857551932, 857282996, 856986284, 856670439, 856339693, 856003165, 855668306, 855320990, 854941428, 854531527, 854117572, 853723168, 853342593, 852961361, 852583706, 852225900, 851912618, 851673305, 851524413, 851461232, 851460516, 851498187, 851569295, 851674855, 851805627, 851945341, 852068305, 852140188, 852136970, 852069139, 851965964, 851833045, 851654589, 851425886, 851159155, 850865126, 850556493, 850252628, 849964440, 849690676, 849431634, 849196911]
2786.1H49196911k04146j80066j76251j94966k19465k49326l02076l67701m20451m67837
2806.5H46414626n22137n63204n69702n59747n65409n81623n89430n93006n85437n67973
2826.9H40716958n67853n90265o18875o45459o73413p15733p77840q45910q91327q97110
2847.3H33493173q76129q37802p79331p34508p33495p16627o24537m93825l82721l02374
2867.7H27011824k41220j91748j52231j28805j39237j92523k86102m14670n52177o48499
2888.1H24064612o93440p17878p24495p01129o56903o07133n75840n87583o48379p37906
2908.5H17413926q16703q62419q82566q75056q45909q10564p36713n66721k93255K6762
2928.9H10750782L22342N51761O99699P62522P69555P35522O30200M33981J42872k04742
$$ y = [849196911, 848992765, 848812699, 848636448, 848441482, 848222017, 847972691, 847670615, 847302914, 846882463, 846414626, 845892489, 845329285, 844759583, 844199836, 843634427, 843052804, 842463374, 841870368, 841284931, 840716958, 840149105, 839558840, 838939965, 838294506, 837621093, 836905360, 836127520, 835281610, 834390283, 833493173, 832617044, 831779242, 830999911, 830265403, 829531908, 828815281, 828190744, 827696919, 827314198, 827011824, 826770604, 826578856, 826426625, 826297820, 826158583, 825966060, 825679958, 825265288, 824713111, 824064612, 823371172, 822653294, 821928799, 821227670, 820570767, 819963634, 819387794, 818800211, 818151832, 817413926, 816597223, 815734804, 814852238, 813977182, 813131273, 812320709, 811583996, 811017275, 810724020, 810750782, 811073124, 811624885, 812324584, 813087106, 813856661, 814592183, 815222383, 815656364, 815799236, 815594494]
2949.3H15594494n22196p57873r35495j101375j257836j371920j438439j457751j403690
2967.6H05347919j298904j199841j107932r95874q30650n99027l37601p3433J86980
2986G99091637M40359P01070R61781J186669J351833J441538J449466J370311J196921
3004.4H09191585R52482O72757L88682J44303n0723j91272k33769j67966l4153J36077
3024.7H10808003L46124N76437P48813P98285P28965N90860M35830K92241J77086J07228
3045.1H15609872Q1838Q3267Q3566P3790P4089O6102n544j62422l62873n34237o65843
3067.6H14341605p94530r24826j058221j197636j325548j435339j522899j588940j643181
3085.9H02850485j667798j644134j560509j398325j175046r34303o75500l70741j3887
$$ y = [815594494, 815072298, 814314425, 813378930, 812277555, 811019719, 809647799, 808209360, 806751609, 805347919, 804049015, 802849174, 801741242, 800745368, 799914718, 799315691, 798978090, 798904657, 799091637, 799531996, 800233066, 801194847, 802381516, 803733349, 805174887, 806624353, 807994664, 809191585, 810144067, 810816824, 811205506, 811349809, 811299086, 811107814, 810874045, 810706079, 810671926, 810808003, 811154127, 811730564, 812479377, 813277662, 814006627, 814597487, 815033317, 815325558, 815502644, 815609872, 815691710, 815774977, 815858543, 815932333, 816006422, 816072524, 816066980, 815904558, 815541685, 815007448, 814341605, 813547075, 812622249, 811564028, 810366392, 809040844, 807605505, 806082606, 804493666, 802850485, 801182687, 799538553, 797978044, 796579719, 795404673, 794470370, 793794870, 793424129, 793410242]
3104.3G93410242L75688P50124J050651J254320J371086J393855J288175J054645P46131
3122.6H02694917M06861M7028l08692o16908q68917j088321j295805j491964j676202
3141G95801997j868665k081752k297759k491653k646327k740323k759755k713502k598762
3159.4G73603499k385438k049565j585007j018107m13179J83344P57337J282274J720310
3177.7G70095468K047777K253473K329051K282083K147675J960694J744688J524568
3194G86385477J316905J122892R45150P82550O34551N07474L95238K84791J82331R6142
3214.4G92653501J8001m5777p1585p2479q8573j29819j80304k26557k62022k92182
3234.8G91302204l41594m19676n04554n77748o39557o84977p16090p65503q45670r24051
$$ y = [793410242, 793785930, 794536054, 795586705, 796841025, 798212111, 799605966, 800894141, 801948786, 802694917, 803101778, 803148806, 802840114, 802223206, 801354289, 800265968, 798970163, 797478199, 795801997, 793933332, 791851580, 789553821, 787062168, 784415841, 781675518, 778915763, 776202261, 773603499, 771218061, 769168496, 767583489, 766565382, 766152203, 766335547, 767092884, 768375158, 770095468, 772143245, 774396718, 776725769, 779007852, 781155527, 783116221, 784860909, 786385477, 787702382, 788825274, 789770424, 790552974, 791187525, 791694999, 792090237, 792375028, 792557359, 792653501, 792671502, 792625725, 792554140, 792481661, 792393088, 792263269, 792082965, 791856408, 791594386, 791302204, 790960610, 790540934, 790036380, 789458632, 788819075, 788134098, 787418008, 786652505, 785806835, 784882784]
3255.2G84882784r64999r72629r75490j000225j068711j164794j256526j342833j437485
3273.6G74699092j536548j613796j662016j700997j741350j805007j953781k227008
3289.9G60458589k623380l148377l816604m619837n495489o331861p006526p382512
3306.2G20034003p320940o705702n471825l667355j442373J002253L414213N521417
3322.5G05363691P105946Q037389Q272528P854224O890773N561650M108787K742231
3338.8G55937219J571715O29007r1016o15179r92835j270354j461565j584292j673043
3357.2G50449657j762807j870692j967728k014518k020895k021909k025127k028585
3373.5G34737396k023697j974940j866758j737654j628995j539230j454234j386643
$$ y = [784882784, 783917785, 782945156, 781969666, 780969441, 779900730, 778735936, 777479410, 776136577, 774699092, 773162544, 771548748, 769886732, 768185735, 766444385, 764639378, 762685597, 760458589, 757835209, 754686832, 750870228, 746250391, 740754902, 734423041, 727416515, 720034003, 712713063, 706007361, 700535536, 696868181, 695425808, 696428061, 699842274, 705363691, 712469637, 720507026, 728779554, 736633778, 743524551, 749086201, 753194988, 755937219, 757508934, 758137941, 758046925, 757431746, 756438911, 755168557, 753706992, 752122700, 750449657, 748686850, 746816158, 744848430, 742833912, 740813017, 738791108, 736765981, 734737396, 732713699, 730738759, 728872001, 727134347, 725505352, 723966122, 722511888, 721125245]
3389.8G21125245j353979j339257j315057j285553j261950j246690j231909j181066
3406.1G10909784j100302j051903j032233r69767q48771p39395o71268n75065m30763
3424.5G03490317k99037k04503j33634o7174K0444J08600J61290J98901K54631L33488
3444.9G03863323M32253N40018O37591P24554Q15570R07063R70185R96173R92000R70125
3465.3G11848855R65118R67026R45389R30250R44257R42767R18030R36032J012206
3483.6G20409930J068651J071930J089573J130700J157761J172543J158952J136780
3500G29396820J146913J154184J120448J085341J123130J224995J311719J377702J441181
3518.3G40382433J454174J431168J429081J418054J391053J397371J455188J514852
$$ y = [721125245, 719771266, 718432009, 717116952, 715831399, 714569449, 713322759, 712090850, 710909784, 709809482, 708757579, 707725346, 706755579, 705906808, 705167413, 704496145, 703921080, 703490317, 703191280, 702986777, 702853143, 702785969, 702806413, 702915013, 703076303, 703275204, 703529835, 703863323, 704295576, 704835594, 705473185, 706197739, 707013309, 707920372, 708890557, 709886730, 710878730, 711848855, 712813973, 713780999, 714726388, 715656638, 716600895, 717543662, 718461692, 719397724, 720409930, 721478581, 722550511, 723640084, 724770784, 725928545, 727101088, 728260040, 729396820, 730543733, 731697917, 732818365, 733903706, 735026836, 736251831, 737563550, 738941252, 740382433, 741836607, 743267775, 744696856, 746114910, 747505963, 748903334, 750358522, 751873374]
3534.6G51873374J543760J591921J639247J613438J534701J452863J393497J377940
3551G64020741J421750J506447J585782J660228J726567J730979J676559J638413J613855
3569.3G78581321J583040J631320J769602J876235J946688K061784K176761K189339
3585.6G93816090K132237K051413J952409J862884J818299J813472J864492J971603
3601.9H09282899K032876K026737K020716J968086J828551J702726J696289J670301
3618.3H24229181J556814J432657J317858J191378J056135R03427P80523Q34108J058399
3636.6H34360480J169384J112580J072228J098514J024067Q42393O03139L20256Q6665
3655H41689706k4140p2420J6272L40045O49869O60420M56631K31087O6936M0531J26899
$$ y = [751873374, 753417134, 755009055, 756648302, 758261740, 759796441, 761249304, 762642801, 764020741, 765442491, 766948938, 768534720, 770194948, 771921515, 773652494, 775329053, 776967466, 778581321, 780164361, 781795681, 783565283, 785441518, 787388206, 789449990, 791626751, 793816090, 795948327, 797999740, 799952149, 801815033, 803633332, 805446804, 807311296, 809282899, 811315775, 813342512, 815363228, 817331314, 819159865, 820862591, 822558880, 824229181, 825785995, 827218652, 828536510, 829727888, 830784023, 831687450, 832467973, 833302081, 834360480, 835529864, 836642444, 837714672, 838813186, 839837253, 840679646, 841282785, 841603041, 841689706, 841665566, 841593146, 841609418, 841949463, 842599332, 843259752, 843716383, 843947470, 844014406, 844054937, 844181836]
3677.4H44181836J35719P5400O6936J18912J89244L24965M14967L06607J47342J06514
3697.8H46068442J36137J62065K43843L18706K71022J88112J32859P7605K504r2268
3718.2H47509027j40965k2114K06530L90947M04000K97368K01821J33396J44124K19285
3738.6H49343419J86980N483j96635k90811k69950k17557k44021l20256l39687l12149
3759H47344816l21865l45469k48194q6188n1141p9751o7472o1214j18017j84656j98125
3781.4H45582724j54198q8930k4676L4451Q8811J89722K65181J97589N6804m7386j10507
3803.9H45989585j42217r7394m4584l8028l6955j3411k384l2008m6610l3737k9385
3826.3H45472872k9623k325J5974q225m4108o8247l219J5259q1539k07245k71500k17974
$$ y = [844181836, 844317555, 844392955, 844459891, 844578803, 844768047, 845093012, 845507979, 845814586, 845961928, 846068442, 846204579, 846366644, 846610487, 846929193, 847200215, 847388327, 847521186, 847598791, 847601295, 847509027, 847368062, 847345948, 847552478, 847943425, 848347425, 848644793, 848846614, 848980010, 849124134, 849343419, 849530399, 849535882, 849339247, 849048436, 848778486, 848560929, 848316908, 847996652, 847656965, 847344816, 847022951, 846677482, 846429288, 846343100, 846291959, 846212208, 846144736, 846083522, 845965505, 845780849, 845582724, 845428526, 845339596, 845314920, 845349371, 845438182, 845627904, 845893085, 846090674, 846147478, 846100092, 845989585, 845847368, 845749974, 845705390, 845667362, 845630407, 845616996, 845614612, 845582604, 845535994, 845502257, 845472872, 845443249, 845440924, 845456898, 845448673, 845404565, 845336318, 845333099, 845348358, 845266819, 845059574, 844788074, 844570100]
3850.8H44570100r5367m292L8207L4809l8385j71066k63929j84715k8193k3782r3401
3873.2H43739986j69336j97530j52826j44601j77980j64151j00672k7597J4424J2219
3893.6H42631936n364m8280j06275j55628j93357j86742j79112k24411k57611k18928
3914H41056228j18375Q643R9241Q8275l815j05083j59204j48952j07050p3075n5433
3936.4H40481400m4643m4763o6758q5890p3314n7518p8678j23740j56402j54078j28806
3958.9H39466810j04904p4565l8922k5571k6702k2591k2530k5153k6346l9339o0200
3981.3H38999987p4804p8619p5459p1585p0989p0632o3241n3703
3997.6H38440955
$$ y = [844570100, 844474733, 844470441, 844508648, 844543457, 844505072, 844334006, 844070077, 843885362, 843857169, 843833387, 843739986, 843570650, 843373120, 843220294, 843075693, 842897713, 842733562, 842632890, 842605293, 842619717, 842631936, 842626572, 842578292, 842472017, 842316389, 842123032, 841936290, 841757178, 841532767, 841275156, 841056228, 840937853, 840946496, 841045737, 841134012, 841130197, 841025114, 840865910, 840716958, 840609908, 840536833, 840481400, 840436757, 840391994, 840325236, 840239346, 840166032, 840108514, 840029836, 839906096, 839749694, 839595616, 839466810, 839361906, 839287341, 839248419, 839222848, 839196146, 839173555, 839151025, 839125872, 839099526, 839060187, 838999987, 838925183, 838846564, 838771105, 838699520, 838628531, 838557899, 838494658, 838440955]
##END=$$ End of the data block
