##TITLE=AC-3 $$ Begin of the data block
##JCAMP-DX=5.00 $$ ACD/SpecManager v 10.08
##SPECTROMETER/DATA SYSTEM=Alpha
##DATE=11 Nov 2015 08:55:44
##DATA TYPE=INFRARED SPECTRUM
##DATA CLASS=XYDATA
##ORIGIN=
##OWNER=
##NPOINTS=1765
##FIRSTX=399.76428223
##LASTX=3997.64306641
##MAXX=3997.64306641
##MINX=399.76428223
##MAXY=0.89471036
##MINY=0.68408883
##XFACTOR=1.0000000000
##YFACTOR=1.000000000000000e-9
##FIRSTY=0.86020416
##DELTAX=2.03961372
##XUNITS=1/CM
##YUNITS=ARBITRARY UNITS
##XYDATA=(X++(Y..Y))
399.8H60204160j069426j292825k131760p99775J058399K25664j109481L74317J873910
418.1H57333183r55522l047704j772523j323641k194166j436949J268387K545059J274586
436.5H51690710O98566J804769J443386m37319n02229O36339J58012j037001j36137
454.8H54319096J264810k53677j931608q73864J66893q65697j658798n81026p37130
473.2H48848999l127635m622996m779100m434347j980007L147364O623804N480051
489.5H45156133K071321J16289N6147p85231l134191n765200p337212m207254M062414
507.9H30233216R514809P455587K565503p01487j892686k772212l865003k399325J998722
526.2H40137124M200041K291501Q7738K0385P38859Q9109r49502m85122M02987j68920
$$ y = [860204160, 859134734, 857841909, 855710149, 854910374, 855968773, 856194437, 855084956, 855459273, 857333183, 856377661, 853329957, 851557434, 850233793, 848039627, 846602678, 847871065, 850416124, 851690710, 852389276, 854194045, 855637431, 855200112, 854697883, 855334222, 855492234, 854455233, 854319096, 855583906, 855330229, 853398621, 852524757, 852691650, 851825953, 850167155, 849586129, 848848999, 845721364, 841098368, 836319268, 831884921, 829904914, 833052278, 839676082, 845156133, 847227454, 847343743, 847399890, 846614659, 843480468, 837715268, 830378056, 826170802, 830233216, 839748025, 847203612, 849769115, 849067628, 847174942, 844402730, 840537727, 838138402, 840137124, 844337165, 846628666, 846716404, 846736789, 847475648, 847564757, 846615255, 846130133, 846533120, 846364200]
546.6H46364200j119196p05839j20222j017451k003491j367271r15170k420843m237115
565H32457602m855931m607737k526641J732230M298747K372682L93152K766848N384326
583.3H37415278L657162m9710k045751k605557m509509q174598r487808l978312N695045
601.7H15916240J1289716J0482192P317066M175961J533747O05166J149058J180411
618H53649557L80337M37021J324892J134753r9778k70903M96984m7148j285970o13808
638.4H55105937J037061Q78334q24928k341331m845321q048594l459453Q720100J2924969
656.8H59146774O463826P52925j92165N21719J57655j025379k29359P75814K97845
675.1H66669655o49512l66092K85864l08871j096964n41806J86443l97384j137972
$$ y = [846364200, 845245004, 844539165, 844418943, 843401492, 841398001, 840030730, 839115560, 836694717, 832457602, 827601671, 822993934, 820467293, 822199523, 826498270, 828870952, 829264104, 832030952, 837415278, 841072440, 841022730, 838976979, 836371422, 831861913, 823687315, 814199507, 810221195, 815916240, 827205956, 837688148, 845005214, 849181175, 850714922, 851320088, 852469146, 853649557, 854029894, 854466915, 855791807, 856926560, 856826782, 856555879, 857052863, 857005715, 855719745, 855105937, 856142998, 857021332, 856196404, 853855073, 849009752, 840961158, 837501705, 846221805, 859146774, 865610600, 866363525, 866171360, 866693079, 866850734, 865825355, 865595996, 866371810, 866669655, 866020143, 865654051, 865939915, 865631044, 864534080, 863992274, 864178717, 863781333, 862643361]
693.5H62643361m80115M64976N9962n86450n9069K15531j274347k434969r44734R25243
713.9H58529389L68953q83282o12616j35243j096487k322257k645373l502011n626202
732.2H42074871n793929j262248L987134M341543J294672r60290k574504m828810o657184
750.6H29621255p738590r610772j0793269o433427K953053R924769J0189474O993115
766.9H25105608N127906M908085M527331M124224L933549K640068l33547l688455n028248
785.3H41316521j659274M873812Q682072P586658M114986P08461j465082k986789n537629
803.6H55633736r114683j2088597j2993932q529007L671348J5318453J5821457Q467138
819.9H56185913K509415J380027L249883L513217M99368j528919Q8751K208651K258300
$$ y = [862643361, 862163246, 862628222, 862688184, 862101734, 862042665, 862258196, 860983849, 858548880, 857604146, 858529389, 858898342, 858015060, 857402444, 857267201, 856170714, 853848457, 851203084, 847701073, 842074871, 836280942, 835018694, 839005828, 843347371, 844642043, 843681753, 841107249, 836278439, 829621255, 821882665, 812271893, 801478624, 795045197, 797998250, 807923019, 818112493, 825105608, 830233514, 835141599, 839668930, 843793154, 847726703, 850366771, 850033224, 846344769, 841316521, 839657247, 844531059, 853213131, 860799789, 864914775, 865623236, 864158154, 861171365, 855633736, 846519053, 834430456, 821436524, 812907517, 816578865, 831897318, 847718775, 856185913, 858695328, 860075355, 863325238, 866838455, 867337823, 865808904, 865897655, 868106306, 870364606]
838.3H70364606P41363j815140n008638p168889n064130J947582Q025348Q369148N589485
856.6H75980735L094017J137793k95043j020789j718282k680839k350747M43399L593921
875H76184165M132987K527952J143515N65827Q9288l11256k54273p8321k46405m63129
895.4H83290350l26395r1254j73152l88264l15309r9599j55926l91424l90231k80202
915.8H80678594m41790p04765p29143n52416m25458l87609k99454k08795l58284p56800
936.2H75814080j102865j189351r38177m76658k33293k77817l98517o27040q79825
954.5H69690537j173794k119243l252387j884580J516641K359867M13715r42885j110137
972.9H63497734j129270j395463j688540j791776j895308k108157k145648k085328
$$ y = [870364606, 871105969, 869290829, 864282191, 857113302, 852049172, 853996754, 862022102, 870391250, 875980735, 879074752, 880212545, 879917502, 878896713, 877178431, 874497592, 872146845, 872590244, 876184165, 880317152, 882845104, 883988619, 884554446, 884643734, 884332478, 884078205, 883999884, 883753479, 883290350, 882963955, 882872701, 882699549, 882311285, 881995976, 881896377, 881740451, 881349027, 880958796, 880678594, 880236804, 879532039, 878802896, 878250480, 877825022, 877437413, 877137959, 876929164, 876570880, 875814080, 874711215, 873521864, 872583687, 872107029, 871873736, 871595919, 871197402, 870570362, 869690537, 868516743, 866397500, 863145113, 861260533, 862777174, 865137041, 865550756, 864607871, 863497734, 862368464, 860973001, 859284461, 857492685, 855597377, 853489220, 851343572, 849258244]
989.2H49258244k606511l572404l513754j501083J322448K952993K722621J358509
1005.5H46421063l55959j942933k911090l191591l646910m700005m626095k258659
1021.8H22787821J13011J432061L065348L927290K814591J172602M40896N49078O87718
1040.2H36990416O69003R01341J297057J295209Q71777M61042J26600l90947r47594
1058.6H41273904j052439p99358p41244r37402j033842j077295j388550j892626k224088
1076.9H30127060k414882k846420l459811l874779m075944m301012m435539m162967
1093.2H00555706l667295l638029m399717n611181o748617p433355p473349o150186
1109.6G55433977l738284l383875n655349n275428k15650M242063N719662Q363664
$$ y = [849258244, 846651733, 843079329, 839565575, 838064492, 839386940, 842339933, 845062554, 846421063, 846065104, 844122171, 841211081, 838019490, 834372580, 829672575, 825046480, 822787821, 822900832, 824332893, 827398241, 831325531, 834140122, 835312724, 835753620, 836302698, 836990416, 837659419, 838560760, 839857817, 841153026, 842024803, 842485845, 842612445, 842221498, 841273904, 840221465, 839422107, 838680863, 837743461, 836709619, 835632324, 834243774, 832351148, 830127060, 827712178, 824865758, 821405947, 817531168, 813455224, 809154212, 804718673, 800555706, 796888411, 793250382, 788850665, 783239484, 776490867, 769057512, 761584163, 755433977, 751695693, 748311818, 742656469, 737381041, 737165391, 741407454, 747127116, 755490780]
1125.9G55490780J4159679J9550443K0446897J6479015J0402322M816949Q27968j463055
1142.2H40710998k639294l521800m527569n539060o424248p134735p388056p236182
1158.5G96300054p882715j0540425j4477313j6526639j5371502j4340460j2297571
1172.8G04863429k101898J1907160J3227880j064122j4024853j1003912L497064J0311723
1189.1G15612471J039267r450078p081867L640473J2094915J5013159J4892518J4058948
1205.4G59819806J2923956J1184394R173632P345914N405844M218936M963040N894184
1221.7H20929706N398512M277229L013850J594781P00236P29203P21097l63171k059639
1240.1H34941804l475546m495025m849553l558874p85590J296938J245499L11911M20749
$$ y = [755490780, 769650459, 789200902, 809647799, 826126814, 836529136, 841346085, 842174053, 840710998, 838071704, 834549904, 830022335, 824483275, 818059027, 810924292, 803536236, 796300054, 788417339, 777876914, 763399601, 746872962, 731501460, 717161000, 704863429, 702761531, 714668691, 727896571, 726832449, 712807596, 701803684, 705300748, 715612471, 716651738, 707201660, 700119793, 703760266, 715855181, 730868340, 745760858, 759819806, 772743762, 783928156, 793101788, 800447702, 805853546, 810072482, 815035522, 820929706, 826328218, 830605447, 833619297, 835214078, 835914314, 836643517, 837364614, 837001443, 834941804, 831466258, 826971233, 822121680, 818562806, 817777216, 819074154, 820319653, 820631564, 821052313]
1258.4H21052313J500845K234101K283096J918495Q87632j013040l420472n989969
1274.8H19453001q920193j1777520j2106538o756842L919363J4059663J7444670J3994992
1291.1H29310596Q372426L790021L93987k433479l509045j896143P82728L202558L602266
1309.4H41615915J262427j152277k404511l638506n755842q497655r971679o993472
1325.8H04464400K44736O234408P299423M652381J536131J430690N035401P981836
1342.1H38879406P330955M774928K197981K28285j193642k179027l048301l970027
1358.4H43020558n311846p708013r881020j0537982r984732n740761K299487Q362949
1374.7H04518640P705390M067779Q04246k023876l491640l842771l088355l84033L283441
$$ y = [821052313, 822553158, 824787259, 827070355, 828988850, 829876482, 828863442, 825442970, 819453001, 810532808, 798755288, 786648750, 779891908, 783811271, 797870934, 815315604, 829310596, 837683022, 841473043, 841867030, 839433551, 835924506, 834028363, 834811091, 838013649, 841615915, 842878342, 841726065, 839321554, 835683048, 829927206, 821429551, 811457872, 804464400, 804709136, 810943544, 818242967, 822895348, 824431479, 825862169, 830897570, 838879406, 846210361, 850985289, 853183270, 853411555, 852217913, 850038886, 846990585, 843020558, 837708712, 830000699, 820119679, 809581697, 799596965, 793856204, 796155691, 804518640, 812224030, 816291809, 817096055, 815072179, 811580539, 807737768, 804649413, 804265380, 807548821]
1393.1H07548821O060898O012857L950179J746118P13110J49369p14660j080036r78350
1411.4H23408306o60599j54554r3997j011610j116097k60770J34408O28293R12130
1429.8H21785510L03864k33412j440942m223049n794286o585896o938816n992531m667342
1448.1G86213100k622128p510J571357N48363l436923m109382j500488J063586K836942
1466.5G80556917M445076O795943Q670211P559180O496310P081092P455885O703019
1482.8H35763633N588591N169690L936112J039565k29955N53250L25024j607358k341449
1501.2H48197103j471401k063572p195950o233871R47297N191624O118357N010307
1517.5H48499894L191114J462161m88102j090467j153291r13322l07023p79748r96828
$$ y = [807548821, 813609719, 819622576, 823572755, 825318873, 826031983, 826181352, 825466692, 824386656, 823408306, 822747707, 822593153, 822499156, 821487546, 820371449, 820110679, 820245087, 820873380, 821785510, 822089374, 821855962, 820415020, 816191971, 810397685, 803811789, 796872973, 790880442, 786213100, 783590972, 783583462, 785154819, 785703182, 782266259, 778156877, 776656389, 777719975, 780556917, 785001993, 791797936, 800468147, 808027327, 814523637, 821604729, 829060614, 835763633, 841352224, 846521914, 850458026, 851497591, 851267636, 851820886, 852145910, 850538552, 848197103, 846725702, 844662130, 837466180, 831232309, 832179606, 837371230, 843489587, 848499894, 851691008, 853153169, 852665067, 851574600, 850421309, 849507987, 849200964, 848421216, 847424388]
1535.8H47424388L81648J92345l121138m395008m032195l218054k880514k909660k669394
1554.2H24772418k134204n104900j2043655j0426581r274005j0297657j1781752j3078928
1570.5G50630736q020937N13673P342636Q066416Q838415J2816489J4828682J2943327
1586.8H07959437R124279N186260J870036j008332l626823n906105q125424r756208
1603.2G95717120q661926l797710K535880O111145N762398L571153M649k088427j876176
1621.5G97278106k238869k507925j963020j603365p87794J57177j491010m769027n414904
1639.9G76659369m958808m007757l688275m348159l291011m190624j0399222j0610760
1656.2G31164753q858323r747326j1983037j1342764n144477L038585J0897100J4059246
$$ y = [847424388, 847806036, 847998381, 844877243, 840482235, 836450040, 833231986, 830351472, 827441812, 824772418, 822638214, 817533314, 805489659, 795063078, 785789073, 775491416, 763709664, 750630736, 742609799, 743123472, 750466108, 758532524, 767370939, 780187428, 795016110, 807959437, 817083716, 822269976, 824140012, 823131680, 819504857, 813598752, 805473328, 795717120, 787055194, 783257484, 785793364, 791904509, 797666907, 801238060, 801242709, 799154282, 797278106, 795039237, 792531312, 790568292, 788964927, 788177133, 788334310, 786843300, 782074273, 776659369, 771700561, 767692804, 764004529, 759656370, 756365359, 752174735, 741775513, 731164753, 722306430, 712559104, 700576067, 689233303, 684088826, 687127411, 698024511, 712083757]
1672.5G12083757J5997350J5657783J1382222Q767247O828308Q39770o315887p194161
1688.8G58046389k029777O164551J1520266R477795J224219n890011m478574K811670
1705.1G76846528R544194J1125862R523452Q033991P391631O403804L655553K192974
1721.5H34717989K578497K997935L191352L350257L511191L791034K688468K115190
1737.8H58941913K880692L089965K950489L133535L385544L166497K077997J450360
1754.1H81076992J742661J881301J725435J138807M72486R55402J676918J601696N78701
1772.4H92850399n09858l42310J85252K21252J41263J69337J9669L15249R58860M13061
1792.8H94422174p24495n75304R6977M4226n70535m66645L09110O74069P9512n66542
$$ y = [712083757, 728081107, 743738890, 755121112, 763888359, 770716667, 771556437, 765240550, 758046389, 756016612, 762181163, 773701429, 783179224, 784403443, 778513432, 774034858, 776846528, 786390722, 797516584, 807040036, 815074027, 822465658, 828869462, 832525015, 834717989, 837296486, 840294421, 843485773, 846836030, 850347221, 854138255, 856826723, 858941913, 861822605, 864912570, 867863059, 870996594, 874382138, 877548635, 879626632, 881076992, 882819653, 884700954, 886426389, 887565196, 888037682, 888993084, 890670002, 892271698, 892850399, 892340541, 891998231, 892183483, 892404735, 892545998, 892715335, 892735004, 893050253, 894009113, 894422174, 893697679, 893122375, 893219352, 893263578, 892693043, 892226398, 892535508, 893209577, 893289089, 892722547]
1813.2H92722547l07262J19865J02997K40445P10845P41184L79741j7822n40912n12063
1833.6H93639565k36154j88291J46329P29382M97341n52892p71225m53651l85344l29971
1854H92095089n7638J25587n7161j59919K67029P87914L71456p66635q89659l22759
1874.4H91393304j98007k97963j70291m4823j35123p1526J42276r2923m51505n19872
1894.8H89553547n05567m65452n52416o41048l71456P1942K18153J49012L25084O26027
1915.2H88407826M12405j94430k28405j5200j64270k12550J9848J66655o139j86980
1935.6H87998760O497L48985K56121k93732m67360k59995k54929k93613j19507j0967
1956H86910260j87874l41475k02537J6392p7010l71456l13699m2677r7573k41101n4836
$$ y = [892722547, 892415285, 892535150, 892638147, 892878592, 893589437, 894330621, 894710362, 894692540, 894151628, 893639565, 893403411, 893215120, 893361449, 894090831, 894588172, 894035280, 893264055, 892810404, 892425060, 892095089, 892037451, 892163038, 892105877, 891945958, 892212987, 893000901, 893372357, 892605722, 891716063, 891393304, 891195297, 890897334, 890727043, 890682220, 890547097, 890475571, 890617847, 890524924, 890073419, 889553547, 889047980, 888582528, 888030112, 887389064, 887017608, 887089550, 887307703, 887456715, 887781799, 888407826, 888820231, 888625801, 888397396, 888382196, 888217926, 888005376, 888025224, 888191879, 888185740, 887998760, 888005257, 888354242, 888610363, 888316631, 887849271, 887589276, 887334347, 887040734, 886921227, 886910260, 886722386, 886380911, 886178374, 886194766, 886117756, 885746300, 885432601, 885389924, 885292351, 885051250, 884996414]
1978.5H84996414J29581j9849j48654M8936K56359J34290j95444k53379n6744r4473
1998.8H84797037k23935q3268O1393j10686l04937j95742m3094j26719k99871l22342
2019.2H83147836k99990n30363n56647J48534O30618K61068r6560j4782P2360o3359
2039.6H82698715j81377j18733n5551j16229j03891N2988J02878l0458r1791J6749
2060H82173300Q0943j1563j02520l1293M2796k1636n8413q225j7941r7871j02341j8716
2084.5H81826520J1980n9425j22190j08540q8751j17302j25468o5029j1265l7432q6009
2106.9H81017089o9738k0206N603K3306M6670N8472N8949M0949J3768K1875N4956L4094
2131.4H81285787j5855M828M0829J0192k7597j132M4644K265p6056m3392L2008m113
$$ y = [884996414, 885125995, 885106146, 884957492, 885006428, 885262787, 885397077, 885201633, 884948254, 884891510, 884797037, 884573102, 884489834, 884551227, 884440541, 884135604, 883939862, 883896768, 883770049, 883470178, 883147836, 882847846, 882317483, 881760836, 881909370, 882539988, 882801056, 882704496, 882689714, 882762074, 882698715, 882517338, 882398605, 882343054, 882226825, 882122934, 882175922, 882278800, 882248342, 882156551, 882173300, 882254243, 882242680, 882140160, 882108867, 882151663, 882130027, 882071614, 882063389, 882045448, 881947577, 881845236, 881826520, 881838500, 881779075, 881656885, 881548345, 881459594, 881342292, 881216824, 881151795, 881140530, 881103098, 881017089, 880947351, 880927145, 880932748, 880956054, 881002724, 881061196, 881120145, 881161094, 881174862, 881196737, 881251693, 881285787, 881269932, 881274760, 881315589, 881325781, 881298184, 881297052, 881341696, 881343961, 881267905, 881224513, 881256521, 881252408]
2155.9H81252408p6234l7372K3603m5240j63078j57595k7776L4511r179J1564M7743
2178.3H80853355j2040m4883K9386N6147n3823j44362q2732J3948k9445j02699m6193
2200.8H80436659R54q4341j46568o4731M054q7917j85907j31846p7664j47284j98960
2223.2H79316449j29998q0049j26600j21415k5212K0384l0994m8220J1742J9252n3823
2245.6H78751516o2704L3021P5281j3352r8824o0916j848m7147j01566n9963j8537
2268.1H78394961p3015j27495q7082m6670j03713j62959j21712o1095p7129j01923
2288.5H77432168n5850J19j1027m0769o736L6598N185m5120j0074N2870L7670q35L5346
2315H77429545R7334N7102o438N2154J30177R3460p033o6758r8228j71006k24650j34170
$$ y = [881252408, 881176174, 881138802, 881162405, 881117165, 880954087, 880796492, 880768716, 880803227, 880794048, 880805612, 880853355, 880841315, 880796432, 880825818, 880881965, 880828142, 880683780, 880601048, 880614996, 880585551, 880482852, 880436659, 880437613, 880353272, 880206704, 880141973, 880146027, 880058110, 879872203, 879740357, 879662693, 879515409, 879316449, 879186451, 879106402, 878979802, 878858387, 878833175, 878853559, 878822565, 878774345, 878786087, 878805339, 878751516, 878688812, 878721833, 878797114, 878783762, 878684938, 878624022, 878622174, 878575027, 878473461, 878413498, 878394961, 878321946, 878194451, 878107369, 878060699, 877956986, 877794027, 877672315, 877611220, 877534091, 877432168, 877376318, 877376437, 877365410, 877324641, 877317905, 877354503, 877359688, 877314568, 877304494, 877357364, 877395034, 877394199, 877429545, 877526879, 877583981, 877577543, 877629697, 877759874, 877853334, 877846301, 877779543, 877681315, 877510309, 877285659, 877151489]
2339.5H77151489p450o3420k26795j66715P8500J91688M2320j25289r9242j24335k51234
2361.9H76399517k02298r5427k02418l67522l75032l27349l72171l88980k69413j14620
2382.3H73684287m6849n0187K980J08004Q7142l6240n4300j0192o9857j72496j61469
2404.7H73280823o6638n9366j31071j24931o8307r7096j58965j35124q5890j17302
2425.1H72236133j61887j37686j11044j31488j55091j38342j24932j83105k49565k20656
2445.5H70622337j50383j43826j48594r2208l1710m2439p0572l0696K0146j4066j02580
2467.9H69815409j32263r4294r3103j53243j68324j04367p1764j11282j22607p7248
2488.3H68686914p4744j22607j11758k4796L3319J6570P272L4154J6629n8293p0274
$$ y = [877151489, 877144039, 877080619, 876853824, 876687109, 876765609, 876957297, 876999617, 876874328, 876775086, 876650751, 876399517, 876197219, 876101792, 875899374, 875531852, 875156820, 874829471, 874457300, 874068320, 873798907, 873684287, 873637438, 873587251, 873590231, 873698235, 873785377, 873749137, 873694837, 873684645, 873614788, 873442292, 873280823, 873214185, 873154819, 873023748, 872898817, 872830510, 872733414, 872574449, 872439325, 872353435, 872236133, 872074246, 871936560, 871825516, 871694028, 871538937, 871400595, 871275663, 871092558, 870842993, 870622337, 870471954, 870328128, 870179534, 870087326, 870055616, 870013177, 869942605, 869911909, 869932055, 869917989, 869815409, 869683146, 869588852, 869495749, 869342506, 869174182, 869069815, 868998051, 868886769, 868764162, 868686914, 868612170, 868489563, 868377805, 868353009, 868386328, 868402898, 868410170, 868444324, 868460953, 868402660, 868332386]
2510.8H68332386J8477L4333q2433j29879n1975j1266m3690m9233r716k7179j15157
2533.2H67864668j23381m7922l1054r4474j35660j05023j09136j74344j67966j07646
2553.6H66768062j39058k10285j65760q9109j35899k17974j90079j27316j83344l02791
2574H65006447l05414k14577j96755k41637j74821j7464J3232l8027K1577J16646P0035
2596.4H64039242n3763n7817L4631L3796o9201q7858m0829j21295k61844k38716j28031
2618.9H63048315j68383k56538j77980q5056j52588k19762j65284r6559r3579j15991
2639.3H61516595q1420j5140m0769j13845p5519J4186m649p6473n5015M768l2663r4891
2663.7H60945165p5579o5743j22726j47403p5698k324q6725k52545k78950k21788k57493
$$ y = [868332386, 868350863, 868385196, 868302763, 868172884, 868120909, 868109643, 868065953, 868016720, 868007004, 867979825, 867864668, 867741287, 867693365, 867662311, 867567837, 867432177, 867327154, 867218018, 867043674, 866875708, 866768062, 866629004, 866418719, 866252959, 866163850, 866027951, 865809977, 865619898, 865492582, 865309238, 865006447, 864701033, 864486456, 864289701, 864048064, 863873243, 863855779, 863869011, 863830984, 863852561, 863969207, 864039242, 863985479, 863927662, 863962293, 863996089, 863926888, 863839030, 863798201, 863676906, 863415062, 863176346, 863048315, 862879932, 862623394, 862445414, 862360358, 862207770, 861988008, 861822724, 861726165, 861632586, 861516595, 861435175, 861420035, 861379266, 861265421, 861189902, 861204088, 861199439, 861122966, 861067951, 861072719, 861040056, 860945165, 860869586, 860803843, 860681117, 860533714, 860458016, 860455692, 860368967, 860116422, 859837472, 859615684, 859358191]
2686.2H59358191l28540k85924j80781j63912k01345j78158j61231k49266l36767k93314
2706.6H56978953k38180l44873m64797l94583k77459k90930l57926l62337l60727m88997
2727H53398144n95271m38691k02715j38521k09272k56479j94788r9957L4273K30670
2747.4H51527393K86341J40011K9206O7532R9659J8895p8440r1553r6082k15113l36349
2769.8H51351500k70904j58608k47597l99530l77894k77876k64347k50876j37687j06573
2790.2H48859608k29001k62737j28389j12712l46839n02885m49121l96430m47572n90384
2810.6H45393538o72042o03378n63323n90325n37455m73678n48065o60061o61075o10114
2831H39474022o25014o37650n39363n72443q33988r47714q48532q38279r95875j073777
$$ y = [859358191, 859029651, 858743727, 858562946, 858399034, 858197689, 858019531, 857858300, 857609034, 857272267, 856978953, 856740773, 856395900, 855931103, 855536520, 855259061, 854968131, 854610205, 854247868, 853887141, 853398144, 852802873, 852364182, 852161467, 852022946, 851813674, 851557195, 851362407, 851262450, 851296723, 851527393, 851813734, 851953745, 851982951, 852050483, 852150142, 852169037, 852090597, 851999044, 851902962, 851687849, 851351500, 851080596, 850921988, 850674391, 850274861, 849896967, 849619091, 849354744, 849103868, 848966181, 848859608, 848630607, 848367870, 848239481, 848126769, 847779930, 847277045, 846827924, 846431494, 845983922, 845393538, 844721496, 844118118, 843554795, 842964470, 842427015, 841953337, 841405272, 840745211, 840084136, 839474022, 838849008, 838211358, 837671995, 837099552, 836265564, 835317850, 834469318, 833631039, 832635164, 831561387]
2851.4H31561387r01223o42299m60208m27902n30540o42598p34747p37845m04060J76608
2871.8H26256573L81828P9333j93000l07857m51625n69522o04809o15060o38604o43849
2892.2H22693408o28353p04705q50082q28385o34849m81606m21583m41432n68390q25167
2912.6H16308856j149297j326561j208245q62659m23014j15573n9307j33991k14934
2930.9H10815275o736O44803J285017J406908J079679O48319K48015j53065m64558
2949.3H15503657n57482o78897r27687j083195j180828j264095j349151j502037j651585
2967.6H05308700j636684j320839q85368o47902n31912m61102n62191n84840k09332
2986G98468530M03047R85801J320243J374483J432538J419127J261234J238346J196683
$$ y = [831561387, 830660164, 830017865, 829557657, 829129755, 828599215, 827956617, 827221870, 826484025, 826079965, 826256573, 826638401, 826717734, 826524734, 826216877, 825765252, 825195730, 824590921, 823975861, 823337257, 822693408, 822065055, 821360350, 820510268, 819681883, 819047034, 818565428, 818143845, 817702413, 817134023, 816308856, 815159559, 813832998, 812624753, 811762094, 811339080, 811223507, 811164200, 811030209, 810815275, 810808539, 811453342, 812738359, 814145267, 815224946, 815873265, 816121280, 815968215, 815503657, 814946175, 814267278, 813339591, 812256396, 811075568, 809811473, 808462322, 806960285, 805308700, 803672016, 802351177, 801465809, 800817907, 800285995, 799824893, 799262702, 798677862, 798468530, 798871577, 799857378, 801177621, 802552104, 803984642, 805403769, 806665003, 807903349, 809100032]
3004.4H09100032R82940Q52168P81119M33027k26974p37488p40529m00245J5021L24726
3024.7H10383797N09143P64250R79483R34244O81460M44591M52816M64439J89305j50681
3045.1H15652847k53081p0334J65582K95878L06964J38640o4850j77204l06190m54425
3065.5H15233827o81401j019120j216113j153648r44794q86201j256466j703740j798272
3083.9H04574072j759827j740813j650810j538456j372814j136661q68499o21795m84288
3102.2G93400109k54572K60711P59006R92119J266360J682759J822948J554668J034319
3120.6H02518427M81308J78814J2994l12627p06136r58264j081407j192272j384437
3139G97556400j669287j936198k119064k255678k332211k444327k772390l049612k916456
$$ y = [809100032, 810082972, 810935140, 811716259, 812149286, 811922312, 811184824, 810444295, 810044050, 810059071, 810383797, 810892940, 811657190, 812636673, 813570917, 814252377, 814696968, 815149784, 815614223, 815803528, 815652847, 815399766, 815329432, 815495014, 815790892, 816097856, 816236496, 816171646, 815994442, 815688252, 815233827, 814552426, 813533306, 812317193, 811163545, 810218751, 809332550, 808076084, 806372344, 804574072, 802814245, 801073432, 799422622, 797884166, 796511352, 795374691, 794506192, 793884397, 793400109, 793145537, 793406248, 794165254, 795157373, 796423733, 798106492, 799929440, 801484108, 802518427, 802999735, 803178549, 803191543, 802878916, 802172780, 801214516, 800133109, 798940837, 797556400, 795887113, 793950915, 791831851, 789576173, 787243962, 784799635, 782027245, 778977633, 776061177]
3157.3G76061177k576411k315700k055168j633227j134872o28710L2127Q24154J512169
3175.7G68085539J967073K219677K362907K403438K264798K047956J897633J734912
3192G84983933J482666J259505J127661R62197P29800N79655N43952M46617K60055
3210.3G92376041J52529J28448P2717l3795j42813j76072j45972j50919j32680j0490
3230.7G91936994k6465l59177o22929n79655m89712m71174m78566n99563q22961r18329
3251.1G86568463q32319p93994r39608j078069j076758j063764j079142j023471r77874
3269.5G77703464j209259j562953j749218j802027j758218j747369j805246j822829
3285.8G64246345j852155j976490k333760k952517l685832m517257n353153o058394
$$ y = [776061177, 773484766, 771169066, 769113898, 767480671, 766345799, 765717089, 765749216, 766573370, 768085539, 770052612, 772272289, 774635196, 777038634, 779303432, 781351388, 783249021, 784983933, 786466599, 787726104, 788853765, 789815962, 790545762, 791125417, 791669369, 792115986, 792376041, 792528570, 792657018, 792729735, 792695940, 792553127, 792377055, 792231083, 792080164, 791947484, 791936994, 791910529, 791551352, 790928423, 790348768, 789859056, 789387882, 788909316, 788309753, 787486792, 786568463, 785736144, 784942150, 784002542, 782924473, 781847715, 780783951, 779704809, 778681338, 777703464, 776494205, 774931252, 773182034, 771380007, 769621789, 767874420, 766069174, 764246345, 762394190, 760417700, 758083940, 755131423, 751445591, 746928334, 741575181, 735516787]
3302.1G35516787o721020p396102p827997p564724o438494m640162k307176N55456
3318.4F93176568L708064O616771Q679569R487093R167909Q107841O598771M994869
3334.8G50537455L543437K203285J088858L50416j74821n33998p26878j042486j482188
3353.1G53763080j720131j780569j816392j860798j869499j779080j783430k035678
3369.4G39117503k334654k331555k024472j777291j710951j736761j757443j673281
3385.7G23771095j427412j122355j165033j533985j565218j171052r86278j292408
3402.1G13507354j544833j290023r49919q93057r45508j005650r95040p82430o07073
3420.4G04493821o33717n51641k62618o6698q4042j9968J64986R0241j14619J1980
$$ y = [735516787, 728795767, 721399665, 713571668, 706006944, 699568450, 694928288, 692621112, 693176568, 696884632, 703501403, 712180972, 721668065, 730835974, 738943815, 745542586, 750537455, 754080892, 756284177, 757373035, 757723451, 757548630, 757014632, 756287754, 755245268, 753763080, 752042949, 750262380, 748445988, 746585190, 744715691, 742936611, 741153181, 739117503, 736782849, 734451294, 732426822, 730649531, 728938580, 727201819, 725444376, 723771095, 722343683, 721221328, 720056295, 718522310, 716957092, 715786040, 714799762, 713507354, 711962521, 710672498, 709722579, 708829522, 707884014, 706878364, 705883324, 705100894, 704493821, 703860104, 703308463, 703045845, 702979147, 702895105, 702875137, 703040123, 703130364, 703015745, 703027725]
3440.8G03027725L34025N42342N61536M43279M78626O88910Q36790R55581J060486
3459.2G08929300R37462Q63314J173675J327813R38296N39720O09338R13918J201689
3477.5G17434525J254023R47177Q05497J026929J092612R71496J032413J223742J304687
3495.9G27093101J218676J250029J349985J025498P29859R67085J255095J385749J343012
3514.2G37618089J182437J254975J611233J908183J643956J158536J101613J230597
3530.6G48709619J392365J647591J608074J371145J611054K093256K046108J327872
3546.9G61807084R06766J219391J391888J271784J419962J760125J951575K058268
3563.2G73786843K221107J913309J103163R16600J333058J724243J932323K106727
$$ y = [703027725, 703361750, 703904092, 704465628, 704908907, 705387533, 706076443, 706913233, 707868814, 708929300, 709866762, 710730076, 711903751, 713231564, 714169860, 714709580, 715318918, 716232836, 717434525, 718688548, 719635725, 720441222, 721468151, 722560763, 723532259, 724564672, 725788414, 727093101, 728311777, 729561806, 730911791, 731937289, 732667148, 733634233, 734889328, 736275077, 737618089, 738800526, 740055501, 741666734, 743574917, 745218873, 746377409, 747479022, 748709619, 750101984, 751749575, 753357649, 754728794, 756339848, 758433104, 760479212, 761807084, 762713850, 763933241, 765325129, 766596913, 768016875, 769777000, 771728575, 773786843, 776007950, 777921259, 779024422, 779941022, 781274080, 782998323, 784930646, 787037373]
3579.5G87037373K270221K518833K733111K170086J333416J504719J980543J994193
3595.8H03542495J912892J923620J820505J853526K126038K231717K032935J874447
3612.1H19318175J704693J653910J808107J390457P77900J094103J949429K034426
3628.5H31731200P91490K53141N27561O51300P33077Q88348J185000J804054K409160
3646.8H40974331J771688l66985j091481k74539K58088J19389n8771k0742M61698J189649
3667.2H42962325J266420N30183M12226J47283r89020j105011m81486K71797J172364
3685.6H44187081J804292R59396o64472q21173k37048K25902N67555L92675q8572K02894
3706H46528530R65715J029849j73808j047372n21243K21133M77255L42488L1173k88307
$$ y = [787037373, 789307594, 791826427, 794559538, 796729624, 798063040, 799567759, 801548302, 803542495, 805455387, 807379007, 809199512, 811053038, 813179076, 815410793, 817443728, 819318175, 821022868, 822676778, 824484885, 825875342, 826653242, 827747345, 829696774, 831731200, 832522690, 832775831, 833303392, 833954692, 834687769, 835576117, 836761117, 838565171, 840974331, 842746019, 842379034, 841287553, 841013014, 841271102, 841390491, 841331720, 841310978, 841772676, 842962325, 844228745, 844758928, 845171154, 845318437, 844329417, 843224406, 842742920, 843014717, 844187081, 845991373, 846950769, 846286297, 845465124, 845228076, 845453978, 846021533, 846414208, 846325636, 846528530, 847494245, 848524094, 848350286, 847302914, 846781671, 847002804, 847480059, 847822547, 847853720, 847565413]
3726.4H47565413j77384N67556J351058J055121l30567r63807m10795K34306K04384
3744.7H49095285M1723L46661m2260j052439q96037j94072j15455m38213k50220J40249
3765.1H46635222J67430j15335n63026n79714r895N09441L21329l14594m08768k50101
3785.5H45391989k87295k28941k921L20077N67496N99563N38290N1439n02825m76301
3805.9H45970571o41704o83069l3498O71983P60794N13434K14339o83547r80317m60327
3826.3H44648659p7784K15650M34637O12438O32643R537p07924q49307p43568l68476
3846.7H43806505M11630J180947P71165j001299j233697l89099K80023M37855P9811
3865H44343841k026J00433k52247o00636o26862k12550L33965K62082J8060j86384
$$ y = [847565413, 847388029, 847955585, 849306643, 850361764, 850031197, 849067390, 848656595, 848890901, 849095285, 849137008, 849483669, 849441409, 848388970, 847492933, 847298861, 847183406, 846745193, 846494973, 846635222, 846802652, 846687317, 846124291, 845544577, 845534682, 846044123, 846365452, 846050858, 845642090, 845391989, 845104694, 844875753, 844872832, 845192909, 845760405, 846359968, 846898258, 846949697, 846446872, 845970571, 845328867, 844645798, 844612300, 845284283, 846045077, 846558511, 846772850, 846089303, 845108986, 844648659, 844570875, 844786525, 845221162, 845833600, 846466243, 846475780, 845767856, 844918549, 844174981, 843806505, 844218135, 845399082, 846170247, 845168948, 843935251, 843546152, 843826175, 844264030, 844343841, 844341815, 844442248, 844190001, 843589365, 842962503, 842749953, 843083918, 843346000, 843364060, 843177676]
3885.4H43177676m80652k23279l9041l51727j76429M75525P12395K68698m24624r40144
3905.8H41998398q83579m39048j1921L05534M01675R8169k35736j72794n9307j48773
3926.2H40852618o2346J25766l3021l34204l28540o1155J57118R7513p0870l2007j8537
3948.7H40292335k16186k82884j78039r7752l3974l7611j21474j41025o9320L7789
3969.1H39151859P5877n36o7175o4790m8041k6107m9115j31130j14679n4479o1393
3991.5H38610291n0127m0174p9035
3997.6H38440955
$$ y = [843177676, 842697024, 842473745, 842434704, 842082977, 841906548, 842382073, 843094468, 843363166, 842938542, 841998398, 841114819, 840675771, 840663850, 840969384, 841371059, 841469228, 841233492, 841060698, 841001391, 840852618, 840790272, 840916038, 840883017, 840548813, 840220273, 840159118, 840316236, 840413749, 840342879, 840310872, 840292335, 840076149, 839793265, 839615226, 839517474, 839483500, 839445889, 839324415, 839183390, 839114070, 839151859, 839227736, 839227200, 839160025, 839095235, 839047194, 839021087, 838971972, 838840842, 838726163, 838671684, 838610291, 838560164, 838519990, 838440955]
##END=$$ End of the data block
