##TITLE=AC 21 $$ Begin of the data block
##JCAMP-DX=5.00 $$ ACD/SpecManager v 10.08
##SPECTROMETER/DATA SYSTEM=Alpha
##DATE=25 Nov 2015 09:11:28
##DATA TYPE=INFRARED SPECTRUM
##DATA CLASS=XYDATA
##ORIGIN=
##OWNER=
##NPOINTS=1667
##FIRSTX=599.64648438
##LASTX=3997.64306641
##MAXX=3997.64306641
##MINX=599.64648438
##MAXY=0.72543716
##MINY=0.32377103
##XFACTOR=1.0000000000
##YFACTOR=1.000000000000000e-9
##FIRSTY=0.63071543
##DELTAX=2.03961372
##XUNITS=1/CM
##YUNITS=ARBITRARY UNITS
##XYDATA=(X++(Y..Y))
$$ plain form
599.6 630715430 647309840 657278717 657917440 661271155 676207483 694165587 704724908 708118856
616 708118856 708583295 708496213 707987130 706738293 704749167 701452732 697387040 695584476 696854591
634.3 696854591 697149634 691705942 681666315 677087724 684528828 696237862 702119052 700792849
650.6 700792849 698134542 701921523 711980760 720764339 724705279 725437164 723605633 719534039
667 719534039 718444109 721262097 722705901 722446263 721721411 721036017 720398724 719749928 718968093 718036473
687.3 718036473 717214704 716288149 714943528 713523448 712339044 711174250 709835231 708520949 707450807
705.7 707450807 706357062 704767764 702499330 699489355 695702910 691081226 685755372 679972887
722 679972887 673316658 665293157 657312632 652470231 652110517 655141175 661106825 669012070 675532699
$$ packed form
599.6F30715430J6594410R968877O38723L353715J4936328J7958104J0559321L393948
616G08118856M64439q7082n09083j248837j989126l296435m065692j802564J270115
634.3F96854591K95043n443692j0039627m578591P441104J1709034N881190j326203
650.6G00792849k658307L786981J0059237Q783579L940940P31885j831531m071594
667G19534039j089930K817988J443804k59638p24852o85394o37293o48796p81835r31620
687.3G18036473q21769r26555j344621j420080j184404j164794j339019j314282j070142
705.7G07450807j093745j589298k268434l009975l786445m621684n325854n782485
722F79972887o656229q023501p980525m842401l59714L030658N965650P905245O520629
$$ plain form
740.4 675532699 678875148 680143535 680544078 680197895 678674042 675312519 669312894 660790801 651582718
758.7 651582718 643512368 638014674 638338983 646487117 658755898 669244528 675626397 679300010
775.1 679300010 682116330 684562147 686207533 686268330 683792233 678380430 672457874 671329677 676088691
793.4 676088691 681222022 682529867 680198669 675262809 668593287 661241591 653271794 643757463
809.7 643757463 632119477 618230104 603053868 590123832 582060337 575541139 565037906 549021125
826 549021125 529489100 512009442 505678892 515202284 536720932 563442409 589750528 611583114
842.4 611583114 626674294 634497166 636068165 634121299 632337928 633049488 637021601 645060599
858.7 645060599 656494200 667614043 674747229 677086115 676844358 678122878 683014929 689314723
$$ packed form
740.4F75532699L342449J268387M00543l46183j523853l361523n999625q522093r208083
758.7F51582718q070350n497694L24309Q148134J2268781J0488630O381869L673613
775.1F79300010K816320K445817J645386O0797k476097n411803n922556j128197M759014
793.4F76088691N133331J307845k331198m935860o669522p351696p969797r514331
809.7F43757463j1637986j3889373j5176236j2930036q063495o519198j0503233j6016781
826E49021125j9532025j7479658o330550R523392K1518648K6721477K6308119K1832586
842.4F11583114J5091180P822872J570999j946866j783371P11560L972113Q038998
858.7F45060599J1433601J1119843P133186K338886k41757J278520M892051O299794
$$ plain form
875 689314723 693850815 695873737 696414530 696449399 696336567 695985019 695342541 694582343 693630159 692227840
895.4 692227840 690434813 688440561 686304450 684214532 682399213 680844307 679478288 678194702
911.7 678194702 676687539 674660385 672122300 669505596 667693317 667236209 667518079 667615652 667217553
930.1 667217553 666345894 664932847 662795722 659883797 656336665 652491808 648736000 645282149 643549621
948.4 643549621 645859182 651171863 655771613 658151925 658844352 658373296 657260597 656005144 654598296
966.8 654598296 652884960 650982797 648806036 646154165 643160582 640095592 637070119 633954167
983.1 633954167 630494118 626709104 622993410 619633198 616238892 611949027 606276035 599712312
999.4 599712312 593472779 587869465 581422508 572708011 562063694 550323606 536887228 520655692
$$ packed form
875F89314723M536092K022922N40793L4869j12832l51548o42478p60198r52184j402319
895.4F92227840j793027j994252k136111k089918j815319j554906j366019j283586
911.7F78194702j507163k027154k538085k616704j812279m57108K81870R7573l98099
930.1F67217553q71659j413047k137125k911925l547132l844857l755808l453851j732528
948.4F43549621K309561N312681M599750K380312O92427m71056j112699j255453j406848
966.8F54598296j713336j902163k176761k651871k993583l064990l025473l115952
983.1F33954167l460049l785014l715694l360212l394306m289865n672992o563723
999.4E99712312o239533n603314o446957q714497j0644317j1740088j3436378j6231536
$$ plain form
1015.7 520655692 502721131 486358374 473924249 465427101 460744739 460919946 466091335 474420577
1032 474420577 484497368 497086108 512475312 528279364 542049527 553641975 563967586 573279142
1048.4 573279142 580878496 585873127 588003457 587785661 586378217 584939182 583917677 583058715 581785440
1066.7 581785440 579639375 576387882 571900368 566117823 558990121 550742626 542864859 537745237
1083 537745237 536038101 535656333 533991635 529965222 524267077 518389106 512846112 506195068 496522069
1101.4 496522069 484457135 474249303 470594049 474494487 482290804 487463325 485605031 480057687
1117.7 480057687 479797989 489533246 505203664 521504641 537649214 553136885 564872622 570361674
1134 570361674 569910705 565364063 558398545 550009310 540397346 529011786 514782190 496056676
$$ packed form
1015.7E20655692j7934561j6362757j2434125q497148m682362J75207N171389Q329242
1032D74420577J0076791J2588740J5389204J5804052J3770163J1592448J0325611R311556
1048.4E73279142P599354M994631K130330k17796j407444j439035j021505q58962j273275
1066.7E81785440k146065l251493m487514n782545p127702q247495p877767n119622
1083E37745237j707136l81768j664698m026413n698145n877971n542994o651044r672999
1101.4D96522069j2064934j0207832l655254L900438P796317N172521j858294n547344
1117.7D80057687k59698R735257J5670418J6300977J6144573J5487671J1735737N489052
1134E70361674m50969m546642o965518q389235r611964j1385560j4229596j8725514
$$ plain form
1150.3 496056676 470842421 439503700 408529669 386878222 377777278 378945291 385556996 389700681
1166.7 389700681 384715378 371644318 357491910 348139495 345819622 351610929 366535246 389918178
1183 389918178 417642027 442113787 456044674 458031058 453060657 447933465 446974546 450275928
1199.3 450275928 455202907 459409654 462028086 462937504 462107569 459982365 458105683 458707571 463111281
1217.7 463111281 470710188 479491383 487118870 491882592 493219376 491552025 487495124 481266201
1234 481266201 473035842 463579863 453848809 443323731 429904014 412607253 393720895 376896679
1250.3 376896679 363036752 350038618 337083489 326859593 323771030 330885381 347818553 371958166
1266.6 371958166 401004940 433791369 468250841 499499917 522236943 534598172 538431346
$$ packed form
1150.3D96056676k5214255l1338721l0974031k1651447r100944J168013O611705M143685
1166.7C89700681m985303j3071060j4152408r352415k319873N791307J4924317K3382932
1183C89918178K7723849K4471760J3930887J986384m970401n127192r58919L301382
1199.3D50275928M926979M206747K618432R09418q29935k125204j876682O01888M403710
1217.7D63111281P598907Q781195P627487M763722J336784j667351m056901o228923
1234D81266201q230359r455979r731054j0525078j3419717j7296761j8886358j6824216
1250.3C76896679j3859927j2998134j2955129j0223896l088563P114351J6933172K4139613
1266.6C71958166K9046774L2786429L4459472L1249076K2737026J2361229L833174
$$ plain form
1280.9 538431346 537183821 535033107 536595464 544341445 555522978 564129114 565755785 559722781
1297.2 559722781 548356771 534784198 521206260 510201991 503514171 498305827 492201418 488629401
1313.5 488629401 490954727 498679429 510233402 523022592 533861041 540681601 543047309 542544961
1329.8 542544961 542649686 547134578 556468368 567477226 577357411 584208608 586744308 585744858
1346.2 585744858 583521426 581886232 580632746 578833759 576018095 571169317 563562453 554882944
1362.5 554882944 546835661 537881613 528196752 520917475 518933654 524580538 534154713 540852129
1378.8 540852129 542407095 539174855 532648623 525991678 521474540 516807139 510821402 506839037
1395.1 506839037 507272363 511350811 516101241 518608272 520541251 522518456 522641063 521316528 519033015
$$ packed form
1280.9E38431346j247525k150714J562357P745981J1181533Q606136J626671o033004
1297.2E59722781j1366010j3572573j3577938j1004269o687820n208344o104409l572017
1313.5D88629401K325326P724702J1553973J2789190J0838449O820560K365708n02348
1329.8E42544961J04725M484892R333790J1008858R880185O851197K535700r99450
1346.2E85744858k223432j635194j253486j798987k815664m848778p606864q679509
1362.5E54882944q047283q954048r684861p279277j983821N646884R574175O697416
1378.8E40852129J554966l232240o526232o656945m517138m667401n985737l982365
1395.1E06839037M33326M078448M750430K507031J932979J977205J22607j324535k283513
$$ plain form
1413.5 519033015 514513254 508795619 506060481 504474998 502006710 503054023 509537637 520232737
1429.8 520232737 530089438 532674074 529267073 525183439 520238280 513377070 507389188 504168570
1446.1 504168570 502894044 500096560 492738277 481645018 471738935 470972598 473456144 473137021
1462.4 473137021 475337595 483646929 491565496 497320503 508437634 527257323 547147810 564533412
1478.7 564533412 578572690 589257538 594446003 593839407 592228770 593917549 593452573 585924625
1495.1 585924625 574110985 561847866 546243966 522947192 483014584 423017949 382039040
1509.3 382039040 371484846 384585947 420362383 468846560 509154916 539234221 561023533
1523.6 561023533 573619545 582875550 588078320 588319361 588760555 588521242 581534624 572471559 572350919
$$ packed form
1413.5E19033015m519761n717635k735138j585483k468288J047313O483614J0695100
1429.8E20232737R856701K584636l407001m083634m945159o861210n987882l220618
1446.1E04168570j274526k797484p358283j1093259r906083p66337K483546l19123
1462.4D73137021K200574Q309334P918567N755007J1117131J8819689J9890487J7385602
1478.7E64533412J4039278J0684848N188465o06596j610637J688779m64976p527948
1495.1E85924625j1813640j2263119j5603900k3296774l9932608n9996635m0978909
1509.3C82039040j0554194J3101101L5776436M8484177M0308356L0079305K1789312
1523.6E61023533J2596012R256005N202770K41041M41194k39313o986618r063065j20640
$$ plain form
1542 572350919 575814307 576784313 573119819 565711319 556762934 545192838 529525638 512452424
1558.3 512452424 504882991 499080241 486038566 469137609 453226775 440781265 428092062 411259353
1574.6 411259353 401038021 411179036 432578325 451869041 458307326 450735778 433618337 409593731
1590.9 409593731 381120265 354238570 335820943 327164859 327066630 336845338 356867641 383209556
1607.2 383209556 410273254 432831556 448244542 461259246 478152007 491138637 498664796
1621.5 498664796 508957028 521312118 532192051 541478574 545045137 542281687 540926218 544634461
1637.8 544634461 545128703 539674878 528945267 516047180 507270396 499183565 487332165 481677979
1654.1 481677979 482276082 479378134 474229187 471105725 471295655 469777763 466471404 465466052 463536471
$$ packed form
1542E72350919L463388R70006l664494p408500q948385j1570096j5667200j7073214
1558.3E12452424p569433n802750j3041675j6900957j5910834j2445510j2689203j6832709
1574.6D11259353j0221332J0141015K1399289J9290716O438285p571548j7117441k4024606
1590.9D09593731k8473466k6881695j8417627q656084r8229R778708K0022303K6341915
1607.2C83209556K7063698K2558302J5412986J3014704J6892761J2986630P526159
1621.5D98664796J0292232J2355090J0879933R286523L566563k763450j355469L708243
1637.8E44634461M94242n453825j0729611j2898087q776784q086831j1851400n654186
1654.1D81677979N98103k897948n148947l123462J89930j517892l306359j005352j929581
$$ plain form
1672.5 463536471 457837760 450774372 442559540 432509094 425586611 432333171 445035934 452902079
1688.8 452902079 457766801 457347453 452371567 448046833 450860679 466376394 482782930 496222973
1705.1 496222973 510117412 519185305 521781087 519557834 515561223 516985953 524341762 528744459
1721.5 528744459 529876828 530282259 529430568 526786268 522749484 520965099 523050904 525897503 536962569
1739.8 536962569 559244037 582803309 601879299 617088079 634210169 654232323 669412553
1754.1 669412553 679473341 687630951 693219125 698388875 703209877 704332650 702375770 699835718
1770.4 699835718 700890124 706321955 710300386 711094975 711149096 711953700 713102937 713811636 711820185
1788.8 711820185 707731962 707278371 710273206 711328506 710300505 710226655 712140203 713612854 713095784
$$ packed form
1672.5D63536471n698711p063388q214832j0050446o922483O746560J2702763P866145
1688.8D52902079M864722m19348m975886m324734K813846J5515715J6406536J3440043
1705.1D96222973J3894439R067893K595782k223253l996611J424730P355809M402697
1721.5E28744459J132369M05431q51691k644300m036784j784385K085805K846599J1065066
1739.8E36962569K2281468K3559272J9075990J5208780J7122090K0022154J5180230
1754.1F69412553J0060788Q157610N588174N169750M821002J122773j956880k540052
1770.4F99835718J054406N431831L978431P94589N4121Q04604J149237P08699j991451
1788.8G11820185m088223m53591K994835J055300j028001p3850J913548J472651n17070
$$ plain form
1807.1 713095784 711512685 711117089 712261796 712943017 712868571 712772906 711760163 709528387 707843900
1825.5 707843900 706623137 706264794 708833456 711360633 711673915 711360574 710269332 706992209 704106748
1843.8 704106748 705219388 707707047 709085047 709340811 708861768 708068013 707220018 706718445 706343114
1862.2 706343114 704711378 701079071 698590934 700466752 703234553 703768432 703084052 702469766 702073693
1880.5 702073693 701715946 701240957 700075150 698589504 698428571 698714793 698337018 698215008 698194504
1898.9 698194504 697687209 697053313 696500599 695866585 695725262 696588933 697248280 696317673 695004046
1917.3 695004046 695040405 695331573 695838988 697194934 698057294 698056102 697779238 697504044 697315156 696849287
1937.7 696849287 695433021 693799794 693835437 695015728 695781410 695989251 695823789 695462346 695223808
$$ packed form
1807.1G13095784j583099l95596J144707O81221p4446r5665j012743k231776j684487
1825.5G07843900j220763l58343K568662K527177L13282l13341j091242l277123k885461
1843.8G04106748J112640K487659J378000K55764m79043p93755q47995n01573l75331
1862.2G06343114j631736l632307k488137J875818K767801N33879o84380o14286l96073
1880.5G02073693l57747m74989j165807j485646j60933K86222l77775j22010k0504
1898.9F98194504n07295o33896n52714o34014j41323Q63671O59347r30607j313627
1917.3F95004046L6359K91168N07415J355946Q62360j192k76864k75194j88888m65869
1937.7F96849287j416266j633227L5643J180291P65682K07841j65462l61443k38538
$$ plain form
1956 695223808 695087492 694806516 694303513 693338394 692265987 692119420 692552626 692544043 692162633 691765547
1976.4 691765547 691430628 691191971 691019952 690687060 689965844 688870668 687736571 687390924 687794328
1994.8 687794328 687923849 687648296 687280655 686774194 686089158 685274422 684437096 683594108 682513535
2013.1 682513535 681134462 680093527 679773033 679593146 679225862 678883433 678720057 678721368 678801179 678968966
2033.5 678968966 679219604 679396093 679468155 679715335 680192411 680623293 680895746 681088328 681279719 681452930
2053.9 681452930 681538761 681490123 681318462 681006968 680727661 680804312 681102276 681312621 681354463 681243479
2074.3 681243479 681096017 680982590 680845976 680634320 680341959 679938495 679488480 679183125 679020107 678846717
2094.7 678846717 678618252 678398967 678259969 678127050 677882791 677573085 677348554 677314937 677449524 677699685
$$ packed form
1956F95223808j36316k80976n03003r65119j072407j46567M33206q583l81410l97086
1976.4F91765547l34919k38657j72019l32892p21216j095176j134097l45647M03404
1994.8F87794328J29521k75553l67641n06461o85036q14736q37326q42988j080573
2013.1F82513535j379073j040935l20494j79887l67284l42429j63376J311P9811J67787
2033.5F78968966K50638J76489P2062K47180M77076M30882K72453J92582J91391J73211
2053.9F81452930Q5831m8638j71661l11494k79307P6651K97964K10345M1842j10984
2074.3F81243479j47462j13427j36614k11656k92361m03464m50015l05355j63018j73390
2094.7F78846717k28465k19285j38998j32919k44259l09706k24531l3617J34587K50161
$$ plain form
2115.1 677699685 678027928 678345203 678588510 678788245 678987324 679158449 679237843 679183781 679066479 678981960
2135.5 678981960 678927481 678879976 678849578 678825498 678742290 678593636 678441167 678333998 678260088 678171337 678066552
2157.9 678066552 677955806 677851737 677750111 677641094 677551985 677446187 677302599 677207410 677153945 677051902
2178.3 677051902 676889122 676709235 676566482 676505864 676504254 676447570 676260293 676063836 675977111 675888896 675727725
2200.8 675727725 675587595 675516009 675409675 675203204 674989581 674796224 674591899 674364209 674129963 673941135
2221.2 673941135 673743486 673492610 673322022 673296392 673303545 673310518 673316836 673301578 673303246 673259616 673089206
2243.6 673089206 672865510 672672749 672487855 672257721 671972752 671631634 671243846 670802891 670249820 669622302
2264 669622302 669041395 668554902 668128908 667762935 667585373 667678714 667993188 668410242 668705046 668741524
$$ packed form
2115.1F77699685L28243L17275K43307J99735J99079J71125P9394n4062j17302q4519
2135.5F78981960n4479m7505l0398k4080q3208j48654j52469j07169p3910q8751j04785
2157.9F78066552j10746j04069j01626j09017q9109j05798j43588r5189n3465j02043
2178.3F77051902j62780j79887j42753o0618j610n6684j87277j96457q6725q8215j61171
2200.8F75727725j40130p1586j06334k06471k13623j93357k04325k27690k34246j88828
2221.2F73941135j97649k50876j70588k5630P153O973O318j5258J668m3630j70410
2243.6F73089206k23696j92761j84894k30134k84969l41118l87788m40955n53071o27518
2264F69622302n80907m86493m25994l65973j77562R3341L14474M17054K94804L6478
$$ plain form
2284.4 668741524 668615401 668396473 668000698 667424619 666849136 666345835 665724695 664888501 663971782 663039863
2304.8 663039863 661984622 660748482 659516752 658479691 657451570 656122565 654574513 653177679
2321.1 653177679 652228892 651558995 650687814 649662018 649026453 648920834 648793519 648311675 647729576
2339.5 647729576 647360802 647813499 649586618 650725961 649311781 646179318 643064857 640826106 639611840
2357.8 639611840 639301836 639673233 640626490 642123580 644083202 646364093 648680985 650917590 653230906
2376.2 653230906 655698597 658153355 660230100 661658049 662412286 662693799 662772715 662784815 662708819
2394.5 662708819 662554443 662395954 662277043 662145138 661880791 661523402 661146283 660740674 660350323 659986019
2414.9 659986019 659626245 659324467 659074962 658766448 658398926 658054411 657694817 657306850 656999052 656783283
$$ packed form
2284.4F68741524j26123k18928l95775n76079n75483n03301o21140q36194r16719r31919
2304.8F63039863j055241j236140j231730j037061j028121j329005j548052j396834
2321.1F53177679r48787o69897q71181j025796o35565j05619j27315m81844n82099
2339.5F47729576l68774M52697J773119J139343j414180l132463l114461k238751j214266
2357.8F39611840l10004L71397R53257J497090J959622K280891K316892K236605K313316
2376.2F53230906K467691K454758K076745J427949P54237K81513P8916J2100p5996
2394.5F62708819j54376j58489j18911j31905k64347l57389l77119m05609l90351l64304
2414.9F59986019l59774l01778k49505l08514l67522l44515l59594l87967l07798k15769
$$ plain form
2435.3 656783283 656609893 656491101 656425416 656380117 656375229 656363726 656254530 656120777 656003296 655869663
2455.7 655869663 655746341 655650675 655578494 655514061 655439377 655347109 655222178 655037940 654801607 654574215
2476.1 654574215 654383779 654187083 653971791 653792799 653633595 653384387 653073907 652805090 652594686 652478337
2496.5 652478337 652410090 652299225 652138472 651904106 651615798 651312351 650966287 650594950 650225580 649871230
2516.9 649871230 649632037 649587274 649713337 649899840 649997532 650023580 650060952 650071800 650027275 649907947 649655700
2539.3 649655700 649297774 648928702 648576856 648190677 647697091 647140145 646640122 646182418 645715952 645225823
2559.7 645225823 644664168 644035637 643418908 642898083 642471671 642085075 641764760 641555727 641443253 641391456
2580.1 641391456 641367793 641396940 641507030 641631067 641726077 641805649 641886413 641958952 641909301 641711473 641504467
$$ packed form
2435.3F56783283j73390j18792o5685m5299m888j1503j09196j33753j17481j33633
2455.7F55869663j23322r5666p2181o4433p4684r2268j24931j84238k36333k27392
2476.1F54574215j90436j96696k15292j78992j59204k49208l10480k68817k10404j16349
2496.5F52478337o8247j10865j60753k34366k88308l03447l46064l71337l69370l54350
2516.9F49871230k39193m4763J26063J86503R7692K6048L7372J0848m4525j19328k52247
2539.3F49655700l57926l69072l51846l86179m93586n56946n00023m57704m66466m90129
2559.7F45225823n61655o28531o16729n20825m26412l86596l20315k09033j12474n1797
2580.1F41391456k3663K9147J10090J24037R5010P9572Q0764P2539m9651j97828k07006
$$ plain form
2602.6 641504467 641356528 641205132 640991092 640758216 640494823 640137434 639744759 639382184 639034629 638703346
2623 638703346 638419807 638152182 637866199 637580693 637225151 636767209 636329830 636018276 635828316 635701299
2643.4 635701299 635579586 635383308 635135949 634948790 634777129 634499192 634173036 633909822 633652151 633346140
2663.7 633346140 632995367 632584035 632087529 631510854 630882978 630164504 629370153 628641665 628104746 627705753
2684.1 627705753 627232671 626633525 626148641 625923336 625840485 625787675 625693977 625486612 625232458 625110567
2704.5 625110567 625039816 624765396 624342740 623892725 623366296 622764647 622062087 621298492 620611131 619958043
2724.9 619958043 619357586 618909419 618475378 617845058 616995871 616248429 615873992 615672350 615468383 615278304
2745.3 615278304 615191162 615440249 616008162 616566002 616944611 617316127 617841840 618438601 618975580 619426012
$$ packed form
2602.6F41504467j47939j51396k14040k32876k63393l57389l92675l62575l47555l31283
2623F38703346k83539k67625k85983k85506l55542m57942m37379l11554j89960j27017
2643.4F35701299j21713j96278k47359j87159j71661k77937l26156k63214k57671l06011
2663.7F33346140l50773m11332m96506n76675o27876p18474p94351p28488n36919l98993
2684.1F27705753m73082n99146m84884k25305q2851n2810r3698k07365k54154j21891
2704.5F25110567p0751k74420m22656m50015n26429o01649p02560p63595o87361o53088
2724.9F19958043o00457m48167m34041o30320q49187p47442l74437k01642k03967j90079
2745.3F15278304q7142K49087N67913N57840L78609L71516N25713N96761N36979M50432
$$ plain form
2765.7 619426012 619827092 620128095 620212018 620183349 620379746 620754659 620901048 620763838 620439947 619724572
2786.1 619724572 618586361 617430210 616358638 615078807 613520324 612062871 611092091 610446513 609857798
2804.5 609857798 609257877 608594656 608079493 607825279 607431412 606608272 605328918 603550911 601341188
2822.8 601341188 598796129 595843494 592336357 588122070 582945347 576873124 571044087 567651391
2839.1 567651391 568272710 572258651 577629089 582947373 587757111 591822684 594894111 596935928
2855.5 596935928 598009229 598449826 598648429 598468482 597734869 596751332 595694542 594568491 593877017
2873.8 593877017 593922019 594023287 593563139 592591047 591233432 589526653 587479711 585126758 582473278
2892.2 582473278 579539537 576700032 574339449 572285056 570318162 568717599 567799747 567366123 566990733
$$ packed form
2765.7F19426012M01080L01003Q3923k8669J96397L74913J46389j37210l23891p15375
2786.1F19724572j138211j156151j071572j279831j558483j457453r70780o45578n88715
2804.5F09857798n99921o63221n15163k54214l93867q23140j279354j778007k209723
2822.8F01341188k545059k952635l507137m214287n176723o072223n829037l392696
2839.1E67651391O21319L985941N370438N318284M809738M065573L071427K041817
2855.5E96935928J073301M40597J98603j79947p33613r83537j056790j126051o91474
2873.8E93877017M5002J01268m60148r72092j357615j706779k046942k352953k653480
2892.2E82473278k933741k839505k360583k054393j966894j600563r17852m33624l75390
$$ plain form
2910.5 566990733 566652656 566650450 567052007 567565501 567747891 567079961 565261781 562275827 558507264
2928.9 558507264 554867625 551879287 549586654 548261523 548146188 548982263 550271869 551663399 552811086
2947.2 552811086 553191841 552411497 550727367 548576891 545966685 542934418 539840341 537059367 534691870
2965.6 534691870 532603920 530693829 528967202 527548492 526549280 525755763 525145888 525311470 526469052
2984 526469052 528158307 530018508 531701148 532926142 533724427 533965528 533911407 534360409 535514951
3002.3 535514951 537279129 539592683 541945815 544055402 546246707 548763096 551470578 554128945
3018.6 554128945 556554556 558371127 559591472 560605884 561097026 560898423 560621679 560855508 561587512
3037 561587512 562114537 562168896 562259614 562668085 563118577 563271821 563161790 562842190 562229395 561359167
$$ packed form
2910.5E66990733l38077k206M01557N13494J82390o67930j818180k985954l768563
2928.9E58507264l639639k988338k292633j325131j15335Q36075J289606J391530J147687
2947.2E52811086L80755p80344j684130k150476k610206l032267l094077k780974k367497
2965.6E34691870k087950j910091j726627j418710r99212p93517o09875J65582J157582
2984E26469052J689255J860201J682640J224994P98285K41101n4121M49002J154542
3002.3E35514951J764178K313554K353132K109587K191305K516389K707482K658367
3018.6E54128945K425611J816571J220345J014412M91142j98603k76744K33829P32004
3037E61587512N27025N4359R0718M08471M50492J53244j10031l19600o12795q70228
$$ plain form
3057.4 561359167 560154498 558508456 556713045 555116713 553821385 552772999 551658571 550088644
3073.7 550088644 548007786 545913041 544476807 543728292 543091178 542209327 541094720 539847076 538613975
3092.1 538613975 537459791 536329031 535153091 534218848 533957362 534005702 533731580 533346236 533297062
3110.4 533297062 533208668 532626569 532031775 531926751 532313764 533015370 533517480 533357263 532596231 531629682
3130.8 531629682 530665398 529345214 527281463 524869561 522693574 520557642 518093586 515303254
3147.1 515303254 512038410 508393645 505202353 502733231 500168860 497082889 493817270 490667939
3163.4 490667939 487742603 485125840 482889622 480996430 479400843 478247195 477675617 477683872 478220344
3181.8 478220344 479264081 480785787 482655436 484763533 486996770 489187747 491356760 493641406
$$ packed form
3057.4E61359167j204669j646042j795411j596332j295328j048386j114428j569927
3073.7E50088644k080858k094745j436234p48515o37114q81851j114607j247644j233101
3092.1E38613975j154184j130760j175940r34243k61486M8340k74122l85344m9174
3110.4E33297062q8394n82099n94794j05024L87013P01606N02110j60217p61032r66549
3130.8E31629682r64284j320184k063751k411902k175987k135932k464056k790332
3147.1E15303254l264844l644765l191292k469122k564371l085971l265619l149331
3163.4D90667939k925336k616763k236218j893192j595587j153648n71578Q255N36472
3181.8D78220344J043737J521706J869649K108097K233237K190977K169013K284646
$$ plain form
3198.1 493641406 496003717 498350382 500635207 502755940 504760563 506732762 508521378 509997845
3214.4 509997845 511102378 511971831 512828171 513449371 513733923 514023185 514333487 514337480 514166236 514466703
3234.8 514466703 515286744 515970886 516239107 516295791 516224086 516045749 515987515 515933216 515528977 514908254
3255.2 514908254 514375091 513826668 512976527 511764586 510274112 508500993 506457329 504568815 503136337
3273.6 503136337 501916647 500733376 499481618 498030722 496326149 494288832 491756499 488621593
3289.9 488621593 485206187 482025564 479326516 477195054 475491881 474015415 473089963 473429739 475440800
3308.2 475440800 478685200 482241929 485638887 489054412 492835134 497262895 502428949 508181930
3324.6 508181930 514356673 520370543 525269985 528759003 531047583 532386482 533449113 534629703
$$ packed form
3198.1D93641406K362311K346665K284825K120733K004623J972199J788616J476467
3214.4E09997845J104533Q69453Q56340O21200K84552K89262L10302L993j71244L00467
3234.8E14466703Q20041O84142K68221N6684p1705j78337n8234n4299m04239o20723
3255.2E14908254n33163n48423q50141j211941j490474j773119k043664j888514j432478
3273.6E03136337j219690j183271j251758j450896j704573k037317k532333l134906
3289.9D88621593l415406l180623k699048k131462j703173j476466r25452L39776K011061
3308.2D75440800L244400L556729L396958L415525L780722M427761N166054N752981
3324.6E08181930O174743O013870M899442L489018K288580J338899J062631J180590
$$ plain form
3340.9 534629703 535648704 536437929 536882460 536785543 536815643 537526906 538303554 538619757 538738191 539012551
3361.3 539012551 539214790 538943172 538651526 539187849 540719986 542486191 543679416 544501185 545475841
3379.6 545475841 546633124 547924995 549329162 550391436 550680041 551159203 552918017 555117130 556560576
3398 556560576 557450354 559059203 561775625 564289451 565950930 567476571 569330513 571537077 573748529
3416.3 573748529 575488329 577312589 579737723 582047284 583687961 584975600 586482823 588195980
3432.7 588195980 589681268 591250300 593413830 595820844 597814739 599264324 600918293 603165507
3449 603165507 605308414 606985450 608316302 609222949 609767139 610671699 612203181 613517225 614459395
3467.3 614459395 615885377 617915332 619710207 620835781 621244311 621381164 622393847 623916924 624740243
$$ packed form
3340.9E34629703J019001P89225M44531r6917L0100P11263P76648L16203J18434K74360
3361.3E39012551K02239k71618k91646N36323J532137J766205J193225Q21769R74656
3379.6E45475841J157283J291871J404167J062274K88605M79162J758814K199113J443446
3398E56560576Q89778J608849K716422K513826J661479J525641J853942K206564K211452
3416.3E73748529J739800J824260K425134K309561J640677J287639J507223J713157
3432.7E88195980J485288J569032K163530K407014J993895J449585J653969K247214
3449F03165507K142907J677036J330852R06647N44190R04560J531482J314044R42170
3467.3F14459395J425982K029955J794875J125574M08530J36853J012683J523077Q23319
$$ plain form
3485.7 624740243 625474632 626796246 627884746 628301620 628646851 629082322 628988028 628828883 630015135
3504 630015135 631812632 632939756 634024024 635303080 636374056 637331605 637888432 637445867 636461079
3522.4 636461079 636346340 637432218 639164925 641046405 642119586 642263114 642647803 643472493 643213749
3540.8 643213749 641260028 639707208 640774548 642894685 643855572 644604087 645747900 646163225 645577550
3559.1 645577550 644229710 641541123 638353884 638924539 643481314 646846950 647869349 647966862 647883177
3577.5 647883177 647766352 647041917 644497335 641065538 641308784 644906461 646185875 645517588 645716131
3595.8 645716131 646348417 647114277 648454785 648308456 645886004 644194603 644169331 643912196 643488348
3614.2 643488348 642661572 642707527 646074414 649140239 647749722 642986238 641466022 646540225 650810540
$$ packed form
3485.7F24740243P34389J321614J088500M16874L45231M35471r4294j59145J186252
3504F30015135J797497J127124J084268J279056J070976R57549N56827m42565r84788
3522.4F36461079j14739J085878J732707J881480J073181J43528L84689Q24690k58744
3540.8F43213749j953721j552820J067340K120137R60887P48515J143813M15325n85675
3559.1F45577550j347840k688587l187239N70655M556775L365636J022399R7513q3685
3577.5F47883177j16825p24435k544582l431797K43246L597677J279414o68287J98543
3595.8F45716131O32286P65860J340508j46329k422452j691401k5272k57135m23848
3614.2F43488348q26776M5955L366887L065825j390517m763484j520216N074203M270315
$$ plain form
3632.5 650810540 652709067 654081047 654949009 654977381 653050542 647730231 640638590 638964713 645749271
3650.9 645749271 651736140 654114544 656572700 659214258 660529315 660643697 658420146 653471470
3667.2 653471470 649668694 649083316 647476375 647991240 654105365 659455180 661933541 661437988 657571733
3685.6 657571733 652763486 652610183 657485247 661536634 662793756 662068605 660637021 660622537 661551416
3703.9 661551416 660070300 655807912 652539611 654917955 659612417 661097229 659660757 657323301
3720.2 657323301 655547917 655165434 656168282 656077564 652465105 646685660 644000649 647457361 651233792
3738.6 651233792 650253952 647019327 646641791 646839201 644835353 646342874 652115762 655045390 654853284
3756.9 654853284 655644596 657844603 658113062 656748712 655854046 656578839 659268737 661283016 660488307
$$ packed form
3632.5F50810540J898527J371980Q67962K8372j926839n320311p091641j673877O784558
3650.9F45749271N986869K378404K458156K641558J315057J14382k223551m948676
3667.2F53471470l802776n85378j606941N14865O114125N349815K478361m95553l866255
3685.6F57571733m808247j53303M875064M051387J257122p25151j431584j4484R28879
3703.9F61551416j481116m262388l268301K378344M694462J484812j436472k337456
3720.2F57323301j775384l82483J002848r0718l612459n779445k685011L456712L776431
3738.6F51233792r79840l234625l77536J97410k003848J507521N772888K929628j92106
3756.9F54853284P91312K200007K68459j364350q94666P24793K689898K014279p94709
$$ plain form
3775.3 660488307 658078492 657142997 658225358 659127593 659960866 660914361 661066592 660099447 657708168
3793.7 657708168 654514492 651346326 648844481 649461627 651666760 653292179 656371057 658508182
3810 658508182 656741560 652712584 649705708 647558153 646681666 650200903 653680027 654431820 654244542
3828.3 654244542 653261244 651390791 648463786 645647287 645877361 648806751 652154505 654904842 655136704
3846.7 655136704 651182830 644459188 642309189 648914337 653640032 653733253 651539624 649423659 649058044
3865 649058044 648230195 647104144 648503125 651257515 653644860 653604448 651320577 650226951 650446594
3883.4 650446594 651735902 653314829 653052509 653343081 655015349 654309392 650756836 647396386 646700919
3901.8 646700919 649330676 653841376 657155573 658307552 657752156 655737877 653732121 653608739 654538751
$$ packed form
3775.3F60488307k409815r35495J082361R02235Q33273R53495J52231r67145k391279
3793.7F57708168l193676l168166k501845O17146K205133J625419L078878K137125
3810F58508182j766622m028976l006876k147555q76487L519237L479124P51793j87278
3828.3F54244542r83298j870453k927005k816499K30074K929390L347754K750337K31862
3846.7F55136704l953874o723642k149999O605148M725695R3221k193629k115965l65615
3865F49058044q27849j126051J398981K754390K387345m0412k283871j093626K19643
3883.4F50446594J289308J578927k62320K90572J672268p05957l552556l360450o95467
3901.8F46700919K629757M510700L314197J151979n55396k014279k005756j23382R30012
$$ plain form
3920.1 654538751 654727578 654695511 655143321 654928744 654093266 654456913 656011462 656972229 656651139 655579686
3940.5 655579686 655016840 655161917 654904187 654803157 655583024 656302929 656522691 656535685 656382680 656281531
3960.9 656281531 656596720 656999528 657004535 656710148 656380773 656194806 656281531 656481981 656575918 656548977
3981.3 656548977 656423807 656258166 656112015 656045437 656010628 655930042 655909598 655926347
3997.6 655926347
$$ packed form
3920.1F54538751J88827l2067M47810k14577q35478L63647J554549R60767l21090j071453
3940.5F55579686n62846J45077k57730j01030P79867P19905K19762J2994j53005j01149
3960.9F56281531L15189M02808N007k94387l29375j85967Q6725K00450R3937k6941
3981.3F56548977j25170j65641j46151o6578l4809q0586k0444J6749
3997.6F55926347
##END=$$ End of the data block
