##TITLE=AC 11 $$ Begin of the data block
##JCAMP-DX=5.00 $$ ACD/SpecManager v 10.08
##SPECTROMETER/DATA SYSTEM=Alpha
##DATE=25 Nov 2015 09:11:28
##DATA TYPE=INFRARED SPECTRUM
##DATA CLASS=XYDATA
##ORIGIN=
##OWNER=
##NPOINTS=1765
##FIRSTX=399.76428223
##LASTX=3997.64306641
##MAXX=3997.64306641
##MINX=399.76428223
##MAXY=0.88920504
##MINY=0.56249917
##XFACTOR=1.0000000000
##YFACTOR=1.000000000000000e-9
##FIRSTY=0.84719718
##DELTAX=2.03961372
##XUNITS=1/CM
##YUNITS=ARBITRARY UNITS
##XYDATA=(X++(Y..Y))
399.8 847197175 841611981 838398874 836597204 834452033 832029164 829664707 827379525 826877773 827034533
418.1 827034533 822087348 815283120 811581075 810232699 809630811 808937967 807833076 805809617 802407682
436.5 802407682 798628271 795495689 792370796 788949847 785600126 782504261 780481875 779584587 779417574
454.8 779417574 779520929 778209329 775807440 773625851 771545470 769045234 765958428 762899876 760352015
473.2 760352015 759395659 760992110 764906287 770684063 777346492 782953978 786497891 788585603 789848387
491.5 789848387 790318608 790043235 789622843 789763391 789924085 789217830 788310528 787547588 786590576 785982311
511.9 785982311 786307037 787086248 787146270 786254525 785373032 785070837 784863710 784234345 783524156 783179581
532.3 783179581 783327281 783603132 783764660 784182310 785074294 786047935 786859632 787739158 788603306 789372563
552.7 789372563 790412605 791720450 792966366 794363618 796093345 797846794 799491405 801022291
569.1 801022291 802288711 803459704 804825604 806101024 806920946 807485759 808142424 808666289 808939457
587.4 808939457 809626162 810732961 811452568 812078714 813386679 814967692 816226363 817448974 818815172
605.8 818815172 820023179 821150243 822421551 823626876 824533284 825470984 826734662 828063130 829373240
624.1 829373240 830695629 831839263 832832158 833894014 834881663 835642695 836503327 837591350 838628232
642.5 838628232 839541674 840454638 841301978 842021406 842762113 843508959 844064891 844514608 844980776 845264375
662.9 845264375 845066845 844298005 843957722 844533741 844883859 844729841 844044328 842861593 841409206
681.2 841409206 839519441 836918354 833835781 830548227 827079237 823920429 821985662 821662486 822793424
699.6 822793424 825385273 829321921 834079802 839351773 844905734 849801838 853106916 855054915
715.9 855054915 856391549 857474685 858477890 859588623 860770524 861703753 862399101 863187075 864027262
734.3 864027262 864772916 865539193 866341949 866996169 867518663 868102729 868768573 869403839 869999945 870611489
754.7 870611489 871223450 871802688 872381091 872947097 873464406 873963535 874408185 874743462 875037253 875378847
775.1 875378847 875727952 876104355 876630008 877234459 877755284 878177881 878534198 878842115 879199147 879572630
795.4 879572630 879811347 879968762 880184412 880416393 880557418 880618155 880640268 880639791 880623698 880675375 880856693
817.9 880856693 881051600 881216109 881463170 881805062 882151842 882490218 882860422 883281648 883763671 884330153
838.3 884330153 884979904 885565162 885944605 886218905 886531889 886881351 887211442 887544870 887904704 888175428
858.7 888175428 888289034 888365149 888461232 888466656 888375044 888264060 888111055 887956560 887923181 888018787 888146996
881.1 888146996 888263226 888419569 888612628 888710082 888670981 888606668 888504744 888277531 888050616 887943506
901.5 887943506 887801170 887537181 887330532 887186110 886917889 886630118 886502624 886360288 886039972 885722876
921.9 885722876 885512292 885253072 884943843 884729326 884504259 884104490 883694708 883424997 883075893 882556081
942.3 882556081 882119894 881774843 881304681 880815923 880467534 880050302 879429638 878821194 878303468 877697945
962.7 877697945 877028227 876479387 875981271 875392318 874797821 874228120 873512268 872661352 871882558 871164024
983.1 871164024 870372474 869607091 868964911 868281901 867487848 866701007 865896106 864969373 863966286 862912297
1003.5 862912297 861642003 859905601 857610464 855180860 853742123 854146898 855576456 856436491 856281281
1021.8 856281281 855639338 854813099 853753924 852552712 851392388 850335538 849396288 848544717 847703218
1040.2 847703218 846900702 846235037 845662236 845104456 844691932 844557881 844603539 844684124 844809473 845038116
1060.6 845038116 845362782 845800281 846221030 846344113 846207261 846062660 845788836 845019519 843765855
1079 843765855 842168450 839961529 837005019 833815992 831020832 828988135 828077018 828314424 829031408
1097.3 829031408 829543531 829738379 829656303 829296887 829080224 829653561 831086099 832957447 835031033
1115.7 835031033 837127447 838885725 840238810 841477990 842618406 843561769 844658315 846085966
1132 846085966 847398281 848324895 849053681 849616170 849836051 849826992 849813521 849702954 849423528 849125624
1152.4 849125624 848803401 848332644 847800374 847304583 846711457 845984876 845274150 844578147 843800664 842966080
1172.8 842966080 842048645 840968609 839912653 839150548 838661194 838333786 838195920 838172019 838039994
1191.1 838039994 837782979 837607086 837650180 838026404 838935852 840382814 842161357 844173193 846342921
1209.5 846342921 848339558 849880159 851069272 852006614 852628708 853073180 853525817 853860795 853991330
1227.9 853991330 854078233 854124546 853954256 853612304 853259683 852829099 852257848 851740003 851420343 851231217
1248.2 851231217 851245224 851568520 851994455 852361083 852770746 853109241 853184283 853227317 853406668 853548408
1268.6 853548408 853532851 853473365 853510916 853676021 854011416 854534686 855128407 855782390 856521547 857030094
1289 857030094 857125998 857123017 857279420 857398152 857305169 857121289 856833875 856346905 855777383 855306804 854890049
1311.5 854890049 854413152 854085684 853961408 853519380 852821350 852387190 852089942 851739526 851454139 851291239
1331.9 851291239 851408958 852272272 853524446 853451848 851845562 850469947 849721432 848864138 847723663
1350.2 847723663 846567631 845270276 843562424 842102349 841181993 839042604 834850848 830823183
1366.6 830823183 827630281 824978769 822969913 819989502 815317869 810306430 805207849 800386250
1382.9 800386250 797120392 794620991 790854275 787096024 784777224 782844007 780578673 778377712
1399.2 778377712 776864529 776543319 775870800 773725986 771359384 769298613 767920077 768414259 770529330
1417.5 770529330 771537602 771402180 772126257 773046732 773887098 774422705 774168372 775138617 779244423
1435.9 779244423 785340548 792415738 801932216 813176870 824477851 834261000 841003478 846368194
1452.2 846368194 852623701 859667599 861269236 858210862 857284963 858272076 858210087 858396113 861192584
1470.6 861192584 864296556 863100588 859447181 856603324 854959786 853636086 852953494 853505075 853326321
1488.9 853326321 850548744 848985732 851257980 854209483 853384972 851060033 851090908 854592800 855427086
1507.3 855427086 849153817 844151855 842945814 844761074 847158730 849314213 851521194 852255762
1523.6 852255762 852782905 853427827 854445755 857152522 859283209 859924197 863255858 868415952 866760015
1542 866760015 860868275 855747283 853016973 851941943 851391315 852125764 855243206 857890964 850971043
1560.3 850971043 843725979 840596378 839529276 839080691 836866915 834490538 834173739 832264483 827129006
1578.7 827129006 822427392 818484128 814621210 810592175 806208909 801349819 796015859 789581716
1595 789581716 781573534 772342861 761552811 748248696 732372165 713528693 690410495 664658904
1611.3 664658904 640938580 619067132 598039806 585356772 581872284 585523844 594924092 608363092
1627.6 608363092 623256207 636888981 651441991 668441355 680534959 688769996 698445559 710491180
1643.9 710491180 725727379 739087105 747402012 759407640 774358392 782027960 790734231 803593040
1660.3 803593040 817739964 828684449 837023854 846279323 853801787 857394040 860165179 862099469
1676.6 862099469 863792539 867448270 872726321 874429643 871463358 869458973 868727088 869789004
1692.9 869789004 873662829 877813458 879478931 878210008 876428545 875571430 873970270 872337341
1709.2 872337341 872570515 875151992 879276276 880909085 877733052 875074804 874601901 875024378 876378655
1727.6 876378655 879104614 882624567 884777904 883372545 882340670 882999241 883612394 884210885 885619223
1745.9 885619223 887663424 888293505 886322439 884641111 884639740 885099590 885543704 885348380 884467065
1764.3 884467065 884798169 886606038 888810098 889205039 886780620 884606183 884191811 884346843 883926332
1782.6 883926332 883267760 882913232 883808732 885852277 886353791 884834230 883955419 884246349 884262741
1801 884262741 883085191 881935477 881953776 882673264 882679284 881766319 881228626 881226301 881223738 881719649 882979155
1823.4 882979155 883971691 884609699 884867728 883505046 881901681 881475985 881486177 881686211 882897794
1841.8 882897794 884261549 883615494 881856501 880577803 879977822 879721940 879606366 879641116 879620373
1860.2 879620373 879521966 880069852 881729126 882811069 881419897 879400313 878454566 878154635 878019154
1878.5 878019154 877955019 877892494 877879798 878253341 878784239 878498673 877866924 877603889 877168655 876603663
1898.9 876603663 876372695 876342118 876385927 876645863 876809597 876394331 875924885 876254022 876917183 876913548
1919.3 876913548 876660645 876263440 875350058 874614775 874369979 874243855 874056876 873885214 873883724 874314785
1939.7 874314785 874940932 874792814 873914242 873142004 872744322 872586966 872441590 872231603 872046888 871868014
1960.1 871868014 871676445 871771455 872022033 871717393 871040225 870662808 870476961 870237589 870055437 869932055
1980.5 869932055 869722128 869551301 869643867 869898140 870041192 869749308 869115174 868606329 868325055 868164003
2000.9 868164003 868002653 867784321 867618144 867503762 867316782 867198646 867337286 867301404 866664469 865813673
2021.3 865813673 865019560 864356935 864337742 864869595 865210176 865180612 865052521 864995241 864960551 864813805
2041.7 864813805 864571750 864340603 864117622 863954127 863901973 863842368 863742352 863693297 863673627 863658428
2062.1 863658428 863667548 863553882 863285482 863057852 862946630 862847269 862679124 862521946 862431765 862326264
2082.5 862326264 862176478 862078965 862018943 861870646 861684561 861572027 861482799 861393988 861370504 861368179 861314833
2104.9 861314833 861268461 861269772 861247480 861200213 861197293 861202538 861161828 861148596 861176252 861130536 861048996 861053109
2129.4 861053109 861087024 861069798 861066520 861101091 861087024 861021638 860998392 861005783 860963821 860920250 860948861 860985398
2153.9 860985398 860952556 860922754 860943377 860931873 860882342 860829234 860716462 860598028 860607207 860672295 860650957
2176.3 860650957 860581338 860559404 860545576 860474825 860393345 860332310 860254705 860178649 860146880 860096633 859973311
2198.7 859973311 859863997 859818876 859751761 859642327 859559000 859489918 859395564 859327972 859319508 859315276 859289944
2221.2 859289944 859273255 859250307 859169602 859073937 859023333 858970344 858879566 858800113 858742118 858647168 858529449
2243.6 858529449 858441889 858358502 858239233 858123422 858043373 857945025 857816815 857712150 857622623 857501805
2264 857501805 857378125 857295156 857216656 857100308 856967807 856860042 856780946 856712222 856623292 856474876 856266677
2286.4 856266677 856053352 855863512 855652034 855394423 855125606 854849875 854539514 854181111 853760898 853303015
2306.8 853303015 852827728 852295220 851727307 851189673 850604117 849877238 849148631 848603249 848245442 847959697
2327.2 847959697 847656608 847347617 847092807 846885562 846675098 846470952 846352041 846541524 847317874 848290563
2347.6 848290563 848596931 847887754 846560717 845322907 844484806 844078958 844105959 844520748 845200896
2366 845200896 845993757 846823573 847693980 848529398 849254906 849920213 850541592 851010740 851270437 851383626
2386.4 851383626 851402164 851323426 851191103 851073146 850955784 850812614 850684702 850581646 850440979 850263596
2406.8 850263596 850115597 850004733 849885583 849741042 849593818 849440277 849265099 849088728 848936617 848808646
2427.2 848808646 848695636 848592401 848468006 848302960 848143280 848022401 847914636 847779930 847598672 847400546
2447.6 847400546 847236514 847103953 846966267 846825182 846682131 846527576 846363962 846202075 846060991 845923007
2467.9 845923007 845769584 845620990 845472991 845302761 845130384 844979882 844835281 844677269 844519675 844387114
2488.3 844387114 844244301 844054699 843865097 843712211 843565583 843415380 843279302 843129754 842947602 842783928
2508.7 842783928 842660487 842530966 842379987 842236936 842097282 841923773 841751277 841618121 841464221 841265500
2529.1 841265500 841067374 840873778 840676963 840510011 840369463 840202928 839994907 839783013 839581430 839375257
2549.5 839375257 839170277 838970184 838769972 838576376 838396192 838213205 838019669 837831557 837652385 837481916
2569.9 837481916 837312698 837135732 836944699 836741626 836546600 836360395 836185396 836024940 835842252 835633934
2590.3 835633934 835438907 835245192 835020065 834771872 834527969 834306359 834095001 833874106 833655179 833443463
2610.7 833443463 833222866 832991183 832756042 832507789 832241774 831990719 831770062 831522286 831219077 830922127
2631.1 830922127 830639660 830326080 829993665 829643011 829245985 828836560 828445196 828029275 827568889 827112436
2651.5 827112436 826697230 826275647 825827658 825420141 825038254 824637592 824270010 823973536 823730409 823518872
2671.9 823518872 823327303 823154688 822990119 822802424 822549760 822260320 822010517 821780920 821511567 821206808
2692.3 821206808 820903003 820629060 820376039 820114374 819851935 819613695 819400251 819190204 818965733 818768322
2712.7 818768322 818642259 818552494 818496168 818520248 818606436 818717837 818806410 818845153 818901718 819011867 819155455
2735.1 819155455 819282472 819321930 819314361 819370031 819504321 819620728 819628477 819552004 819474697 819411993 819328368
2757.6 819328368 819218457 819100082 818986595 818891883 818792105 818659186 818547904 818472028 818305075 818022966
2778 818022966 817778647 817600489 817402482 817216933 817089558 816906750 816581488 816238105 815996289 815746188
2798.4 815746188 815372646 814980507 814640760 814315140 814029932 813726008 813324571 812919497 812566996 812235594
2818.8 812235594 811907530 811574757 811238110 810873091 810478210 810110271 809769571 809402883 809002399 808504283
2839.1 808504283 807812095 807011783 806253970 805525482 804726899 803940713 803385913 803090811 802928090 802767098
2859.5 802767098 802511513 802163482 801752150 801301897 800916493 800636828 800252557 799633145 798982978 798453987
2879.9 798453987 797969639 797455668 796876490 796219110 795557141 794998050 794525802 793986917 793331981 792676866
2900.3 792676866 792056918 791427672 790826440 790330350 789925992 789455593 788713038 787649989 786432981
2918.7 786432981 785302818 784421563 783787012 783406973 783206701 782859027 782337308 781948388 781729341
2937 781729341 781576872 781564295 781651020 781524777 781007648 780327499 779737294 779071689 778207600 777387381
2957.4 777387381 776742101 776174843 775529265 774761558 773969650 773214817 772552073 771939516 771247208 770563602
2977.8 770563602 769953370 769219398 768340707 767523468 766813934 766152978 765403807 764407098 763301075
2996.2 763301075 762154400 760892868 759698391 758632302 757620513 756852567 756402314 755891383 755010843
3014.5 755010843 753882051 752681017 751461685 750335038 749287546 748193502 747201502 746400535 745553076
3032.9 745553076 744430780 743139446 742075801 741255522 740289807 739045978 737728715 736524582 735346079
3051.3 735346079 734094322 732794583 731337607 729740441 728260100 726948202 725601137 723932743
3067.6 723932743 721845567 719615579 717582524 715845942 714121819 711977065 709417820 706719279
3083.9 706719279 703907549 701006711 698081136 694978237 691688299 688437402 685293794 681956649
3100.2 681956649 678155899 674197197 670498013 666949928 663345873 660112560 657725751 655943394
3116.5 655943394 654463291 653264880 652377427 651981592 652180552 652768135 653415024 653944492 654457092
3134.9 654457092 655052006 655436397 655183077 654342234 653216004 651888371 650423110 648777127 646611989
3153.2 646611989 643861532 640883744 637859941 634738624 631508112 628274083 625215232 622470856
3169.6 622470856 620179296 618508041 617571890 617393970 618004918 619481206 621810138 624850929 628462195
3187.9 628462195 632509589 636865437 641458392 646215916 651054323 655955017 660987139 666200101
3204.2 666200101 671576440 677015960 682327449 687299788 691704154 695331156 698070586 699849486
3220.5 699849486 700703681 700769782 700057030 698572516 696489692 693922937 690820992 687245429 683412671
3238.9 683412671 679452300 675411820 671277404 666992068 662601590 658239007 653937340 649613619
3255.2 649613619 645231605 640896201 636714756 632694125 628896594 625441015 622324109 619436324
3271.5 619436324 616791546 614520133 612756789 611710191 611535251 612184107 613513291 615461886 617940247
3289.9 617940247 620588541 623038411 625216722 627121687 628818274 630506158 632132828 633331060
3306.2 633331060 633847237 633781731 633444250 633032858 632534981 631931186 631226063 630460203 629584551 628265798
3326.6 628265798 626453996 624553740 622759521 621045232 619319737 617268503 614787221 612111807
3342.9 612111807 609318137 606563509 604025066 601289392 598020673 594585836 591405928 588483989
3359.2 588483989 585587561 582767069 580377281 578289151 575955272 573265731 570743203 568820715
3375.5 568820715 567310929 565948427 564702570 563624859 562827349 562499166 562698722 562938511 562812269
3393.9 562812269 562874496 563847125 565499008 567060769 568502009 570546269 573373258 576580644 579907179
3412.3 579907179 583190799 586508989 590148926 593950927 597523272 601006091 604729116 608599126
3428.6 608599126 612247109 615650892 618991077 622014463 624505460 626847565 629437149 632242799
3444.9 632242799 634869576 636954248 638850868 640953243 643159449 645456672 647848606 650052905
3461.2 650052905 652065158 654270828 656545222 658302844 659557343 660915375 662640512 664684057
3477.5 664684057 666812837 668511868 669863045 671456039 673153400 674637377 676220834 678109884
3493.8 678109884 680076361 681935132 683957696 686164379 687791944 688896418 690369904 692193151
3510.2 692193151 693947673 695585787 697202682 699069142 701446652 704183877 706545532 708225429
3526.5 708225429 709586859 710880637 712511063 714720130 716874897 718591988 720763445 723857045
3542.8 723857045 726872921 728641272 729724526 731299758 733036697 734467804 736224771 738647401
3559.1 738647401 741442800 744647622 748303890 750919402 751374364 751566410 752882898 755036592 757392645
3577.5 757392645 759837210 762648642 766209185 770321846 773172736 774146020 775530040 778000653
3593.8 778000653 780496120 782701671 784778178 786588013 788722575 791795909 795092225 797698021
3610.1 797698021 800016582 802231014 804291368 806260109 807115853 807172418 808471024 811710417 814984798
3628.5 814984798 815400064 814701736 814716458 815180063 815986693 817209601 819027722 822227538 827059984
3646.8 827059984 830449164 828704953 825744867 824695766 824484169 823944926 823474288 823468387 824488580
3665.2 824488580 826896906 829472363 830576539 831398189 831617415 829214811 826366127 824821174 824881673
3683.5 824881673 826769888 829894423 831194162 828965247 826417804 825334966 825418532 826141059 826512039
3701.9 826512039 826081395 826342463 828270972 830499947 830175698 827818155 826322913 826366007 827213883
3720.2 827213883 827913105 827851534 827036738 826556385 827878892 831096947 833501577 832354784 829932630
3738.6 829932630 829052508 829773784 830717921 831156015 831828773 831423044 828747869 826534569 825869322
3756.9 825869322 825306714 823978424 823120415 823298573 823653162 823306382 821919262 820521176 820371211
3775.3 820371211 821328521 821866155 821194649 820448399 819858193 819083035 818564713 818610430 819419324 820874691
3795.7 820874691 822274625 823355854 823452652 822242975 820916176 819388926 817965925 817922831 819388986
3814.1 819388986 821179628 822423279 822917879 821504354 819424629 818363547 817992628 818219185 819192111
3832.4 819192111 820694745 822178006 822398961 820891678 818756878 816905916 816104352 817105889 819809377
3850.8 819809377 821716845 819697142 816907048 815771639 816223323 817247510 817473948 817411661 817727625
3869.1 817727625 817342222 815956533 814525127 814095497 814898968 815600336 815515816 814862490 813852787
3887.5 813852787 813525498 813487589 812761068 812496781 813627303 815292835 816029847 815088272 812789261
3905.8 812789261 810609102 809540987 809466720 810061991 810929775 811239958 810887754 810673356 810595393 810210168
3926.2 810210168 810040534 810358584 810242891 809358895 808560729 808452964 808909476 809250593 809131265 809031069
3946.6 809031069 808947921 808437347 807789564 807404816 807230115 807180166 807163537 807004333 806786120 806682467
3967 806682467 806636512 806597054 806553304 806418300 806162655 805900037 805764735 805720568 805629611 805536151 805509329
3989.5 805509329 805414140 805176020 804903626 804707468
3997.6 804707468
##END=$$ End of the data block
