##TITLE=$$ Begin of the data block
##JCAMP-DX=5.00 $$ ACD/SpecManager v 10.08
##SPECTROMETER/DATA SYSTEM=Varian
##DATE=30 Apr 2013 09:33:36
##DATA TYPE=INFRARED SPECTRUM
##DATA CLASS=XYDATA
##ORIGIN=
##OWNER=
##NPOINTS=3735
##FIRSTX=399.26403809
##LASTX=4000.35498047
##MAXX=4000.35498047
##MINX=399.26403809
##MAXY=67.19396973
##MINY=12.76303864
##XFACTOR=1.0000000000
##YFACTOR=0.000000100000000
##FIRSTY=37.41890717
##DELTAX=0.96440572
##XUNITS=1/CM
##YUNITS=TRANSMITTANCE
##XYDATA=(X++(Y..Y))
$$ plain form
399.3 374189072 486570396 551812325 573114586 573225975 572673759 577019501 581368484 581962318
407 581962318 580987778 582242203 585906143 589003944 589462318 587972717 586165123 584523735 582715454
415.7 582715454 581037483 580456276 581249809 582357292 582393761 580999336 578969994 577316170 576475449
424.3 576475449 576244164 576032677 575085335 572794151 569120178 564680557 560235519 556059494 551909218
433 551909218 547623672 543671303 541103439 541027336 544031944 549810219 557079964 563968468 568862610
441.7 568862610 571239815 571783142 571644211 571510620 571253052 570280113 568118935 564768295 560713234
450.4 560713234 556663589 553089638 549813538 546063576 541076584 534705620 527380524 519522285
458.1 519522285 511259346 502983971 496164818 493271217 496482925 506151428 520313568 535601311
$$ packed form
399.3C74189072J12381324O5241929K1302261J11389n52216M345742M348983N93834
407E81962318r74540J254425L663940L097801M58374j489601j807594j641388j808281
415.7E82715454j677971n81207P93533J107483L6469j394425k029342j653824q40721
424.3E76475449k31285k11487r47342k291184l673973m439621m445038m176025m150276
433E51909218m285546l952369k567864p6103L004608N778275P269745O888504M894142
441.7E68862610K377205N43327j38931j33591k57568r72939k161178l350640m055061
450.4E60713234m049645l573951l276100l749962m986992o370964p325096p858239
458.1E19522285q262939q275375o819153k893601L211708R668503J4162140J5287743
$$ plain form
465.8 535601311 548792496 558008995 563106194 565304298 566303978 567272186 568276482 568591385 567631683
474.5 567631683 565670547 563691368 562577133 562453117 562715683 562543488 561358910 559013748 555839119
483.2 555839119 552621880 550317307 549428673 549461632 549049835 546837387 542458611 536795883 531334419
491.8 531334419 527203484 524643707 523137093 521898155 520328217 518262901 516017494 514230614
499.6 514230614 513506126 513997383 515206032 516164360 515912628 513971100 510541763 506343689 502171898
508.2 502171898 498403282 494719276 490244141 484052429 475735359 465634537 454574165 443298492
516 443298492 432072830 420833893 409855652 400401993 394658127 394674911 400909081 411488228
523.7 411488228 422937737 431968803 437053795 438752441 438858719 439305801 441616325 446874046 455702095
$$ packed form
465.8E35601311J3191185R216499N097199K198104R99680R68208J004296L14903r59702
474.5E67631683j961136j979179j114235j24016K62566j72195j184578k345162l174629
483.2E55839119l217239k304573q88634L2959m11797k212448m378776n662728n461464
491.8E31334419m130935k559777j506614j238938j569938k065316k245407j786880
499.6E14230614p24488M91257J208649R58328k51732j941528l429337m198074m171791
508.2E02171898l768616l684006m475135o191712q317070j0100822j1060372j1275673
516D43298492j1225662j1238937j0978241r453659n743866J6784O234170J0579147
523.7D11488228J1449509R031066N084992J698646J06278M47082K310524N257721Q828049
$$ plain form
532.4 455702095 468001823 482733421 498122444 512278366 523835373 532265816 537806587 541159897
540.1 541159897 543129654 544306870 544894600 544735374 543507690 540988426 537267227 532823372 528393059
548.7 528393059 524635086 521758232 519385262 516798744 513408356 509088631 504166412 499143028
556.5 499143028 494394455 490010796 485784111 481312447 476209221 470339394 463927040 457419968
564.2 457419968 451197586 445352859 439701996 433970604 427989082 421782188 415552826 409595566
571.9 409595566 404179306 399443817 395373840 391867485 388842621 386307678 384377747 383272705
579.6 383272705 383303795 384821243 388105049 393249092 400107994 408330307 417462616 427097206 437012711
588.3 437012711 447205200 457726135 468400345 478679810 487843742 495442314 501601944 506884956
$$ packed form
532.4D55702095J2299728J4731598J5389023J4155922J1557007Q430443N540771L353310
540.1E41159897J969757J177216N87730j59226j227684k519264l721199m443855m430313
548.7E28393059l757973k876854k372970k586518l390388m319725m922219n023384
556.5D99143028m748573m383659m226685m471664n103226n869827o412354o507072
564.2D57419968o222382n844727n650863n731392n981522o206894o229362n957260
571.9D09595566n416260m735489m069977l506355l024864k534943j929931j105042
579.6C83272705L1090J517448L283806N144043O858902Q222313R132309R634590R915505
588.3D37012711J0192489J0520935J0674210J0279465R163932P598572O159630N283012
$$ plain form
596 506884956 511807060 516435738 520382767 523098106 524110680 523040085 519584885 513801537 506639214
604.7 506639214 500211868 497247047 499757576 507766304 519095078 530495834 539315033 544473038
612.4 544473038 546206627 545129585 541593857 535755615 527945480 518825989 509349098 500826302
620.1 500826302 495005150 493585739 497028618 503572044 509748688 512530823 511511726 509172363
627.8 509172363 508894310 512437210 518989067 526298370 532530327 537184334 540673180 543439026 545566254
636.5 545566254 546995621 547803307 548158722 548095245 547444153 546023903 543843498 541038895 537555084
645.2 537555084 532913208 526456871 518112946 509151039 502175369 500023651 504139061 513569756
652.9 513569756 525396729 536316452 544243965 548896217 551215324 552347794 553001785 553438225
$$ packed form
596E06884956M922104M628678L947029K715339J012574j070595l455200n783348p162323
604.7E06639214o427346k964821K510529Q008728J1328774J1400756Q819199N158005
612.4E44473038J733589j077042l535728n838242p810135r119491r476891q522796
620.1E00826302n821152j419411L442879O543426O176644K782135j019097k339363
627.8E09172363k78053L542900O551857P309303O231957M654007L488846K765846K127228
636.5E45566254J429367Q07686L55415o3477o51092j420250k180405k804603l483811
645.2E37555084m641876o456337q343925q961907o975670k151718M115410R430695
652.9E13569756J1826973J0919723P927513M652252K319107J132470O53991M36440
$$ plain form
660.6 553438225 553750610 553973579 553953094 553283234 551577644 548919830 546021500 543811569 542739830
669.3 542739830 542404442 541827393 540098915 536849670 532325058 527270851 522838554 520386505 520954437
678 520954437 524593353 530122871 535693741 539813461 542046852 542899628 543135376 543170624 542954750
686.7 542954750 542238922 540889244 539011154 536872978 534736824 532714920 530725441 528552399 525941772
695.3 525941772 522676277 518627319 513794136 508278618 502167664 495451660 488196945 480961533
703.1 480961533 475051308 472167854 473521080 479087410 487650375 497540283 507353134 516097412
710.8 516097412 522946281 527177773 528511887 527432785 525006180 522249489 519604836 516928596
718.5 516928596 513861580 510141754 505646667 500348854 494433784 488515854 483630219 480795326
$$ packed form
660.6E53438225L12385K22969k0485o69860j705590k657814k898330k209931j071739
669.3E42739830l35388n77049j728478l249245m524612n054207m432297k452049N67932
678E20954437L638916N529518N570870M119720K233391Q52776K35748L5248k15874
686.7E42954750p15828j349678j878090k138176k136154k021904j989479k173042k610627
695.3E25941772l265495m048958m833183n515518o110954o716004p254715p235412
703.1D80961533n910225k883454J353226N566330Q562965R889908R812851Q744278
710.8E16097412O848869M231492J334114j079102k426605k756691k644653k676240
718.5E16928596l067016l719826m495087n297813n915070n917930m885635k834893
$$ plain form
726.2 480795326 480363007 481665764 483298988 483874092 482676735 479751930 475441093 469836311 462601166
734.9 462601166 453211975 441363678 427344666 412381248 398885536 390245132 389782104 399107094
742.6 399107094 416865082 438939857 460243835 476996956 488013916 494342690 497854309 499970627
750.3 499970627 501267357 501804733 501572456 500650215 499143105 497150230 494843903 492519684 490476036
759 490476036 488797684 487253380 485440331 483082848 480243874 477281075 474585457 472310486 470285759
767.7 470285759 468153343 465596886 462491570 458906021 455009384 450982094 446962242 443000336
775.4 443000336 439011879 434784775 430090981 424842758 419154739 413239746 407240601 401164398
783.1 401164398 394953461 388563843 381945686 375006409 367690964 360122414 352564087 345143890
$$ packed form
726.2D80795326m32319J302757J633224N75104j197357k924805m310837n604782p235145
734.9D62601166r389191j1848297j4019012j4963418j3495712q640404m63028R324990
742.6C99107094J7757988K2074775K1303978J6753121J1016960O328774L511619K116318
750.3D99970627J296730N37376k32277r22241j507110j992875k306327k324219k043648
759D90476036j678352j544304j813049k357483k838974k962799k695618k274971k024727
767.7D70285759k132416k556457l105316l585549l896637m027290m019852l961906
775.4D43000336l988457m227104m693794n248223n688019n914993n999145o076203
783.1D01164398o210937o389618o618157o939277p315445p568550p558327p420197
$$ plain form
790.8 345143890 337694931 330160141 323437881 319810162 322109756 331823006 347492104 364844246
798.5 364844246 378789139 385919113 385807266 380473442 372798882 365178986 359088326 355319061
806.2 355319061 354294319 356148758 360682526 367401009 375689125 385011406 395018883 405511627
814 405511627 416278610 426908531 436721687 444919243 450869293 454303360 455265350 453901176 450312424
822.6 450312424 444570808 436763496 426931381 414980316 400761833 384326324 366090393 346761398
830.4 346761398 327239990 308814774 293462563 283555202 280629845 284035645 290943584 298278065
838.1 298278065 305213032 313973522 327991524 348879280 374774513 401312904 424172020 441067467
845.8 441067467 451996346 458129921 460518188 459454689 454745178 446704063 437296944 430441513
$$ packed form
790.8C45143890p448959p534790o722260l627719K299594R713250J5669098J7352142
798.5C64844246J3944893P129974j11847n333824p674560p619896o090660l769265
806.2C55319061j024742J854439M533768O718483Q288116R322281J0007477J0492744
814D05511627J0766983J0629921R813156Q197556N950050L434067R61990j364174l588752
822.6D50312424n741616p807312r832115j1951065j4218483j6435509j8235931j9328995
830.4C46761398j9521408j8425216j5352211r907361k925357L405800O907939P334481
838.1B98278065O934967Q760490J4018002K0887756K5895233K6538391K2859116J6895447
845.8D41067467J0928879O133575K388267j063499m709511q041115r407119o855431
$$ plain form
853.5 430441513 430708580 440854607 459899178 483396606 505867386 523569260 535640297 543239517
861.2 543239517 547933121 550754318 552259789 552922592 553230667 553503876 553785973 553957253 553902321
869.9 553902321 553569870 552960052 552141533 551274376 550553436 550078201 549778709 549483337 549062042 548508377
879.5 548508377 547900925 547311783 546755486 546206474 545634537 545015221 544321747 543532295 542665520 541800575
889.2 541800575 541037025 540407372 539819336 539101410 538128204 536926041 535662994 534536400 533652725
897.9 533652725 532988510 532436485 531876640 531214066 530382309 529346771 528130531 526835098 525610542
906.5 525610542 524570236 523721008 522976799 522247124 521501122 520737457 519916229 518957329 517806854
915.2 517806854 516449699 514810066 512690277 509947014 506840286 504172096 502915916 503530579 505554390
$$ packed form
853.5D30441513K67067J0146027J9044571K3497428K2470780J7701874J2071037P599220
861.2E43239517M693604K821197J505471O62803L08075K73209K82097J71280n4932
869.9E53902321l32451o09818q18519q67157p20940m75235k99492k95372m21295n53665
879.5E48508377o07452n89142n56297n49012n71937o19316o93474p89452q66775q64945
889.2E41800575p63550o29653n88036p17926r73206j202163j263047j126594q83675
897.9E33652725o64215n52025n59845o62574q31757j035538j216240j295433j224556
906.5E25610542j040306q49228p44209p29675p46002p63665q21228r58900j150475
915.2E17806854j357155j639633k119789k743263l106728k668190j256180O14663K023811
$$ plain form
923.9 505554390 507885437 509520569 510113182 509937096 509433708 508832741 508118057 507209892 506091881
932.6 506091881 504793625 503339119 501758118 500127945 498556557 497104568 495727386 494302750
940.3 494302750 492715721 490916748 488899727 486627350 483992958 480879898 477298012 473498230
948 473498230 469973335 467336464 466149635 466783066 469323769 473521805 478779144 484231300 488960876
956.7 488960876 492289429 494008751 494397507 493994064 493264732 492396545 491334610 489969711 488268623
965.4 488268623 486249428 483915329 481302948 478624573 476305275 474785347 474217720 474329643 474573021
974.1 474573021 474429779 473643799 472266541 470550728 468780289 467112656 465515976 463840599 461966400
982.7 461966400 459886284 457667122 455365067 453000259 450575867 448066216 445391045 442468605
$$ packed form
923.9E05554390K331047J635132N92613j76086n03388o00967p14684r08165j118011
932.6E06091881j298256j454506j581001j630173j571388j451989j377182j424636
940.3D94302750j587029j798973k017021k272377k634392l113060l581886l799782
948D73498230l524895k636871j186829O33431K540703M198036N257339N452156M729576
956.7D88960876L328553J719322L88756m03443p29332q68187j061935j364899j701088
965.4D88268623k019195k334099k612381k678375k319298j519928n67627J11923K43378
974.1D74573021j43242p85980j377258j715813j770439j667633j596680j675377j874199
982.7D61966400k080116k219162k302055k364808k424392k509651k675171k922440
$$ plain form
990.5 442468605 439327965 436100769 432822113 429257584 425028419 419955139 414210930 408089867
998.2 408089867 401684418 394848862 387322464 378583221 367515907 352690086 333748169 313045788
1005.9 313045788 295838127 288263130 294394035 314501572 345412865 381996346 418408356 448935966
1013.6 448935966 469153366 477433929 475642929 467968292 458483200 449292641 440502357 431472321
1021.3 431472321 421882744 411840858 401473160 390755577 379704247 368546944 357700424
1028.1 357700424 347779083 339796829 335303154 336082458 343417664 357356148 376439934 398038559
1035.8 398038559 419127350 437206993 451003036 460626945 467119370 471685104 475114594 477673950
1043.5 477673950 479329185 479985390 479581146 478114204 475691719 472565613 469065208 465452271 461821976
$$ packed form
990.5D42468605l140640l227196l278656l564529m229165n073280n744209o121063
998.2D08089867o405449o835556p526398q739243j1067314j4825821j8941917k0702381
1005.9C13045788j7207661p574997O130905K0107537L0911293L6583481L6412010L0527610
1013.6D48935966K0217400Q280563j791000p674637r485092r190559q790284r030036
1021.3D31472321r589577j0041886j0367698j0717583j1051330j1157303j0846520
1028.1C57700424r921341p982254m493675P79304P335206J3938484J9083786K1598625
1035.8C98038559K1088791J8079643J3796043R623909O492425M565734L429490K559356
1043.5D77673950J655235O56205m04244j466942k422485l126106l500405l612937l630295
$$ plain form
1052.2 461821976 458116112 454194221 449888649 445038223 439529762 433324738 426422234 418805656
1059.9 418805656 410510864 401869850 393747902 387454834 384213333 384458351 387464027 391592293
1067.6 391592293 394996071 396292000 394818916 390474663 383430099 374028473 362957039 351540680
1075.3 351540680 341874809 336549034 337889519 346965752 362884712 382880898 403282509 420862007
1083 420862007 433824348 441973953 446178627 447624397 447298660 445832558 443583908 440792274 437683525
1091.7 437683525 434466057 431238556 427914429 424276848 420162659 415620422 410897102 406262169
1099.4 406262169 401827354 397499046 393060570 388284531 382997932 377083855 370444641 362961731
1107.1 362961731 354507370 345030937 334655075 323683014 312552509 301935635 293084412 288113441
$$ packed form
1052.2D61821976l705864l921891m305572m850426n508461o205024o902504p616578
1059.9D18805656q294792q641014q121948o293068l241501K45018L005676M128266
1067.6C91592293L403778J295929j473084m344253p044564r401626j1071434j1416359
1075.3C51540680r665871n325775J340485R076233J5918960J9996186K0401611J7579498
1083D20862007J2962341Q149605M204674J445770l25737j466102k248650k791634l108749
1091.7D37683525l217468l227501l324127l637581m114189m542237m723320m634933
1099.4D06262169m434815m328308m438476m776039n286599n914077o639214p482910
1107.1C62961731q454361r476433j0375862j0972061j1130505j0616874q851223m970971
$$ plain form
1114.9 288113441 289624100 299445381 317137890 339457970 361470947 378725281 389040833 392823410
1122.6 392823410 392036743 388857002 384884338 381013222 377555695 374344444 370881042 366635017
1130.3 366635017 361358871 355178375 348413963 341333733 334049492 326567459 318879318 311008835
1138 311008835 303021679 295014420 287073574 279213295 271342506 263299141 254932575 246193790 237213993
1146.7 237213993 228360023 220229168 213556576 209082489 207462883 209239120 214785461 224187641
1154.4 224187641 237138481 252966232 270784702 289635601 308556747 326646042 343177681
1161.1 343177681 357683945 369903145 379672699 386932755 391812439 394569244 395334244 393980637
1168.9 393980637 390359688 384568405 376679535 366136818 351978378 334602928 317779732 308262234
$$ packed form
1114.9B88113441J510659R821281J7692509K2320080K2012977J7254334J0315552L782577
1122.6C92823410p86667l179741l972664l871116l457527l211251l463402m246025
1130.3C66635017n276146o180496o764412p080230p284241p482033p688141p870483
1138C11008835p987156q007259p940846p860279p870789q043365q366566q738785q979797
1146.7B37213993q853970q130855o672592m474087j619606J776237N546341R402180
1154.4B24187641J2950840J5827751J7818470J8850899J8921146J8089295J6531639
1161.1C43177681J4506264J2219200R769554P260056M879684K756805P65000j353607
1168.9C93980637l620949n791283p888870j0542717j4158440j7375450j6823196r517498
$$ plain form
1176.6 308262234 311930695 329019928 352851944 373955803 386508064 391642609 395013313 401260681
1184.3 401260681 410477409 419258995 424443779 425728493 425265007 425445633 427222710 430042000 432764740
1193 432764740 434492264 434848595 433909073 432030983 429655762 427116394 424544449 421920853 419192009
1201.6 419192009 416342926 413414192 410499649 407730217 405213699 402956009 400834618 398658562
1209.4 398658562 396263504 393571930 390607605 387485313 384373436 381410027 378605690 375816116
1217.1 375816116 372827301 369490128 365797539 361853600 357785416 353667984 349499664 345216026
1224.8 345216026 340727425 335961990 330895920 325554314 319998341 314323845 308681431 303287811
1232.5 303287811 298387470 294152966 290560722 287307816 283835316 279478874 273693485 266252460
$$ packed form
1176.6C08262234L668461J7089233K3832016K1103859J2552261N134545L370704O247368
1184.3D01260681R216728Q781586N184784J284714m63486J80626J777077K819290K722740
1193D32764740J727524L56331r39522j878090k375221k539368k571945k623596k728844
1201.6D19192009k849083k928734k914543k769432k516518k257690k121391k176056
1209.4C98658562k395058k691574k964325l122292l111877k963409k804337k789574
1217.1C75816116k988815l337173l692589l943939m068184m117432m168320m283638
1224.8C45216026m488601m765435n066070n341606n555973n674496n642414n393620
1232.5C03287811m900341m234504l592244l252906l472500m356442n785389p441025
$$ plain form
1240.2 266252460 257343006 247566814 237894974 229560604 223808784 221486130 222653484 226520290
1247.9 226520290 231824093 237429333 242712593 247483463 251592445 254623108 255930176 254946289
1255.7 254946289 251466351 245694103 238075390 229084282 219109726 208463497 197455158 186467896
1263.4 186467896 176002445 166678562 159198856 154293261 152664547 154947157 161667690 173188305
1271.1 173188305 189633656 210823936 236249466 265096531 296315441 328718567 361106033
1277.8 361106033 392408066 421792908 448680153 472647781 493307800 510258484 523146057
1284.6 523146057 531767120 536137657 536550293 533686295 528741379 523359146 519193344 517227364
1292.3 517227364 517289009 518169403 518310585 516592369 512715454 507073135 500382385 493360519 486492386
$$ packed form
1240.2B66252460q909454r776192r671840q334370n751820k322654J167354L866806
1247.9B26520290N303803N605240N283260M770870M108982L030663J307068r83887
1255.7B54946289l479938n772248p618713q991108r974556j0646229j1008339j0987262
1263.4A86467896j0465451r323883p479706m905595j628714K282610O720533J1520615
1271.1A73188305J6445351K1190280K5425530K8847065L1218910L2403126L2387466
1277.8C61106033L1302033K9384842K6887245K3967628K0660019J6950684J2887573
1284.6E23146057Q621063M370537M12636k863998m944916n382233m165802j965980
1292.3E17227364O1645Q80394J41182j718216l876915n642319o690750p021866o868133
$$ plain form
1301 486492386 479827347 472899094 465007362 455893478 446397514 438495789 434488564 435781136 442066040
1309.7 442066040 451442604 461346588 469662857 475386925 478596764 479946709 480101814 479445152 478118820
1318.3 478118820 476216164 473897133 471340027 468629570 465726357 462549171 459074936 455363312
1326 455363312 451509743 447599182 443690948 439805946 435895767 431830215 427453918 422687645 417579422
1334.7 417579422 412250252 406780891 401152153 395282555 389102631 382573166 375632362 368156891
1342.4 368156891 360008736 351136589 341626167 331636505 321289520 310635872 299740791 288796329
1350.2 288796329 278142910 268190022 259347248 252037754 246743107 243963280 244085598 247296505
1357.9 247296505 253642979 263163967 275890656 291636219 309755592 329157219 348635635 367281113
$$ packed form
1301D86492386o665039o928253p891732r113884r495964p901725m007225J292572O284904
1309.7D42066040R376564R903984Q316269N724068L209839J349945J55105o56662j326332
1318.3D78118820j902656k319031k557106k710457k903213l177186l474235l711624
1326D55363312l853569l910561l908234l885002l910179m065552m376297m766273n108223
1334.7D17579422n329170n469361n628738n869598o179924o529465o940804p475471
1342.4C68156891q148155q872147r510422r989662j0346985j0653648j0895081j0944462
1350.2B88796329j0653419r952888q842774p309494n294647k779827J22318L210907
1357.9B47296505O346474R520988J2726689J5745563J8119373J9401627J9478416J8645478
$$ plain form
1365.6 367281113 384636116 400511093 414706154 426956635 437164536 445662193 453190651 460543594
1373.3 460543594 468143005 475877419 483287888 489898834 495416451 499712448 502724533 504427452
1381 504427452 504894638 504343376 503087387 501409798 499440155 497095871 494125023 490237312 485243607
1389.7 485243607 479083405 471709442 462992020 452877312 441808929 431060257 422538910 418019905
1397.4 418019905 418294373 422855339 430303612 439085312 448007240 456294289 463386345 468798828
1405.1 468798828 472180138 473466797 472954979 471193619 468751640 466012001 463127823 460130501
1412.8 460130501 457026367 453754158 450094185 445766411 440777283 435707130 431534195 428986435
1420.6 428986435 427937584 427422256 426304779 424024353 420799637 417210045 413624191 409987488
$$ packed form
1365.6C67281113J7355003J5874977J4195061J2250481J0207901Q497657P528458P352943
1373.3D60543594P599411P734414P410469O610946N517617M295997L012085J702919
1381E04427452M67186n51262j255989j677589j969643k344284k970848l887711m993705
1389.7D85243607o160202p373963q717422j0114708j1068383j0748672q521347m519005
1397.4D18019905K74468M560966P448273Q781700Q921928Q287049P092056N412483
1405.1D68798828L381310J286659n11818j761360k441979k739639k884178k997322
1412.8D60130501l104134l272209l659973m327774m989128n070153m172935k547760
1420.6D28986435j048851n15328j117477k280426l224716l589592l585854l636703
$$ plain form
1428.3 409987488 406059837 401777534 397355576 393040085 388760185 384051704 378423462 371933327
1436 371933327 365480385 360465698 358002586 358276215 360539970 363656349 366641960 368801727 369563522
1444.7 369563522 368415680 365125961 360005341 353895416 347857742 342818108 339345703 337528000
1452.4 337528000 336869469 336341782 334768829 331469536 326740570 321783371 318097363 316755943 317988548
1461.1 317988548 321179581 325148811 328563499 330391541 330249634 328429146 325522690 321912689
1468.8 321912689 317544346 312163963 305746250 298662586 291429482 284321804 277238388 269918919
1476.5 269918919 262268944 254514294 247121296 240613575 235433769 231927757 230460148 231565418
1484.2 231565418 235907040 243847961 254787922 266830883 277292442 283893700 285777664 283551540
$$ packed form
1428.3D09987488l927651m282303m421958m315491m279900m708481n628242o490135
1436C71933327o452942n014687k463112K73629K263755L116379K985611K159767P61795
1444.7C69563522j147842l289719n120620o109925o037674n039634l472405j817703
1452.4C37528000o58531n27687j572953l299293m728966m957199l686008j341420J232605
1461.1C17988548L191033L969230L414688J828042j41907j820488k906456l610001
1468.8C21912689m368343n380383o417713p083664p233104p107678p083416p319469
1476.5B69918919p649975p754650p392998o507721n179806l506012j467609J105270
1484.2B31565418M341622P940921J0939961J2042961J0461559O601258J883964k226124
$$ plain form
1491.9 283551540 278413601 271240177 262395573 252167778 241114216 229890232 218870525 208107910
1499.6 208107910 197656746 187744408 178469639 169405231 159768505 149264526 138888960 130866852
1507.3 130866852 127630386 130563364 139351254 152227011 166789722 180890598 193224010 203459854
1515.1 203459854 211918983 219011707 224824104 229133377 231753712 232807846 232627373 231404438
1522.8 231404438 228986397 225040398 219426270 212420387 204609890 196588497 188725109 181173515
1530.5 181173515 174074535 167758350 162771111 159702787 158973894 160775394 165178623 172205601
1538.2 172205601 181667252 192880898 204629784 215564137 224779053 232059002 237592201 241504517
1545.9 241504517 243706226 244138050 243047009 240944042 238321438 235466595 232519169 229606400
$$ packed form
1491.9B83551540n137939p173424q844604j0227795j1053562j1223984j1019707j0762615
1499.6B08107910j0451164r912338r274769r064408r636726j0503979j0375566q022108
1507.3A30866852l236466K932978Q787890J2875757J4562711J4100876J2333412J0235844
1515.1B03459854Q459129P092724N812397M309273K620335J054134j80473j222935
1522.8B31404438k418041l945999n614128p005883p810497q021393p863388p551594
1530.5A81173515p098980o316185m987239l068324p28893J801500M403229P026978
1538.2A72205601R461651J1213646J1748886J0934353R214916P279949N533199L912316
1545.9B41504517K201709M31824j091041k102967k622604k854843k947426k912769
$$ plain form
1553.6 229606400 226873150 224466648 222617607 221757088 222449493 225108128 229782639 236299343 244640160
1562.3 244640160 255134964 268223133 284002399 301982441 321213989 340602760 359157791
1569.1 359157791 376101456 390896645 403204193 412758751 419255714 422409058 422178421 418931580
1576.8 418931580 413317490 405914001 396960449 386381264 373987885 359601555 343027573 324078407
1584.5 324078407 302879848 280423527 259011822 242119408 233409176 235142059 246763077 264612942
1592.2 264612942 283188992 297376652 304356556 304122429 298571358 290075207 280517921 271115093
1599.9 271115093 262660027 255741711 250803394 248152046 247993431 250440807 255473671 262911587
1607.6 262911587 272455864 283735466 296290379 309554234 322979088 336299706 349694901
$$ packed form
1553.6B29606400k733250k406502j849041q60519O92405K658635M674511O516704Q340817
1562.3B44640160J0494804J3088169J5779266J7980042J9231548J9388771J8555031
1569.1C59157791J6943665J4795189J2307548R554558O496963L153344k30637l246841
1576.8D18931580n614090p403489q953552j0579185j2393379j4386330j6573982j8949166
1584.5C24078407k1198559k2456321k1411705j6892414q710232J732883J1621018J7849865
1592.2B64612942J8576050J4187660O979904k34127n551071q496151r557286r402828
1599.9B71115093q455066o918316m938317k651348j58615K447376N032864P437916
1607.6B62911587R544277J1279602J2554913J3263855J3424854J3320618J3395195
$$ plain form
1614.4 349694901 363607635 378290901 393463058 408412437 422479553 435488129 447747116
1621.1 447747116 459668274 471384087 482704201 493369522 503297157 512589569 521374588 529699402
1628.9 529699402 537568932 545013237 552050552 558591232 564431572 569380569 573387337 576530952
1636.6 576530952 578899193 580509300 581348953 581466103 580993462 580083427 578821564 577206726 575241318
1645.3 575241318 573111839 571305161 570433083 570720863 571530571 571497269 569416275 565204735 559983711
1653.9 559983711 555083694 550878868 546564445 540986900 533554153 524333420 513513374 501101799
1661.6 501101799 487224388 472453194 457509842 442557106 426934471 409738045 390695496
1668.4 390695496 370500946 350427818 331701164 315122108 301035233 289568729 281102638
$$ packed form
1614.4C49694901J3912734J4683266J5172157J4949379J4067116J3008576J2258987
1621.1D47747116J1921158J1715813J1320114J0665321R927635R292412Q785019Q324814
1628.9E29699402P869530P444305P037315O540680N840340M948997M006768L143615
1636.6E76530952K368241J610107Q39653J17150m72641r10035j261863j614838j965408
1645.3E75241318k129479j806678q72078K87780Q09708l3302k080994m211540n221024
1653.9E59983711m900017m204826m314423n577545p432747r220733j0820046j2411575
1661.6E01101799j3877411j4771194j4943352j4952736j5622635j7196426j9042549
1668.4C90695496k0194550k0073128j8726654j6579056j4086875j1466504q466091
$$ plain form
1675.1 281102638 276705399 277990780 286163521 300969505 320728378 343675156 369305649 398170547
1682.9 398170547 430200157 463401604 494525795 521187439 543335457 562689400 580886078
1689.6 580886078 598208160 613845291 626992874 637555847 646028595 653010635 658888702 663772278
1697.3 663772278 667556152 670087204 671406860 671868286 671939697 671856308 671516113 670756836 669682312
1706 669682312 668642349 667899551 667391357 666846008 666088867 665190964 664353333 663699188 663168259 662559509
1715.6 662559509 661673126 660480881 659210510 658220901 657709808 657516022 657254333 656670609 655828018
1724.3 655828018 654922791 653984756 652861633 651508713 650169220 649151535 648442612 647666016 646506653
1733 646506653 645138931 644145203 643981934 644556046 645335770 645828476 645910263 645740662 645469742 645093231
$$ packed form
1675.1B81102638m397239J285381Q172741J4805984J9758873K2946778K5630493K8864898
1682.9C98170547L2029610L3201447L1124191K6661644K2148018J9353943J8196678
1689.6E80886078J7322082J5637131J3147583J0562973Q472748O982040N878067M883576
1697.3F63772278L783874K531052J319656M61426P1411q3389l40195p59277j074524
1706F69682312j039963p42798n08194n45349p57141q97903q37631o54145n30929o08750
1715.6F62559509q86383j192245j270371r89609n11093j93786k61689n83724q42591
1724.3F55828018r05227r38035j123123j352920j339493j017685p08923p76596j159363
1733F46506653j367722r93728j63269N74112P79724M92706Q1787j69601k70920l76511
$$ plain form
1742.7 645093231 644551773 643878098 643202286 642634659 642176819 641741104 641239014 640662918 640106277 639705620
1752.3 639705620 639519882 639439659 639232674 638725510 637953529 637105217 636308441 635499687 634543266 633453712
1761.9 633453712 632435341 631660652 631050491 630336952 629356308 628226433 627199402 626373177 625610313
1770.6 625610313 624747505 623824768 623052940 622573814 622301445 622009010 621526260 620821495 619923477 618837967
1780.3 618837967 617566872 616177521 614809303 613616180 612724152 612229233 612169571 612444038 612768402
1788.9 612768402 612786789 612298927 611411095 610457726 609753380 609383698 609187508 608895340 608285103 607267113
1798.6 607267113 605902519 604384232 602971268 601879959 601187248 600828094 600690651 600712509 600887947
1807.3 600887947 601203079 601599159 602010040 602409782 602789803 603087578 603172379 602933693 602386971 601678925
$$ packed form
1742.7F45093231n41458o73675o75812n67627m57840m35715n02090n76096n56641m00657
1752.3F39705620j85738q0223k06985n07164p71981q48312p96776q08754r56421j089554
1761.9F33453712j018371p74689o10161p13539r80644j129875j027031q26225p62864
1770.6F25610313q62808r22737p71828m79126k72369k92435m82750p04765q98018j085510
1780.3F18837967j271095j389351j368218j193123q92028m94919n9662K74467L24364
1788.9F12768402J8387m87862q87832r53369p04346l69682j96190k92168o10237j017990
1798.6F07267113j364594j518287j412964j091309o92711l59154j37443K1858J75438
1807.3F00887947L15132L96080M10881L99742L80021K97775Q4801k38686n46722p08046
$$ plain form
1816.9 601678925 600988312 600425186 600002213 599651756 599237328 598590126 597613716 596402130 595220566
1825.6 595220566 594300995 593631554 592967720 592074814 590946732 589771194 588701210 587698631 586596794
1834.3 586596794 585256805 583622780 581670074 579411316 577024040 574945869 573744469 573803825 575083122
1842.9 575083122 577145081 579397316 581331673 582634163 583197060 583108635 582618294 582031822 581563568
1851.6 581563568 581244507 580950203 580514793 579838409 578931694 577903023 576909561 576084023 575465927
1860.3 575465927 574978943 574482994 573856468 573039055 572009048 570750046 569268913 567646790 566036797
1869 566036797 564561653 563195076 561769333 560159798 558509331 557267876 556962509 557848587 559718971
1877.7 559718971 562013664 564125938 565665627 566534081 566851082 566846085 566763611 566762009 566821175 566747398
$$ packed form
1816.9F01678925o90613n63126m22973l50457m14428o47202r76410j211586j181564
1825.6E95220566r19571o69441o63834q92906j128082j175538j069984j002579j101837
1834.3E86596794j339989j634025j952706k258758k387276k078171j201400N9356J279297
1842.9E75083122K061959K252235J934357J302490N62897q8425m90341n86472m68254
1851.6E81563568l19061k94304m35410o76384r06715j028671r93462q25538o18096
1860.3E75465927m86984m95949o26526q17413j030007j259002j481133j622123j609993
1869E66036797j475144j366577j425743j609535j650467j241455l05367Q86078J870384
1877.7E59718971K294693K112274J539689Q68454L17001m997q2474j602N9166p3777
$$ plain form
1887.3 566747398 566320953 565489693 564430885 563413200 562593040 561935463 561309853 560625229 559863396
1896 559863396 559013481 558026695 556857338 555528221 554131050 552766266 551500854 550390930 549520035
1904.7 549520035 548988495 548859634 549126244 549728851 550591087 551627731 552731895 553775482 554631882
1913.3 554631882 555197449 555406914 555264282 554881287 554461861 554191589 554098816 554023819 553756218 553224182
1923 553224182 552553558 551940994 551474113 551072235 550578232 549886055 548986168 547930984 546791420 545641212
1932.6 545641212 544541931 543514366 542533875 541584587 540732346 540132408 539945221 540230484 540917206
1941.3 540917206 541862144 542923050 543981628 544921532 545624962 546012878 546096001 545977631 545796967
1950 545796967 545654831 545570488 545493774 545352745 545106087 544765778 544382973 544009743 543667603 543345490
$$ packed form
1887.3E66747398m26445q31260j058808j017685q20160o57577o25610o84624p61833
1896E59863396q49915r86786j169357j329117j397171j364784j265412j109924q70895
1904.7E49520035n31540j28861K66610O02607Q62236J036644J104164J043587Q56400
1913.3E54631882N65567K09465j42632l82995m19426k70272r2773p4997k67601n32036
1923E53224182o70624o12564m66881m01878m94003o92177q99887j055184j139564j150208
1932.6E45641212j099281j027565r80491r49288q52241n99938j87187K85263O86722
1941.3E40917206R44938J060906J058578R39904P03430L87916Q3123j18370j80664
1950E45796967j42136q4343p6714j41029k46658l40309l82805l73230l42140l22113
$$ plain form
1959.6 543345490 543023300 542692719 542354355 541996689 541587715 541095428 540522995 539921608 539360313 538874626
1969.3 538874626 538440361 537998123 537508049 536987381 536501122 536120148 535880737 535768929 535728188 535681877
1978.9 535681877 535564117 535353470 535084076 534816780 534589272 534388466 534174576 533925362 533646812 533338852
1988.6 533338852 532968597 532502556 531973724 531501007 531214180 531147995 531209564 531257095 531211128 531090088
1998.2 531090088 530952606 530822525 530679245 530500298 530290260 530059929 529792633 529453697 529036713 528587875
2007.8 528587875 528173370 527822876 527511559 527193794 526840820 526441040 525974922 525416107 524774857 524136887
2017.5 524136887 523637924 523380203 523357086 523454285 523523865 523464012 523248901 522906799 522480812 522004509
2027.1 522004509 521495857 520958824 520391502 519798431 519195786 518600235 518007889 517392120 516725159 516003113
$$ packed form
1959.6E43345490l22190l30581l38364l57666m08974m92287n72433o01387n61295m85687
1969.3E38874626m34265m42238m90074n20668m86259l80974k39411j11808m0741m6311
1978.9E35681877j17760k10647k69394k67296k27508k00806k13890k49214k78550l07960
1988.6E33338852l70255m66041n28832m72717k86827o6185O1569M7531m5967j21040
1998.2E31090088j37482j30081j43280j78947k10038k30331k67296l38936m16984m48838
2007.8E28587875m14505l50494l11317l17765l52974l99780m66118n58815o41250o37970
2017.5E24136887m98963k57721k3117R7199O9580n9853k15111l42102m25987m76303
2027.1E22004509n08652n37033n67322n93071o02645n95551n92346o15769o66961p22046
$$ plain form
2036.8 516003113 515245857 514472733 513688240 512899590 512141304 511473122 510945740 510570030 510324020 510182152
2046.4 510182152 510131683 510159798 510240440 510348511 510486107 510688133 510992393 511405602 511898193 512427864
2056.1 512427864 512958832 513459892 513895874 514232140 514452705 514568710 514611244 514615479 514610291 514609184 514601250
2066.7 514601250 514550018 514417191 514200745 513948097 513723793 513550453 513383789 513150635 512816925 512419968
2076.3 512419968 512035332 511714325 511452942 511215668 510979538 510751495 510543976 510347672 510132141 509877434
2086 509877434 509601212 509352379 509173050 509063225 508974915 508844490 508637924 508381462 508151970 508031616
2095.6 508031616 508054008 508179016 508315735 508377609 508328705 508192253 508024597 507881241 507798691 507787971
2105.2 507787971 507830505 507879257 507874947 507781715 507614937 507432404 507292709 507210274 507147522 507046661 506869202
$$ packed form
2036.8E16003113p57256p73124p84493p88650p58286o68182n27382l75710k46010j41868
2046.4E10182152n0469K8115Q0642J08071J37596K02026L04260M13209M92591N29671
2056.1E12427864N30968N01060M35982L36266K20565J16005M2534M235n188j107p934
2066.7E14601250n1232j32827k16446k52648k24304j73340j66664k33154l33710l96957
2076.3E12419968l84636l21007k61383k37274k36130k28043k07519j96304k15531k54707
2086E09877434k76222k48833j79329j09825q8310j30425k06566k56462k29492j20354
2095.6E08031616K2392J25008J36719O1874m8904j36452j67656j43356q2550j0720
2105.2E07787971M2534M8752m310r3232j66778j82533j39695q2435o2752j00861j77459
$$ plain form
2115.9 506869202 506611977 506295853 505948830 505599098 505277863 505014267 504821472 504684982 504570961 504448166
2125.5 504448166 504311829 504185867 504104080 504081306 504096527 504098244 504030685 503863182 503603935 503291588 502971687
2136.1 502971687 502677917 502427139 502221375 502048721 501881218 501681938 501427460 501129532 500833893 500590096
2145.8 500590096 500417862 500296135 500183640 500044785 499858665 499612389 499300041 498938179 498578835 498294525
2155.4 498294525 498134422 498085480 498073578 498010864 497851372 497614861 497364578 497162628 497038345 496978416
2165 496978416 496936188 496846581 496648903 496322060 495912628 495525703 495265236 495160713 495140457 495080681 494894257
2175.6 494894257 494586678 494238396 493939285 493735313 493617668 493543549 493459244 493315887 493087196 492786026
2185.3 492786026 492464180 492184029 491979065 491835213 491702118 491523781 491261749 490905952 490476990 490023003
$$ packed form
2115.9E06869202k57225l16124l47023l49732l21235k63596j92795j36490j14021j22795
2125.5E04448166j36337j25962q1787k2774J5221J717o7559j67503k59247l12347l19901
2136.1E02971687k93770k50778k05764j72654j67503j99280k54478k97928k95639k43797
2145.8E00590096j72234j21727j12495j38855j86120k46276l12348l61862l59344k84310
2155.4D98294525j60103m8942j1902o2714j59492k36511k50283k01950j24283n9929
2165D96978416m2228q9607j97678l26843m09432l86925k60467j04523k0256n9776j86424
2175.6D94894257l07579l48282k99111k03972j17645p4119q4305j43357k28691l01170
2185.3D92786026l21846k80151k04964j43852j33095j78337k62032l55797m28962m53987
$$ plain form
2194.9 490023003 489605179 489271469 489029655 488838158 488622780 488311577 487872238 487331429 486767273 486272736
2204.6 486272736 485908432 485671883 485505028 485333786 485115967 484867020 484651985 484550095 484610138 484818726
2214.2 484818726 485100937 485355949 485511742 485561142 485556717 485571861 485655136 485808945 485995712 486161537
2223.9 486161537 486261444 486276703 486220055 486127472 486039925 485984726 485966644 485970268 485970078 485942917 485877419 485780029
2235.4 485780029 485670624 485572548 485500793 485456924 485426903 485383072 485290337 485123291 484888992 484630089 484398308
2246 484398308 484209290 484024467 483780861 483446426 483046608 482638245 482261963 481922226 481610222 481332245
2255.7 481332245 481105423 480928955 480770264 480588188 480367393 480131111 479921684 479775124 479708595 479714127
2265.3 479714127 479751511 479752655 479654007 479444237 479177475 478929520 478733444 478557243 478344307 478070679
$$ packed form
2194.9D90023003m17824l33710k41814j91497k15378l11203m39339n40809n64156m94537
2204.6D86272736l64304k36549j66855j71242k17819k48947k15035j01890O0043K08588
2214.2D84818726K82211K55012J55793M9400m425J5144Q3275J53809J86767J65825
2223.9D86161537R9907J5259n6648r2583q7547n5199j8082L624j90k7161o5498r7390
2235.4D85780029j09405r8076p1755m3869l0021m3831r2735j67046k34299k58903k31781
2246D84398308j89018j84823k43606l34435l99818m08363l76282l39737l12004k77977
2255.7D81332245k26822j76468j58691j82076k20795k36282k09427j46560o6529N532
2265.3D79714127L7384J144r8648k09770k66762k47955j96076j76201k12936k73628
$$ plain form
2275 478070679 477759247 477445297 477143288 476848946 476564064 476302757 476072350 475855103 475615654 475324097
2284.6 475324097 474970703 474566078 474137383 473724289 473367081 473082695 472849617 472624893 472377396 472106857
2294.3 472106857 471826019 471534882 471220627 470883102 470546875 470237122 469946289 469641838 469321175 469055748
2303.9 469055748 468965302 469131966 469530029 470040741 470532494 470929337 471209831 471366501 471387558 471280594
2313.5 471280594 471091805 470876427 470646706 470364380 469997597 469579544 469196129 468914833 468733101 468602715
2323.2 468602715 468488007 468382988 468273392 468107185 467826653 467430916 466995316 466623077 466379433 466270905
2332.8 466270905 466267052 466322823 466378746 466364288 466228676 465984535 465715714 465531425 465491753 465566139 465658760
2343.4 465658760 465686798 465650711 465630035 465701599 465853653 465983467 465981216 465810776 465499306 465066032 464501343
$$ packed form
2275D78070679l11432l13950l02009k94342k84882k61307k30407k17247k39449k91557
2284.6D75324097l53394m04625m28695m13094l57208k84386k33078k24724k47497k70539
2294.3D72106857k80838k91137l14255l37525l36227l09753k90833l04451l20663k65427
2303.9D69055748r0446J66664L98063N10712M91753L96843K80494J56670K1057j06964
2313.5D71280594j88789k15378k29721k82326l66783m18053l83415k81296j81732j30386
2323.2D68602715j14708j05019j09596j66207k80532l95737m35600l72239k43644j08528
2332.8D66270905l853N5771N5923j4458j35612k44141k68821j84289l9672P4386R2621
2343.4D65658760K8038l6087k0676P1564J52054J29814k251j70440l11470m33274n64689
$$ plain form
2354.1 464501343 463838921 463222351 462841339 462766762 462861481 462888031 462716560 462416725 462146111 461975632
2363.7 461975632 461850700 461706848 461582298 461591454 461799889 462150688 462508659 462758484 462854996 462813835
2373.3 462813835 462685432 462538261 462435570 462396317 462379456 462320328 462192039 462028885 461888733 461800575
2383 461800575 461750832 461713142 461677780 461651077 461636429 461624298 461604271 461578636 461561623 461566353 461588478 461602669
2394.6 461602669 461571922 461466560 461280975 461035690 460765800 460504570 460272102 460071297 459888268 459696960
2404.2 459696960 459474373 459217987 458953629 458719368 458536491 458389473 458231316 458008347 457688675 457279243
2413.8 457279243 456824646 456388321 456019363 455724716 455465927 455190010 454870491 454528542 454219742 454000778
2423.5 454000778 453906021 453942413 454095078 454328194 454585037 454798126 454916077 454930458 454880676 454828453
$$ packed form
2354.1D64501343o62422o16570l81012p4577R4719K6550j71471k99835k70614j70479
2363.7D61975632j24932j43852j24550R156K08435L50799L57971K49825R6512m1161
2373.3D62813835j28403j47171j02691l9253j6861n9128j28289j63154j40152q8158
2383D61800575m9743l7690l5362k6703j4648j2131k0027k5635j7013M730K2125J4191
2394.6D61602669l0747j05362j85585k45285k69890k61230k32468k00805j83029j91308
2404.2D59696960k22587k56386k64358k34261j82877j47018j58157k22969l19672m09432
2413.8D57279243m54597m36325l68958k94647k58789k75917l19519l41949l08800k18964
2423.5D54000778r4757L6392J52665K33116K56843K13089J17951J4381m9782n2223
$$ plain form
2433.1 454828453 454818077 454851837 454896202 454909782 454871826 454790039 454690704 454599915 454529686 454474258 454415512
2443.7 454415512 454334793 454224014 454087143 453933792 453772202 453609581 453457069 453328552 453225365 453123169
2453.4 453123169 452978897 452762413 452488174 452216072 452012939 451902275 451843681 451761436 451603317 451385078
2463 451385078 451181793 451071968 451074524 451132088 451150856 451064796 450870667 450614471 450353699 450132446 449976349
2473.6 449976349 449893379 449864960 449840813 449762192 449599991 449379120 449158516 448987160 448873100 448788490
2483.3 448788490 448697205 448573151 448404541 448190498 447942772 447684059 447436600 447210007 446997223 446787720
2492.9 446787720 446579742 446382523 446206093 446051903 445908966 445757675 445578003 445361595 445119438 444879189
2502.6 444879189 444667320 444491463 444339981 444197502 444060745 443939972 443846397 443785477 443759651 443772049
$$ packed form
2433.1D54828453j0376L3760M4365J3580l7956q1787r9335r0789p0229n5428n8746
2443.7D54415512q0719j10779j36871j53351j61590j62621j52512j28517j03187j02196
2453.4D53123169j44272k16484k74239k72102k03133j10664n8594q2245j58119k18239
2463D51385078k03285j09825K556N7564J8768q6060j94129k56196k60772k21253j56097
2473.6D49976349q2970k8419k4147p8621j62201k20871k20604j71356j14060q4610
2483.3D48788490r1285j24054j68610k14043k47726k58713k47459k26593k12784k09503
2492.9D46787720k07978j97219j76430j54190j42937j51291j79672k16408k42157k40249
2502.6D44879189k11869j75857j51482j42479j36757j20773r3575o0920k5826J2398
$$ plain form
2512.2 443772049 443822479 443898888 443981171 444056931 444132996 444227715 444351997 444497299 444641342 444762993 444849281
2522.8 444849281 444890518 444876328 444801636 444677467 444533081 444402428 444303169 444224854 444138031 444017525 443863411
2533.4 443863411 443700943 443555145 443426285 443289680 443121452 442926292 442732010 442555695 442374840 442141113
2543.1 442141113 441829224 441472931 441150131 440924873 440798416 440712128 440601425 440450592 440304070 440227089
2552.7 440227089 440247612 440328484 440387878 440353851 440211792 440009613 439821014 439695702 439634018 439599686 439554596
2563.3 439554596 439482841 439392090 439292336 439178009 439029350 438831558 438596497 438363876 438175926 438042946
2573 438042946 437929993 437780838 437560349 437278938 436979904 436703835 436466217 436262703 436084137 435917358
2582.6 435917358 435736389 435506630 435214310 434893494 434615402 434436989 434352798 434295616 434184303 433978767
$$ packed form
2512.2D43772049N0430P6409Q2283P5760P6065R4719J24282J45302J44043J21651Q6288
2522.8D44849281M1237j4190p4692j24169j44386j30653r9259p8315q6823j20506j54114
2533.4D43863411j62468j45798j28860j36605j68228j95160j94282j76315j80855k33727
2543.1D42141113l11889l56293l22800k25258j26457q6288j10703j50833j46522p6981
2552.7D40227089K0523Q0872N9394l4027j42059k02179j88599j25312o1684l4332m5090
2563.3D39554596p1755r0751r9754j14327j48659j97792k35061k32621j87950j32980
2573D38042946j12953j49155k20489k81411k99034k76069k37618k03514j78566j66779
2582.6D35917358j80969k29759k92320l20816k78092j78413q4191n7182j11313k05536
$$ plain form
2592.2 433978767 433699112 433409157 433189011 433115616 433239059 433554916 433990173 434430580 434785309 435036469
2601.9 435036469 435231323 435424690 435627251 435806770 435926590 435978546 435978699 435947456 435901184 435860786 435850029
2612.5 435850029 435875854 435912399 435911713 435839157 435697098 435520897 435353394 435225983 435149155 435108032 435061264
2623.1 435061264 434958534 434775505 434541092 434324226 434183197 434120979 434086952 434020500 433895340 433725090
2632.8 433725090 433539505 433358498 433186989 433027382 432886887 432774544 432691727 432627373 432560310 432469711
2642.4 432469711 432345581 432196236 432046509 431921425 431827011 431743126 431639290 431501389 431344833 431199265
2652 431199265 431079254 430973434 430862045 430741882 430625763 430517006 430389442 430207596 429967651 429713898
2661.7 429713898 429504929 429360123 429241982 429090843 428877983 428626823 428390007 428210869 428098602 428027382
$$ packed form
2592.2D33978767k79655k89955k20146p3395J23443L15857M35257M40407L54729K51160
2601.9D35036469J94854J93367K02561J79519J19820N1956J53l1243m6272m0398j0757
2612.5D35850029K5825L6545o86p2556j42059j76201j67503j27411p6828m1123m6768
2623.1D35061264j02730j83029k34413k16866j41029o2218l4027o6452j25160j70250
2632.8D33725090j85585j81007j71509j59607j40495j12343q2817o4354o7063r0599
2642.4D32469711j24130j49345j49727j25084r4414q3885j03836j37901j56556j45568
2652D31199265j20011j05820j11389j20163j16119j08757j27564j81846k39945k53753
2661.7D29713898k08969j44806j18141j51139k12860k51160k36816j79138j12267p1220
$$ plain form
2671.3 428027382 427952042 427835426 427676315 427516556 427412415 427385368 427395172 427364883 427236862 427010612
2681 427010612 426733055 426460228 426228523 426050797 425921745 425818825 425705299 425545731 425326462 425064316
2690.6 425064316 424794693 424551620 424355507 424206238 424081230 423938179 423735352 423462296 423151131 422853241
2700.3 422853241 422598801 422377663 422163239 421949577 421759949 421616783 421510963 421406670 421279602 421143532
2709.9 421143532 421036568 420980415 420956650 420923729 420856972 420770874 420707207 420701942 420758171 420842743 420903435
2720.5 420903435 420898590 420821571 420705643 420602264 420542412 420513840 420472755 420384521 420253639 420116119 420000343
2731.1 420000343 419898148 419773636 419601593 419397125 419202042 419042206 418896751 418712997 418459282 418162804
2740.8 418162804 417893562 417703133 417576256 417443428 417244911 416981506 416704102 416458473 416243820 416026382
$$ packed form
2671.3D28027382p5340j16616j59111j59759j04141k7047R804l0289j28021k26250
2681D27010612k77557k72827k31705j77726j29052j02920j13526j59568k19269k62146
2690.6D25064316k69623k43073j96113j49269j25008j43051k02827k73056l11165k97890
2700.3D22853241k54440k21138k14424k13662j89628j43166j05820j04293j27068j36070
2709.9D21143532j06964n6153k3765l2921o6757q6098o3667n265N6229Q4572O0692
2720.5D20903435m845p7019j15928j03379n9852k8572m1085q8234j30882j37520j15776
2731.1D20000343j02195j24512j72043k04468j95083j59836j45455j83754k53715k96478
2740.8D18162804k69242j90429j26877j32828j98517k63405k77404k45629k14653k17438
$$ plain form
2750.4 416026382 415781250 415513725 415244255 414986954 414753990 414571419 414471169 414455376 414474411 414454880
2760 414454880 414354591 414189758 414006844 413834381 413667564 413493538 413315468 413144073 412972298 412771645
2769.7 412771645 412516670 412209625 411875458 411539955 411220398 410935097 410706215 410539589 410400314 410221329
2779.3 410221329 409949303 409593735 409229660 408952560 408819466 408819542 408890190 408956642 408968086 408908844 408787956
2789.9 408787956 408621407 408423004 408205872 407985878 407776146 407574120 407359009 407107048 406814651 406506500
2799.6 406506500 406216888 405959892 405714684 405440826 405108871 404722748 404313583 403914528 403536224 403163300
2809.2 403163300 402771111 402346230 401890678 401408424 400890198 400317497 399680481 398994102 398288574 397582016
2818.9 397582016 396863632 396103630 395281410 394397469 393451538 392406769 391180077 389677887 387848282
$$ packed form
2750.4D16026382k45132k67525k69470k57301k32964j82571j00250j5793J9035j9531
2760D14454880j00289j64833j82914j72463j66817j74026j78070j71395j71775k00653
2769.7D12771645k54975l07045l34167l35503l19557k85301k28882j66626j39275j78985
2779.3D10221329k72026l55568l64075k77100j33094P6P0648O6452J1444n9242j20888
2789.9D08787956j66549j98403k17132k19994k09732k02026k15111k51961k92397l08151
2799.6D06506500k89612k56996k45208k73858l31955l86123m09165l99055l78304l72924
2809.2D03163300l92189m24881m55552m82254n18226n72701o37016o86379p05528p06558
2818.9C97582016p18384p60002q22220q83941r45931j044769j226692j502190j829605
$$ plain form
2827.6 387848282 385695267 383238220 380466499 377365074 374034042 370817566 368313370 367192383
2835.3 367192383 367908592 370472679 374435120 379081078 383706818 387819138 391188202 393787117
2843 393787117 395698471 397043648 397941360 398483429 398728943 398721008 398518944 398213959 397906151 397656746
2852.6 397656746 397457695 397251930 396989288 396671143 396345482 396066284 395853043 395682182 395507431 395282631
2862.3 395282631 394978485 394591522 394149590 393702507 393294868 392934456 392585526 392198753 391754684 391284370
2871.9 391284370 390847054 390485077 390192871 389923630 389622269 389258308 388836937 388388519 387944298 387514992
2881.6 387514992 387080498 386602097 386048546 385417099 384731941 384018631 383284988 382530861 381777267 381078186
2891.2 381078186 380487022 380005493 379565773 379072914 378475037 377799644 377125626 376518936 375986977 375484314
$$ packed form
2827.6C87848282k153015k457047k771721l101425l331032l216476k504196j120987
2835.3C67192383P16209K564087L962441M645958M625740M112320L369064K598915
2843C93787117J911354J345177Q97712N42069K45514p935k02064l04985l07808k49405
2852.6C97656746j99051k05765k62642l18145l25661k79198k13241j70861j74751k24800
2862.3C95282631l04146l86963m41932m47083m07639l60412l48930l86773m44069m70314
2871.9C91284370m37316l61977k92206k69241l01361l63961m21371m48418m44221m29306
2881.6C87514992m34494m78401n53551o31447o85158p13310p33643p54127p53594o99081
2891.2C81078186n91164m81529m39720m92859n97877o75393o74018o06690n31959n02663
$$ plain form
2900.8 375484314 374958115 374393730 373828392 373326645 372935524 372655067 372449608 372289734 372189560 372198448
2910.5 372198448 372348785 372603264 372850990 372959824 372844353 372495003 371948662 371233101 370336647 369231567
2920.1 369231567 367921486 366461487 364923096 363333588 361651611 359805984 357767448 355596466
2927.8 355596466 353448219 351556396 350213432 349723587 350299225 351936913 354366226 357137451 359802628
2936.5 359802628 362066879 363821754 365079117 365891800 366317139 366414032 366240501 365849380 365295715
2945.2 365295715 364650955 363999519 363409882 362908478 362488747 362143745 361883087 361710815 361591187 361442337
2954.8 361442337 361170654 360712852 360052147 359204826 358201523 357078743 355879135 354645920 353411217
2963.5 353411217 352186432 350967407 349754677 348578224 347510414 346654129 346099854 345878105 345935669
$$ packed form
2900.8C75484314n26199n64385n65338n01747l91121k80457k05459j59874j00174Q888
2910.5C72198448J50337K54479K47726J08834j15471l49350n46341p15561q96454j105080
2920.1C69231567j310081j459999j538391j589508j681977j845627k038536k170982
2927.8C55596466k148247j891823j342964m89845N75638J637688K429313K771225K665177
2936.5C59802628K264251J754875J257363Q12683M25339R6893j73531l91121n53665
2945.2C65295715o44760o51436n89637n01404m19731l45002k60658j72272j19628j48850
2954.8C61442337k71683m57802o60705q47321j003303j122780j199608j233215j234703
2963.5C53411217j224785j219025j212730j176453j067810q56285n54275k21749N7564
$$ plain form
2972.2 345935669 346161537 346442528 346708527 346935616 347114639 347224922 347233925 347111206 346828232 346347389
2981.8 346347389 345621605 344616165 343332787 341798897 340031052 338003235 335649529 332892075
2989.6 332892075 329689102 326117554 322494774 319454479 317839966 318362217 321187515 325752182
2997.3 325752182 330979347 335769272 339425850 341770821 342974014 343321533 343088303 342513924 341788254
3006 341788254 341020660 340235672 339425964 338618088 337881660 337283287 336842537 336533585 336315651 336154785
3015.6 336154785 336024132 335901070 335770302 335619316 335422897 335131683 334685287 334035912 333158646 332048645
3025.2 332048645 330722580 329234352 327676888 326149292 324713631 323391838 322209854 321240120
3033 321240120 320580597 320285721 320320702 320588226 320993385 321473770 321975746 322429466 322776527 323025589
$$ packed form
2972.2C45935669K25868K80991K65999K27089J79023J10283R003j22719k82974m80843
2981.8C46347389p25784j005440j283378j533890j767845k027817k353706k757454
2989.6C32892075l202973l571548l622780l040295j614513N22251K825298M564667
2997.3C25752182N227165M789925L656578K344971J203193L47519k33230n74379p25670
3006C41788254p67594p84988q09708q07876p36428n98373m40750l08952k17934j60866
3015.6C36154785j30653j23062j30768j50986j96419k91214m46396o49375q77266j110001
3025.2C32048645j326065j488228j557464j527596j435661j321793j181984r69734
3033C21240120o59523k94876L4981K67524M05159M80385N01976M53720L47061K49062
$$ plain form
3042.6 323025589 323264580 323596649 324058533 324606133 325177650 325756607 326356888 326954613 327466507 327840843
3052.2 327840843 328199310 328879356 330287552 332638969 335778198 339231110 342457085 345107307 347109795
3060.9 347109795 348560219 349565926 350206757 350629044 351140137 352153931 353983688 356634026 359766541
3069.6 359766541 362873001 365535164 367587242 369099159 370237083 371133842 371852646 372433014 372935829
3078.3 372935829 373430138 373934631 374390984 374719200 374929085 375186958 375754662 376823959 378369102
3087 378369102 380139694 381804047 383129730 384065628 384692078 385112724 385391235 385563393 385672455
3095.6 385672455 385776749 385922852 386121483 386355820 386602974 386846924 387074203 387268829 387417145 387516823
3105.3 387516823 387575798 387600861 387589569 387532310 387421761 387257042 387040291 386770210 386442184 386057892
$$ packed form
3042.6C23025589K38991L32069M61884N47600N71517N78957O00281N97725N11894L74336
3052.2C27840843L58467O80046J408196K351417L139229L452912L225975K650222K002488
3060.9C47109795J450424J005707O40831M22287N11093J013794J829757K650338L132515
3069.6C59766541L106460K662163K052078J511917J137924Q96759P18804N80368N02815
3078.3C72935829M94309N04493M56353L28216K09885K57873N67704J069297J545143
3087C78369102J770592J664353J325683R35898O26450M20646K78511J72158J09062
3095.6C85672455J04294J46103J98631K34337K47154K43950K27279J94626J48316R9678
3105.3C87516823N8975K5063j1292n7259j10549j64719k16751k70081l28026l84292
$$ plain form
3114.9 386057892 385636978 385220490 384857903 384581528 384385414 384225388 384043617 383803940 383515320 383231812
3124.6 383231812 383030128 382974396 383085556 383328667 383628426 383909874 384137802 384331360 384544182 384828300
3134.2 384828300 385206108 385664940 386166878 386664696 387115173 387488365 387770195 387956390 388045387 388037643
3143.9 388037643 387944107 387791634 387614174 387432709 387238464 386995316 386657181 386191750 385596542 384904327
3153.5 384904327 384177246 383487778 382893562 382416458 382036972 381706924 381374054 381005096 380598068 380176582
3163.1 380176582 379768372 379383430 379013710 378656693 378338928 378105736 377979622 377925491 377867508 377746353
3172.8 377746353 377564583 377375450 377233963 377166290 377181015 377293739 377518044 377827988 378146095 378386269
3182.4 378386269 378517799 378585320 378662949 378791351 378957176 379121017 379253082 379338379 379363632 379315948
$$ packed form
3114.9C86057892m20914m16488l62587k76375j96114j60026j81771k39677k88620k83508
3124.6C83231812k01684n5732J11160K43111K99759K81448K27928J93558K12822K84118
3134.2C84828300L77808M58832N01938M97818M50477L73192K81830J86195Q8997p744
3143.9C88037643r3536j52473j77460j81465j94245k43148l38135m65431n95208o92215
3153.5C84904327p27081o89468n94216m77104l79486l30048l32870l68958m07028m21486
3163.1C80176582m08210l84942l69720l57017l17765k33192j26114n4131n7983j21155
3172.8C77746353j81770j89133j41487o7673J4725J12724K24305L09944L18107K40174
3182.4C78386269J31530O7521P7629J28402J65825J63841J32065Q5297K5253m7684
$$ plain form
3192.1 379315948 379197273 379029732 378837662 378625679 378383789 378114624 377848587 377621422 377437897 377264519
3201.7 377264519 377064934 376837578 376613693 376414833 376219368 375978394 375665283 375304184 374948959 374636917
3211.4 374636917 374370842 374141922 373959503 373849831 373824921 373861237 373911514 373932762 373902206 373815498 373681908
3222 373681908 373524666 373367424 373208313 373006516 372716331 372343750 371964989 371667213 371460609 371257820 370948257
3232.6 370948257 370504265 370009041 369584732 369294052 369107475 368951759 368775406 368572350 368360023 368153534
3242.2 368153534 367959785 367782898 367625008 367485733 367372208 367309723 367336159 367472687 367695541 367940674
3251.9 367940674 368138428 368250618 368277893 368240929 368161736 368059998 367958488 367878265 367821579 367762146 367661285
3262.5 367661285 367499733 367295685 367087784 366893997 366685448 366402969 366007423 365519600 365015144 364576759
$$ packed form
3192.1C79315948j18675j67541j92070k11983k41890k69165k66037k27165j83525j73378
3201.7C77264519j99585k27356k23885j98860j95465k40974l13111l61099l55225l12042
3211.4C74636917k66075k28920j82419j09672k4910L6316N0277K1248l0556q6708j33590
3222C73681908j57242Tj59111k01797k90185l72581l78761k97776k06604k02789l09563
3232.6C70948257m43992m95224m24309k90680j86577j55716j76353k03056k12327k06489
3242.2C68153534j93749j76887j57890j39275j13525o2485K6436J36528K22854K45133
3251.9C67940674J97754J12190K7275l6964p9193j01738j01510q0223n6686n9433j00861
3262.5C67661285j61552k04048k07901j93787k08549k82479l95546m87823n04456m38385
$$ plain form
3272.1 364576759 364242058 363985329 363739128 363432541 363024178 362520218 361976433 361479912 361105080 360867462
3281.8 360867462 360711136 360551453 360343704 360114899 359928322 359814034 359734154 359616165 359416542 359148674
3291.4 359148674 358851433 358541527 358200760 357811241 357389374 356979065 356610184 356270599 355920448 355528946
3301 355528946 355090714 354607658 354069443 353468399 352838326 352263603 351822586 351506119 351192589 350726013
3310.7 350726013 350040588 349220467 348434792 347799797 347292747 346788521 346176376 345445900 344673653 343941460
3320.3 343941460 343275108 342650566 342036285 341413422 340759277 340035973 339216690 338323975 337421455 336551132
3330 336551132 335680466 334728966 333659935 332537880 331479797 330542488 329665108 328730659 327684975
3338.7 327684975 326589203 325559578 324665642 323888130 323164024 322450409 321743050 321047783 320356903
$$ packed form
3272.1C64576759l34701k56729k46201l06587m08363n03960n43785m96521l74832k37618
3281.8C60867462j56326j59683k07749k28805j86577j14288p9880j17989j99623k67868
3291.4C59148674k97241l09906l40767l89519m21867m10309l68881l39585l50151l91502
3301C55528946m38232m83056n38215o01044o30073n74723m41017l16467l13530m66576
3310.7C50726013o85425q20121p85675o34995n07050n04226o12145p30476p72247p32193
3320.3C43941460o66352o24542o14281o22863o54145p23304q19283q92715r02520q70323
3330C36551132q70666r51500j069031j122055j058083r37309q77380r34449j045684
3338.7C27684975j095772j029625q93936p77512p24106p13615p07359o95267o90880
$$ plain form
3347.3 320356903 319655743 318940105 318211708 317454605 316629086 315699272 314669971 313594894 312539711
3356 312539711 311534939 310558681 309563332 308513794 307405949 306257954 305097275 303959923 302887917
3364.7 302887917 301909714 301015148 300158672 299303665 298467598 297720089 297127914 296706753 296428585 296272736
3374.3 296272736 296258488 296420193 296755714 297203312 297672081 298099480 298485260 298883419 299359550 299944687
3384 299944687 300618954 301336689 302070332 302826633 303613701 304397526 305107918 305701294 306213207 306730270
3393.6 306730270 307303371 307895603 308424454 308851128 309218044 309600105 310032501 310493393 310944653 311370506
3403.3 311370506 311772118 312140846 312452621 312694950 312893944 313112812 313425102 313881836 314494610 315240421
3412.9 315240421 316089230 317033176 318090534 319274158 320549469 321828232 323013687 324061241 325002289
$$ packed form
3347.3C20356903p01160p15638p28397p57103q25519r29814j029301j075077j055183
3356C12539711j004772r76258r95349j049538j107845j147995j160679j137352j072006
3364.7C02887917r78203q94566q56476q55007q36067p47509n92175m21161k78168j55849
3374.3B96272736j4248J61705L35521M47598M68769M27399L85780L98159M76131N85137
3384B99944687O74267P17735P33643P56301P87068P83825P10392N93376N11913N17063
3393.6C06730270N73101N92232N28851M26674L66916L82061M32396M60892M51260M25853
3403.3C11370506M01612L68728L11775K42329J98994K18868L12290M56734O12774P45811
3412.9C15240421Q48809R43946J057358J183624J275311J278763J185455J047554R41048
$$ plain form
3421.6 325002289 325908356 326827164 327736702 328551865 329176178 329569969 329789352 329964142 330221214 330604973
3431.2 330604973 331057930 331472893 331774483 331962700 332094955 332236824 332423515 332654572 332908020 333161278
3440.9 333161278 333402557 333628082 333825569 333964233 334013557 333984528 333952942 334020233 334232712 334531746
3450.5 334531746 334791374 334915924 334908752 334851837 334826584 334855728 334910316 334952354 334963799 334947319 334919205
3461.1 334919205 334908066 334944611 335036392 335155029 335256462 335324478 335383949 335470505 335590706 335719490 335830154
3471.7 335830154 335912666 335964355 335984039 335995522 336065445 336260681 336566925 336860199 336997948 336955338 336864548
3482.3 336864548 336899223 337115211 337406044 337612381 337662773 337608223 337542534 337514534 337518120 337543259 337607460
3493 337607460 337734375 337917137 338118286 338306580 338486633 338689270 338928452 339171638 339353600 339432220
$$ packed form
3421.6C25002289R06067R18808R09538Q15163O24313L93791K19383J74790K57072L83759
3431.2C30604973M52957M14963L01590J88217J32255J41869J86691K31057K53448K53258
3440.9C33161278K41279K25525J97487J38664M9324k9029l1586O7291K12479K99034
3450.5C34531746K59628J24550p172n6915k5253K9144N4588M2038J1445j6480k8114
3461.1C34919205j1139L6545R1781J18637J01433O8016N9471Q6556J20201J28784J10664
3471.7C35830154Q2512N1689J9684J1483O9923J95236L06244K93274J37749m2610r0790
3482.3C36864548L4675K15988K90833K06337N0392n4550o5689k8000L586K5139O4201
3493C37607460J26915J82762K01149J88294J80053K02637K39182K43186J81962P8620
$$ plain form
3502.6 339432220 339441223 339484978 339664726 339988708 340344734 340572433 340584030 340434227 340281792 340277252 340464973
3513.2 340464973 340769234 341060371 341245461 341322136 341367912 341478081 341696091 341987038 342273102 342499733
3522.9 342499733 342677193 342860641 343091164 343357506 343613815 343835487 344050865 344316673 344659843 345038376
3532.5 345038376 345363770 345563965 345636787 345651131 345700111 345848007 346110039 346468468 346888580 347314224
3542.1 347314224 347654076 347807350 347736588 347534218 347400169 347514839 347898598 348386497 348754997 348896828
3551.8 348896828 348892097 348920135 349106369 349444008 349835396 350185432 350455894 350666275 350881920 351199875
3561.4 351199875 351699715 352349701 352950325 353219337 353003159 352443123 351921997 351802902 352180901 352863350
3571.1 352863350 353569984 354144974 354592590 354963608 355261803 355469246 355615654 355771980 355976715 356210327
$$ packed form
3502.6C39432220R003M3755J79748L23982L56026K27699J1597j49803j52435m540J87721
3513.2C40464973L04261K91137J85090P6675M5776J10169K18010K90947K86064K26631
3522.9C42499733J77460J83448K30523K66342K56309K21672K15378K65808L43170L78533
3532.5C45038376L25394K00195P2822J4344M8980J47896K62032L58429M20112M25644
3542.1C47314224L39852J53274p0762k02370j34049J14670L83759M87899L68500J41831
3551.8C48896828m731K8038J86234L37639L91388L50036K70462K10381K15645L17955
3561.4C51199875M99840O49986O00624K69012k16178n60036n21126j19095L77999O82449
3571.1C52863350P06634N74990M47616L71018K98195K07443J46408J56326K04735K33612
$$ plain form
3580.7 356210327 356465759 356804771 357284012 357810211 358131790 358049469 357657585 357339211 357466965 358091965
3590.4 358091965 358924522 359613113 360030632 360304756 360623055 361048698 361510658 361911354 362207642 362411423
3600 362411423 362571030 362777557 363151512 363758430 364503937 365135727 365407219 365290604 365035057 364984550
3609.6 364984550 365298805 365838051 366325569 366621628 366816483 367053757 367310944 367419128 367310524 367176819
3619.3 367176819 367305870 367774811 368388596 368960457 369575729 370453110 371530380 372309265 372251129 371353188
3628.9 371353188 370256844 369719200 369979057 370645714 371161957 371310654 371287651 371384201 371684608 372051544
3638.6 372051544 372317886 372444305 372522049 372666817 372913055 373177948 373313370 373194427 372775307 372087135
3648.2 372087135 371237602 370455742 370087852 370416603 371375771 372464867 373069801 372960320 372478943
$$ packed form
3580.7C56210327K55432L39012M79241N26199L21579q2321l91884l18374J27754O25000
3590.4C58091965Q32557O88591M17519K74124L18299M25643M61960M00696K96288K03781
3600C62411423J59607K06527L73955O06918P45507O31790K71492j16615k55547n0507
3609.6C64984550L14255N39246M87518K96059J94855K37274K57187J08184j08604j33705
3619.3C67176819J29051M68941O13785N71861O15272Q77381J077270P78885n8136q97941
3628.9C71353188j096344n37644K59857O66657N16243J48697k3003R6550L00407L66936
3638.6C72051544K66342J26419P7744J44768K46238K64893J35422j18943m19120o88172
3648.2C72087135q49533p81860l67890L28751R59168J089096O04934j09481m81377
$$ plain form
3656.9 372478943 372208405 372457886 373071518 373675690 374017525 374075890 373977470 373909225 374042206 374373550
3666.5 374373550 374604645 374327583 373489418 372618065 372386665 372855492 373264160 372753677 371316833
3675.2 371316833 369915390 369582367 370459061 371768494 372657547 372946930 373074112 373481255 374190292
3683.9 374190292 374899139 375299416 375229797 374654083 373670387 372577972 371821747 371741753 372326279 373210945
3693.5 373210945 373933640 374229889 374155579 373982086 373956337 374094276 374176559 373977394 373531723 373158531
3703.2 373158531 373178596 373610687 374174042 374577637 374743462 374726562 374505997 373985329 373225174 372565460
3712.8 372565460 372401657 372823219 373526039 374093437 374315300 374226265 373927879 373486595 373000031 372640877
3722.5 372640877 372530098 372589264 372607727 372483902 372352600 372428322 372753716 373147011 373385811 373382149
$$ packed form
3656.9C72478943k70538K49481O13632O04172L41835N8365r8420o8245J32981L31344
3666.5C74373550K31095k77062q38165q71353k31400M68827M08668n10483j436844
3675.2C71316833j401443l33023Q76694J309433Q89053K89383J27182M07143P09037
3683.9C74190292P08847M00277o9619n75714r83696j092415p56225p9994N84526Q84666
3693.5C73210945P22695K96249p4310j73493k5749J37939Q2283j99165m45671l73192
3703.2C73158531K0065M32091N63355M03595J65825j6900k20565n20668p60155o59714
3712.8C72565460j63803M21562P02820N67398K21863q9035k98386m41284m86564l59154
3722.5C72640877j10779N9166J8463j23825j31302P5722L25394L93295K38800l662
$$ plain form
3732.1 373382149 373167343 372774353 372209015 371536179 370931587 370617714 370754929 371376915 372344284 373296356
3741.8 373296356 373715515 373226662 371977654 370696068 370202217 370726585 371679192 372147713 371673355
3750.4 371673355 370583115 369628410 369357758 369802399 370616188 371372108 371744766 371589546 371024017
3759.1 371024017 370430756 370237427 370572319 371140709 371501503 371478386 371257019 371084938 370958176 370677414
3768.8 370677414 370175667 369684372 369519653 369756966 370185890 370565529 370837402 371052513 371171722 371051903
3778.4 371051903 370652504 370175323 369914284 369958801 370090332 370005531 369629784 369196281 369017334 369186363
3788 369186363 369505081 369695091 369673691 369608917 369692650 369881134 369921455 369676704 369367218 369368896 369712677
3798.7 369712677 369885979 369297447 367988167 366768570 366509094 367285881 368306046 368697891 368299522
$$ packed form
3732.1C73382149k14806l92990n65338o72836o04592l13873J37215O21986R67369R52072
3741.8C73296356M19159m88853j249008j281586m93851N24368R52607M68521m74358
3750.4C71673355j090240r54705k70652M44641Q13789P55920L72658j55220n65529
3759.1C71024017n93261j93329L34892N68390L60794k3117k21367j72081j26762k80762
3768.8C70677414n01747m91295j64719K37313M28924L79639K71873K15111J19209j19819
3778.4C71051903l99399m77181k61039M4517J31531q4801l75747m33503j78947J69029
3788C69186363L18718J90010k1400o4774Q3733J88484M0321k44751l09486J678L43781
3798.7C69712677J73302n88532j309280j219597k59476P76787J020165L91845l98369
$$ plain form
3807.3 368299522 367654076 367358894 367563171 368041916 368518295 368774529 368604317 367945290 367129707 366779480
3817 366779480 367209663 367957344 368119545 367284012 366039124 365425682 365898666 366931114 367638931 367665520
3826.6 367665520 367371368 367268372 367454491 367643166 367597389 367386856 367223320 367160683 367029343 366637077
3836.3 366637077 365993156 365334740 364947968 364945450 365183754 365401726 365461121 365456657 365573730 365860176
3845.9 365860176 366190987 366468697 366770859 367187462 367514420 367243500 366010056 364082413 362323532
3854.6 362323532 361564598 361967239 362983208 363903770 364411278 364620628 364698448 364581757 364127350 363461266
3864.2 363461266 363028755 363188629 363774033 364164619 363889198 363141022 362612839 362777977 363397408 363815804
3873.9 363815804 363718071 363469276 363632050 364229698 364649887 364336433 363475266 362852402 363015862 363675117
$$ packed form
3807.3C68299522o45446k95182K04277M78745M76379K56234j70212o59027q15583l50227
3817C66779480M30183P47681J62201q35533j244888o13442M72984J032448P07817K6589
3826.6C67665520k94152j02996J86119J88675m5777k10533j63536o2637j31340l92266
3836.3C66637077o43921o58416l86772k518K38304K17972N9395m464J17073K86446
3845.9C65860176L30811K77710L02162M16603L26958k70920j233444j927643j758881
3854.6C62323532p58934M02641J015969R20562N07508K09350P7820j16691m54407o66084
3864.2C63461266m32511J59874N85404L90586k75421p48176n28183J65138O19431M18396
3873.9C63815804r7733k48795J62774N97648M20189l13454q61167o22864J63460O59255
$$ plain form
3883.5 363675117 364011879 363552856 362648430 362069359 362196159 362667923 362805824 362311287 361524353 361055031
3893.2 361055031 361227608 361865730 362523460 362850037 362766647 362408829 361985245 361670647 361536446 361519890
3902.8 361519890 361478882 361331100 361155319 361123848 361314774 361607094 361790581 361773567 361658707 361610641
3912.5 361610641 361672821 361726646 361613770 361280136 360819702 360412483 360220070 360289307 360510254 360665512
3922.1 360665512 360569878 360202866 359726486 359369049 359271164 359408646 359625969 359740944 359657860 359425888
3931.7 359425888 359196587 359097672 359130630 359193077 359200897 359170303 359164963 359186058 359148102 358977280 358714256
3942.3 358714256 358508072 358505440 358736763 359076462 359304237 359242554 358895073 358465347 358205719 358211365
3952 358211365 358360443 358456535 358406944 358254242 358078194 357925377 357828102 357812767 357852707 357859192 357786560
$$ packed form
3883.5C63675117L36762m59023r04426n79071J26800M71764J37901m94537p86934m69322
3893.2C61055031J72577O38122O57730L26577q3390l57818m23584l14598j34201j6556
3902.8C61519890m1008j47782j75781l1471J90926K92320J83487j7014j14860m8066
3912.5C61610641O2180N3825j12876l33634m60434m07219j92413O9237K20947J55258
3922.1C60665512r5634l67012m76380l57437r7885J37482K17323J14975q3084k31972
3931.7C59425888k29301r8915L2958O2447P820l0594n340K1095l7956j70822k63024
3942.3C58714256k06184k632K31323L39699K27775o1683l47481m29726k59628N646
3952C58211365J49078R6092m9591j52702j76048j52817r7275j5335L9940O485p2632
$$ plain form
3962.6 357786560 357720222 357785454 357957649 358040390 357875900 357521782 357167130 356920471 356768112 356705055
3972.2 356705055 356764717 356876526 356829872 356510277 356098824 355878487 355853424 355746155 355419121 355088158
3981.9 355088158 354951172 354790039 354259834 353520012 353155251 353287659 353184738 352210197 350889626
3990.6 350889626 350263939 350072479 348581047 345116425 341960869 341471176 339894867 325363846 285331669
3999.2 285331669 218656445
4000.2 218656445
$$ packed form
3962.6C57786560o6338O5232J72195Q2741j64490l54118l54652k46659j52359o3057
3972.2C56705055N9662J11809m6654l19595m11453k20337k5063j07269l27034l30963
3981.9C55088158j36986j61133n30205p39822l64761J32408j02921r74541j320571
3990.6C50889626o25687j91460j491432l464622l155556m89693j576309j4531021m0032177
3999.2B85331669o6675224
4000.2B18656445
##END=$$ End of the data block
