##TITLE=$$ Begin of the data block
##JCAMP-DX=5.00 $$ ACD/SpecManager v 10.08
##SPECTROMETER/DATA SYSTEM=Varian
##DATE=30 Apr 2013 09:24:58
##DATA TYPE=INFRARED SPECTRUM
##DATA CLASS=XYDATA
##ORIGIN=
##OWNER=
##NPOINTS=3735
##FIRSTX=399.26403809
##LASTX=4000.35498047
##MAXX=4000.35498047
##MINX=399.26403809
##MAXY=67.06630707
##MINY=16.34502602
##XFACTOR=1.0000000000
##YFACTOR=0.000000100000000
##FIRSTY=42.14837265
##DELTAX=0.96440572
##XUNITS=1/CM
##YUNITS=TRANSMITTANCE
##XYDATA=(X++(Y..Y))
399.3 421483727 549066772 620412025 640531693 638224907 638637810 647489243 657144699 661382370
407 661382370 661593781 661896667 663236542 663784790 662713928 661224365 660331345 659584579 658548126
415.7 658548126 658312836 660443497 664733734 668894806 670663071 669783096 667814407 666452103 666337204
424.3 666337204 667120056 668074799 668511734 667976074 666403275 664082870 661313248 658062057 654075546
433 654075546 649405594 644823151 641630020 640920868 642855148 646548691 650718994 654549484 658003845
441.7 658003845 661358261 664542236 667037354 668356705 668421326 667395172 665360565 662443619 659253006
450.4 659253006 656855698 655983887 656223450 656144791 654336166 650289841 644334488 636964340 628543434
459.1 628543434 619752350 612123337 607805290 608500824 614396973 623947144 634634514 644124680
466.8 644124680 651095505 655428696 657872162 659453278 660896683 662292023 663198090 663134537 662089920
475.5 662089920 660621109 659475632 659110947 659518433 660390778 661364288 662143173 662541428 662512131 662110672
485.1 662110672 661370697 660254974 658813400 657349396 656252670 655540390 654639130 652809143 649860916
493.8 649860916 646388474 643242645 640839996 639056168 637709236 636951828 637081223 638038979 639227180
502.5 639227180 639867668 639530144 638331451 636678238 634828835 632652664 629774323 625957909 621357269
511.1 621357269 616342888 611040230 605067635 597791862 588842125 578348503 566782188 554845428
518.9 554845428 543739166 535393333 531905975 534188309 540917664 548957672 555136642 557974243
526.6 557974243 558040085 556972885 556302605 557010460 559723969 564863319 572428017 581773262 591793671
535.2 591793671 601428375 610032539 617357826 623319969 627872276 631055260 633054161 634137878
543 634137878 634549599 634472160 634071808 633521538 632954102 632388649 631700363 630652542 628989792 626585770
552.6 626585770 623586159 620418053 617578621 615308838 613409958 611375160 608730125 605295448
560.3 605295448 601185265 596615372 591743317 586652031 581411133 576093407 570726280 565263481
568 565263481 559638367 553854027 548014069 542257919 536671562 531267929 526048241 521074219 516471138
576.7 516471138 512374878 508900414 506178589 504423943 503947830 505072556 507992363 512672958 518860016
585.4 518860016 526192207 534334679 543027916 552013206 560923767 569292412 576727562 583129120
593.1 583129120 588732681 593908081 598866501 603509293 607520485 610581093 612509460 613222771 612594223
601.8 612594223 610390015 606450844 601094589 595456543 591364021 590590286 593861694 600343361 608053474
610.5 608053474 614930611 619740219 622231255 622677269 621395187 618620949 614596596 609593773 603922043
619.2 603922043 598149529 593411255 591239891 592617035 596879349 601667519 604370804 604042358 602093430
627.8 602093430 601096840 602773399 606912804 611954613 616395912 619682808 622072830 623992348 625624809
636.5 625624809 626931648 627838936 628334122 628467598 628323975 627971382 627381363 626360779 624541473
645.2 624541473 621446304 616681252 610310173 603277054 597456970 594984894 597087898 603238945
652.9 603238945 611361923 618996620 624555283 627801552 629415855 630212479 630664253 630941048 631176758
661.6 631176758 631564598 632154999 632618446 632349968 630971909 628801727 626755981 625661545 625581093
670.3 625581093 625790634 625387535 623904343 621420746 618310890 615090446 612479630 611340370 612249222
678.9 612249222 615016670 618689537 622127075 624645348 626188126 627011566 627313538 627158241 626625633
687.6 626625633 625911255 625239182 624701233 624197578 623527412 622533112 621170654 619459915 617393303
696.3 617393303 614915123 611986351 608616562 604770241 600265732 594917450 588955116 583358154
704 583358154 579645767 579108238 582046089 587644997 594546394 601568108 608007431 613478279 617663078
712.7 617663078 620292664 621310463 620974464 619774780 618239326 616740456 615367393 613912239 612011719
721.4 612011719 609402847 606130600 602564354 599240570 596673698 595225372 595002289 595764465 596926842
730.1 596926842 597726936 597481880 595743790 592260361 586831551 579210129 569131775 556542015
737.8 556542015 542068176 527568970 516219482 511583672 515837059 528264580 545305099 562331543
745.5 562331543 575935707 585116806 590803146 594491730 597207146 599302406 600783882 601636200
753.2 601636200 601945267 601897469 601726341 601610870 601585426 601561775 601452637 601256256 601007195 600679474
762.8 600679474 600191803 599509430 598701477 597861366 596981812 595936050 594590492 592919769 591004906
771.5 591004906 588927574 586678734 584172592 581341667 578211555 574878464 571413689 567793159
779.2 567793159 563908424 559628525 554842567 549472847 543497810 536978149 530029755 522738762
787 522738762 515111122 507117805 498729744 489831924 480183296 469789467 459691429 452446404
794.7 452446404 451369553 458537140 472897835 490165367 504859390 513073769 513993187 509374466
802.4 509374466 501883049 493758659 486496429 481137772 478464127 478868523 482200661 487875481 495196190
811.1 495196190 503623619 512827797 522569542 532553596 542347183 551391716 559107704 565049858
818.8 565049858 569010849 570986328 571033897 569171066 565396652 559741631 552212753 542668266 530827904
827.5 530827904 516469727 499583626 480312309 458947182 436400414 414924774 398033600
834.2 398033600 388896141 388122902 393110352 400123863 407587929 417476463 433284569 456399841
841.9 456399841 484259109 511824150 534726753 551267281 562096062 568631172 571800728 571709480
849.6 571709480 567994766 560638390 551016121 542445526 539270477 544540749 557907829 575602989
857.4 575602989 592701607 605867996 614516869 619949112 623719559 626684265 629064255 630899696
865.1 630899696 632274513 633263092 633867035 634076614 633956909 633649025 633299637 632997398 632759171 632556801
874.7 632556801 632352219 632119942 631845779 631518555 631137772 630729866 630347099 630035706 629805260 629626122
884.4 629626122 629447327 629206505 628835640 628287544 627572746 626759491 625916290 625055542 624151993 623219528
894 623219528 622350655 621653786 621147003 620723839 620233078 619594040 618837738 618048248 617280273 616536407
903.7 616536407 615811119 615134621 614556160 614079819 613627625 613082237 612372169 611510658 610558205 609568672
913.3 609568672 608587036 607667198 606817932 605886726 604553261 602560806 600054703 597673569 596201630
922 596201630 596020508 596839447 597943420 598704529 598898582 598634186 598098946 597406654 596607475 595729332
931.6 595729332 594770164 593701248 592522888 591301384 590109787 588932304 587664452 586220016 584608917
940.3 584608917 582893524 581091919 579156723 577027283 574650917 571948547 568832283 565343361
948 565343361 561794968 558742676 556766968 556250954 557302246 559788513 563364372 567472305 571416321
956.7 571416321 574560471 576547928 577385712 577346153 576777954 575957565 575043373 574102325 573137321 572083244
966.3 572083244 570810242 569201508 567292061 565343475 563744240 562783966 562485428 562618980 562835503
975 562835503 562787781 562212067 561012383 559320908 557434273 555620270 553968658 552422905 550910034
983.7 550910034 549387970 547788353 546012955 544030762 541918526 539746094 537464714 534994850
991.4 534994850 532392921 529794884 527133293 524027176 520075989 515228844 509752502 503866920
999.1 503866920 497549324 490613823 482573586 472126465 457147980 436180916 410798149 386566772
1006.8 386566772 371001396 369650421 383359871 408595467 439819870 471572266 499234428
1013.6 499234428 519344368 530336494 533155098 530629311 525710945 520018272 513795624 506857529
1021.3 506857529 499266663 491220665 482688828 473427238 463290787 452393417 441045532 429795876
1029 429795876 419696312 412437477 409968147 413680344 423661461 438477631 455614014 472362823
1036.7 472362823 486743546 498007507 506489372 512991486 518193283 522442284 525868454 528519707
1044.5 528519707 530371475 531325607 531320343 530464020 529023056 527264175 525324440 523223038 520938950
1053.1 520938950 518429451 515595627 512299576 508450737 504042320 499049568 493301506 486553383
1060.9 486553383 478833199 470817680 463838234 459344711 458106613 459714432 462757454 465534630
1068.6 465534630 466767578 465853996 462633667 457025299 448915939 438430901 426404419 414701614
1076.3 414701614 406044312 403203163 407821350 419512100 435859032 453417625 469132614 481327477
1084 481327477 489812775 495306396 498720589 500733261 501716957 501867981 501356316 500387192 499149628
1092.7 499149628 497718315 496024666 493952065 491474915 488702850 485793037 482839050 479843864
1100.4 479843864 476755829 473476181 469829826 465580750 460531311 454598618 447767868 439969673
1108.1 439969673 431043930 420845680 409382973 396919746 384152985 372545853 364525795 362989998
1115.8 362989998 369945335 385008011 404984589 425131798 441353493 451804390 456929321 458307266
1123.5 458307266 457467308 455459633 453012238 450658989 448594627 446538925 443918762 440262222
1131.2 440262222 435448112 429642944 423094330 416010208 408557472 400864716 392986565 384893417
1139 384893417 376526146 367846794 358820457 349368782 339379921 328783913 317620907 306063023
1146.7 306063023 294428005 283222065 273177547 265220966 260357037 259495411 263243923 271705875
1154.4 271705875 284375458 300228500 317980671 336359711 354273071 370893478 385717010
1161.1 385717010 398546753 409338646 418019409 424483070 428760223 431084557 431697197 430654869
1168.9 430654869 427954750 423738785 418001022 409905396 397896690 381507645 363720589 351092644
1176.6 351092644 350177002 362506218 382671814 401809692 413809624 418906479 421846771 426928978
1184.3 426928978 434663200 442491722 447893562 450534439 451922379 453687630 456382980 459533272
1192 459533272 462344742 464269447 465159149 465162621 464544258 463524323 462213554 460657234 458901672
1200.7 458901672 456995277 454955215 452789726 450567398 448425980 446482162 444738197 443092232
1208.4 443092232 441416054 439597969 437533951 435144157 432443047 429578743 426757011 424100685
1216.1 424100685 421576195 419042282 416350822 413402863 410147400 406565857 402668686 398492088
1223.8 398492088 394078407 389455719 384629860 379587746 374304848 368754921 362933121 356895828
1231.5 356895828 350806351 344952927 339676781 335190125 331360855 327629776 323167152 317195568
1239.3 317195568 309275894 299428883 288145218 276389980 265556164 257194424 252475719 251659927
1247 251659927 253982887 258107224 262824955 267492428 271934757 276020603 279335155 281205502 280986557
1255.7 280986557 278330135 273260269 266070232 257162704 246919765 235640125 223560047 210957699
1263.4 210957699 198287849 186255074 175772705 167844601 163450260 163463249 168568573 179139938
1271.1 179139938 195108643 215892010 240425053 267290287 294919224 321834602 346878052
1277.8 346878052 369332924 388889122 405492592 419197617 430111084 438412743 444358673 448212624
1285.5 448212624 450152130 450262146 448681412 445820770 442457085 439542313 437780952 437250977 437366180
1294.2 437366180 437226601 436103668 433733025 430293655 426212463 421967850 417931557 414201546
1301.9 414201546 410484924 406218987 401007690 395136452 389728203 386296921 385930023 388650513
1309.7 388650513 393396797 398596115 402912674 405712814 407067070 407429924 407268143 406839409 406170731
1318.3 406170731 405171776 403773537 401999245 399942513 397701149 395342140 392920036 390497780
1326 390497780 388118172 385746841 383265724 380551682 377572060 374402809 371151237 367866669 364517937
1334.7 364517937 361030769 357323418 353315506 348941803 344186707 339098129 333735542 328081970
1342.4 328081970 322012367 315363026 308035831 300036430 291425209 282262516 272623234 262661877
1350.2 262661877 252644024 242915401 233856831 225884876 219472885 215113201 213207703 213963528
1357.9 213963528 217383823 223332558 231568203 241690865 253081207 264954720 276548748 287311440
1365.6 287311440 296950397 305332451 312361736 317961464 322165642 325209961 327518768 329563026
1373.3 329563026 331668663 333887405 336003494 337666817 338566589 338550339 337647934 336019478 333871155
1382 333871155 331372185 328595276 325503883 321992531 317953625 313334274 308155022 302487354 296387024
1390.7 296387024 289808388 282579823 274539757 265808372 256991405 249082413 243056583 239438400
1398.4 239438400 238164043 238787899 240796700 243775635 247399120 251378975 255469093 259498577
1406.1 259498577 263377209 267076550 270615368 274039001 277383175 280652084 283846817 287006912
1413.8 287006912 290179863 293328400 296307964 299000492 301501064 304137039 307251072 310925179
1421.5 310925179 314898472 318735886 322083893 324812202 326976128 328686142 330005608 330947952
1429.2 330947952 331555901 331950722 332245407 332348442 331874924 330365868 327732391 324546089 321844482
1437.9 321844482 320546989 320950508 322694969 325133057 327695465 329960518 331520424 331944771 330964890
1446.6 330964890 328702698 325699577 322713623 320457726 319434433 319854584 321565704 324023666
1454.3 324023666 326439018 328128204 328885117 329118805 329669075 331440697 335052452 340599174 347558022
1463 347558022 354904556 361485786 366499481 369758339 371528664 372110786 371572609 369858704 367068291
1471.7 367068291 363528633 359557686 355189323 350169868 344223061 337318687 329741058 321995735
1479.4 321995735 314708748 308573265 304312458 302656593 304350796 310096817 320240097 334207306
1487.1 334207306 350115891 365103035 376423264 382607002 383784294 380979195 375121498 366669846
1494.8 366669846 355960693 343591843 330276566 316420135 302080917 287417717 272947178
1501.6 272947178 259061050 245264587 230239334 213137112 195123119 179646358 170927353
1508.3 170927353 171700211 181815453 198500652 217823277 236308517 251925735 264227009 273832111
1516 273832111 281649799 288263607 293761368 297956409 300677834 301845856 301346836 298942337 294381313
1524.7 294381313 287638512 279055386 269247589 258852177 248328094 237966328 228076591 219161434
1532.4 219161434 211924496 207145710 205570831 207869434 214533863 225598297 240308113 257073956
1540.1 257073956 273906345 289116306 301801128 311802692 319271908 324271889 326733398 326703682
1547.9 326703682 324564629 320963516 316519985 311604786 306403446 301174831 296406689 292696495
1555.6 292696495 290488358 289940472 291034012 293789368 298405857 305271320 314876652 327642059
1563.3 327642059 343653564 362432747 382943039 403886642 424097137 442761040 459400978
1570 459400978 473752785 485649986 494922523 501320724 504574661 504622002 501814957 496828957 490269928
1578.7 490269928 482305641 472644043 460804749 446359901 428953590 408281708 384368095 358212051
1586.4 358212051 332425270 311204586 299181175 299373627 311303005 330598793 350665627 365544167
1594.1 365544167 372183189 370821953 363683624 353294449 341576080 329830818 319036026 309986210
1601.9 309986210 303295631 299425278 298715477 301326065 307138157 315773411 326734543 339493828
1609.6 339493828 353443451 367863159 382086449 395786285 409078293 422275124 435487556
1616.3 435487556 448439980 460659180 471839371 482036629 491530609 500513382 508906288 516468201
1624 516468201 523065262 528829651 534064026 539023209 543801956 548392410 552764626 556834183 560393944
1632.7 560393944 563188553 565135193 566463356 567578850 568745270 569885330 570687408 570902405 570557556
1641.4 570557556 569920311 569265785 568640976 567838669 566662483 565298119 564391747 564573021 565721817
1650.1 565721817 566725159 566176605 563523140 559556923 555686417 552668495 550048065 546764221
1657.8 546764221 542126656 536107330 528863106 520318260 510376434 499348564 487831116 476029854
1665.5 476029854 463343315 448806000 432007828 413578453 394839211 377056198 360952377
1672.3 360952377 346737289 334521942 324858246 319063530 318923512 325714531 339217377 357691574
1680 357691574 378983765 401732025 425465546 449638405 472871742 493395195 510215111 523694153
1687.7 523694153 534966927 544923630 553771629 561322823 567411385 572032242 575345917 577728233
1695.4 577728233 579690132 581524277 583009033 583640099 583257484 582343788 581583557 581173058 580706177
1704.1 580706177 579754982 578413353 577171364 576340141 575747490 575003471 573929634 572648201 571333694
1712.8 571333694 570004539 568565216 566961060 565247002 563566170 562108650 561037941 560353012
1720.5 560353012 559805374 559045296 557929649 556665535 555584908 554768066 553955956 552866058 551539421
1729.1 551539421 550289955 549312325 548432465 547329254 545975151 544759865 544119911 544076004 544192543
1737.8 544192543 543993874 543375664 542604446 541978340 541556892 541199913 540779419 540292816 539804611 539348679
1747.5 539348679 538913345 538485527 538078995 537733612 537501869 537418365 537451706 537499504 537473373 537400131
1757.1 537400131 537393684 537494049 537566948 537430229 537089195 536787949 536779671 537068977 537431412 537681847
1766.8 537681847 537857933 538108368 538458023 538764572 538922577 539045410 539391098 540118256 541144753
1775.4 541144753 542237511 543197479 543949318 544506798 544917793 545253258 545610962 546088982 546754646
1784.1 546754646 547643547 548770256 550104790 551532249 552868195 553962708 554818268 555605125 556547127
1792.8 556547127 557768936 559227905 560764084 562203445 563431702 564413071 565180054 565821075 566459007
1801.5 566459007 567212372 568153229 569294930 570615387 572082253 573650475 575247536 576789169 578232079
1810.2 578232079 579607620 580988503 582410202 583826065 585139008 586269569 587192497 587932167 588553009
1818.8 588553009 589154816 589842186 590658569 591551094 592425041 593240967 594035454 594829025 595540848 596048431
1828.5 596048431 596347351 596618233 597090225 597828598 598670845 599366684 599751740 599784775 599482384 598908272
1838.1 598908272 598252144 597856865 598073883 599038734 600580978 602357101 604061241 605527954 606693954
1846.8 606693954 607539635 608093224 608450623 608733597 609005013 609234772 609354935 609335747 609199600 608980026
1856.4 608980026 608693962 608362923 608039360 607787590 607633667 607540359 607431908 607231979 606873283 606291466
1866.1 606291466 605447960 604385796 603256645 602256508 601496849 600929031 600412712 599882774 599456902
1874.8 599456902 599366913 599768524 600609131 601670456 602722015 603627930 604331245 604793854 604995499
1883.4 604995499 604979286 604843521 604650116 604356689 603877678 603224297 602552414 602034912 601686897 601338921
1893.1 601338921 600794983 600005913 599082375 598164597 597305069 596469765 595607300 594686623 593687553 592610550
1902.7 592610550 591519203 590551224 589849358 589463196 589328995 589346619 589467468 589704819 590070534 590515175
1912.4 590515175 590917473 591118050 590977478 590455132 589668884 588867187 588284988 587974434 587770233 587434540
1922 587434540 586853714 586101418 585328979 584615288 583926468 583188019 582365952 581476746 580553551 579623833
1931.7 579623833 578702202 577772865 576776428 575650101 574419060 573246536 572361412 571904907 571836739
1940.3 571836739 571986961 572190514 572366371 572485237 572500954 572347336 572004051 571540413 571075401 570682564
1950 570682564 570331802 569922028 569368057 568669434 567907715 567185097 566552773 565984726 565415115 564801636
1959.6 564801636 564159470 563536377 562956619 562387733 561759567 561016464 560159874 559257469 558409767 557694969
1969.3 557694969 557116814 556596146 556025620 555348892 554603500 553885155 553271942 552777367 552365074 551990967
1978.9 551990967 551628685 551264076 550882225 550465202 549995499 549465942 548895760 548338051 547857704 547477341
1988.6 547477341 547142029 546754150 546261253 545711517 545217285 544858398 544624100 544445038 544270248 544105492
1998.2 544105492 543982048 543902245 543821373 543677597 543436165 543109512 542742119 542380714 542052460 541760826
2007.8 541760826 541495514 541243362 540997009 540757713 540526657 540292282 540021667 539678230 539260902 538832283
2017.5 538832283 538495369 538323593 538299332 538317909 538255730 538046417 537703018 537279091 536811333 536294746
2027.1 536294746 535704193 535034561 534311104 533557091 532750092 531821671 530710258 529414825 527994461
2035.8 527994461 526512947 524992943 523420868 521781960 520078087 518322258 516536102 514757729
2043.5 514757729 513034935 511395950 509831161 508315735 506842461 505421028 504047623 502696266
2051.2 502696266 501348534 500015411 498721504 497482796 496312256 495229568 494232597 493266258 492259407
2059.9 492259407 491203957 490157547 489142609 488087921 486929703 485728264 484577255 483381271
2067.6 483381271 481879578 480029335 478244591 476944351 475735512 473359947 468992653 463846321
2075.4 463846321 461210594 464341850 473879013 487189445 500276260 510456238 517499008 522683640
2083.1 522683640 527175827 531296616 534892235 537917366 540540733 542907372 545021248 546856842
2090.8 546856842 548459129 549896126 551183434 552309914 553305664 554231262 555110893 555910454 556588402
2099.5 556588402 557139168 557581482 557933121 558220139 558489532 558782196 559090347 559357109 559525375 559576569
2109.1 559576569 559523926 559391632 559213028 559032288 558886948 558781853 558693542 558601532 558503227 558393097
2118.7 558393097 558243370 558022079 557735062 557437973 557206535 557090836 557089653 557149010 557181931 557108078
2128.4 557108078 556899643 556599197 556285973 556018715 555808640 555640602 555502510 555383110 555251503 555057869
2138 555057869 554768906 554399490 554007607 553659897 553400803 553241463 553160858 553110886 553029556 552866058
2147.7 552866058 552600021 552245293 551838951 551430511 551077461 550832138 550719566 550717316 550756950 550754585
2157.3 550754585 550649948 550434113 550146561 549846802 549579468 549357681 549170723 549002686 548838081 548653030
2167 548653030 548415146 548106956 547756577 547434311 547205849 547080154 547004509 546912918 546777039 546609306
2176.6 546609306 546427498 546229973 546011581 545791321 545606880 545475578 545371780 545250282 545090218 544904099
2186.3 544904099 544702911 544465675 544156799 543776016 543381653 543056488 542845650 542723160 542608643 542420654
2195.9 542420654 542126045 541756821 541384010 541062965 540791092 540518875 540203972 539850121 539490166 539134865
2205.5 539134865 538759270 538347855 537945175 537642822 537505150 537516785 537603416 537697258 537776222 537847290
2215.2 537847290 537912941 537962914 537986641 537981606 537946587 537882843 537803154 537734489 537697716 537686768 537672768 537632294
2226.8 537632294 537566986 537494125 537426453 537366714 537316666 537280960 537256317 537224960 537166519 537076035 536965752
2237.4 536965752 536846924 536716843 536569481 536411514 536260796 536123695 535977364 535780869 535506020 535159912
2247 535159912 534780464 534410820 534076729 533779221 533503151 533231697 532957497 532683258 532415733 532155304
2256.7 532155304 531895370 531626282 531341438 531043091 530745735 530475807 530259476 530098152 529955406 529772987
2266.3 529772987 529513359 529192886 528871613 528609772 528428345 528305588 528199730 528069267 527878380 527602272
2275.9 527602272 527238007 526814461 526382523 525990334 525662918 525399284 525180397 524972305 524730339 524412193
2285.6 524412193 524002953 523529053 523046112 522603912 522216034 521857872 521492996 521105652 520713043 520349464
2295.2 520349464 520038185 519771080 519511070 519214478 518858757 518460197 518070145 517746696 517519455 517373047
2304.9 517373047 517268410 517184525 517138100 517153664 517215385 517257309 517212639 517072983 516886520 516693001 516467361
2315.5 516467361 516142960 515694427 515183144 514710083 514323654 513985825 513635254 513270493 512950287 512707787
2325.1 512707787 512480011 512147255 511650810 511063957 510535431 510163040 509930420 509764404 509631805 509562836
2334.8 509562836 509581718 509635582 509612465 509425278 509073029 508622437 508147125 507692604 507287483 506973763
2344.4 506973763 506815529 506875687 507169304 507613640 508023682 508190498 508012123 507562485 507010040 506446953
2354.1 506446953 505810165 504994850 504042969 503182030 502641792 502435417 502344742 502126198 501718788 501247368
2363.7 501247368 500861168 500608902 500463066 500411797 500480995 500673485 500930214 501171532 501358719 501494942
2373.3 501494942 501577530 501579208 501487694 501344910 501225815 501178436 501192055 501220131 501219749 501167831 501061745
2383.9 501061745 500921097 500784073 500682220 500611076 500535202 500431099 500318680 500236778 500189362 500126610
2393.6 500126610 499987717 499756355 499470901 499183464 498916283 498656654 498377457 498059883 497701797 497317047
2403.2 497317047 496933441 496582603 496286087 496043816 495833931 495617599 495352097 495008202 494588280 494129868
2412.9 494129868 493682632 493277893 492915916 492580223 492259102 491949997 491649666 491349640 491045036 490746002
2422.5 490746002 490473099 490246544 490080261 489984512 489961433 489989853 490016785 489976616 489830437 489592438
2432.2 489592438 489317741 489060440 488841591 488651543 488477783 488320923 488181419 488040085 487863274 487636108
2441.8 487636108 487384338 487152824 486955948 486758461 486509666 486197433 485861168 485553818 485297127 485079384
2451.5 485079384 484885902 484716949 484568672 484409828 484189758 483876572 483485909 483070984 482690506 482381134
2461.1 482381134 482147369 481965714 481794472 481591682 481338615 481047401 480749474 480469971 480215569 479979553
2470.7 479979553 479751816 479522514 479279633 479011688 478714066 478393974 478066750 477751503 477468185 477231178
2480.4 477231178 477036819 476853256 476629601 476326637 475944977 475526772 475128670 474787827 474508018 474267502
2490 474267502 474035530 473784294 473494492 473162537 472802696 472441177 472103233 471800880 471532326 471287346
2499.7 471287346 471051941 470810585 470550957 470270233 469974861 469673538 469369431 469064674 468766327 468484688
2509.3 468484688 468221397 467968102 467721519 467499542 467330475 467224503 467156487 467087898 467001343 466910248
2519 466910248 466832657 466763191 466676941 466557579 466409569 466244202 466060333 465846138 465595398 465314026
2528.6 465314026 465011368 464691582 464359207 464026489 463710747 463422279 463159485 462912865 462664719 462387581
2538.2 462387581 462052574 461657104 461241379 460865402 460556259 460278587 459964600 459578514 459148903 458740616
2547.9 458740616 458397980 458117294 457869225 457636032 457424393 457247009 457097244 456944275 456752357 456505737
2557.5 456505737 456220779 455932426 455666733 455422630 455176926 454906769 454604187 454271889 453912010 453526421
2567.2 453526421 453133049 452770538 452476311 452253227 452058449 451831360 451535530 451176834 450784569 450378532
2576.8 450378532 449953575 449494286 449001198 448503876 448047066 447657661 447319984 446982536 446595497 446153297
2586.5 446153297 445699654 445289726 444938927 444605255 444227562 443779449 443290825 442820778 442414169 442088242
2596.1 442088242 441853027 441729698 441735764 441851158 442004776 442104836 442088928 441949997 441721916 441444283
2605.7 441444283 441137543 440805893 440453529 440100594 439779167 439513359 439292526 439066505 438773346 438387032
2615.4 438387032 437940750 437501183 437113037 436767235 436419983 436037941 435622253 435192986 434766617 434353333
2625 434353333 433967896 433626518 433325577 433031273 432701836 432323723 431919365 431520004 431134567 430750198
2634.7 430750198 430357780 429966240 429592705 429246178 428928261 428642349 428389091 428147011 427867737 427507057
2644.3 427507057 427066917 426605835 426195984 425868797 425595055 425317307 424999008 424645271 424288254 423958549
2654 423958549 423670464 423421783 423196449 422961578 422672539 422295761 421836052 421347046 420903473 420556107
2663.6 420556107 420301819 420093193 419874573 419614563 419315567 419001999 418699722 418419838 418152199 417874641
2673.3 417874641 417575760 417269363 416982651 416724777 416471062 416187210 415869331 415550194 415258408 414975739
2682.9 414975739 414646950 414236717 413770714 413315926 412924004 412596703 412299881 411992645 411639137 411213913
2692.5 411213913 410719490 410204773 409745750 409384384 409082336 408746986 408311691 407789459 407247734 406739502
2702.2 406739502 406266365 405803223 405342827 404903145 404500656 404130974 403781090 403451385 403152924 402882423
2711.8 402882423 402610512 402300034 401938362 401546593 401157036 400783882 400413513 400020714 399593620 399147034
2721.5 399147034 398715248 398331108 398001709 397697868 397368813 396974297 396510201 396006432 395499840 395011101
2731.1 395011101 394545059 394105492 393696823 393305779 392888985 392394829 391808548 391176758 390580025 390075607
2740.8 390075607 389658241 389270210 388844604 388344574 387775459 387171974 386572838 385993500 385415916 384801903
2750.4 384801903 384128418 383412666 382704353 382052231 381473961 380953026 380455513 379946747 379400597 378805008
2760 378805008 378167877 377516785 376887741 376308403 375784454 375291290 374774284 374166641 373426704 372576332
2769.7 372576332 371700096 370894890 370204315 369594078 368987694 368325768 367593765 366804886 365970879 365095711
2779.3 365095711 364194412 363303719 362465782 361696892 360971336 360239258 359461746 358631325 357763290 356872520
2789 356872520 355964127 355047264 354146652 353289604 352477303 351674042 350832634 349931412 348985176 348028183
2798.6 348028183 347099533 346246796 345527458 344981384 344592781 344291916 344011497 343744316 343539619 343438950
2808.3 343438950 343422318 343420296 343374062 343277473 343165512 343072166 343002777 342935257 342835464 342673531 342438812
2818.9 342438812 342149467 341841621 341540527 341233215 340869217 340385857 339734955 338890610 337842293
2827.6 337842293 336586342 335119667 333435516 331539803 329501419 327522240 325959663 325246315
2835.3 325246315 325717812 327441673 330163651 333407326 336666298 339572678 341961670 343830299
2843 343830299 345252113 346307831 347058601 347551193 347833176 347962761 348008347 348035507 348087730 348171654
2852.6 348171654 348260193 348312340 348296547 348203926 348047600 347856483 347665482 347504120 347383080 347289963
2862.3 347289963 347200356 347093658 346960678 346797218 346597557 346360588 346100616 345842438 345599403 345354424
2871.9 345354424 345071945 344733734 344362526 344009705 343714409 343476372 343263855 343042068 342795296 342524910
2881.6 342524910 342232552 341903572 341503716 340992622 340353470 339617767 338859520 338147659 337494431 336848717
2891.2 336848717 336149635 335390892 334627876 333921700 333278618 332649879 331987000 331287155 330584755 329906425
2900.8 329906425 329248123 328592873 327941742 327312469 326710739 326115532 325505257 324902382 324384041 324029846
2910.5 324029846 323844604 323724442 323509979 323089676 322467880 321742134 321012573 320305138 319566021 318712559
2920.1 318712559 317683487 316457748 315051880 313512230 311899433 310254383 308574677 306835632
2927.8 306835632 305057182 303360023 301955528 301066170 300834332 301268539 302240143 303517838 304834690
2936.5 304834690 305972214 306821156 307378082 307678661 307731628 307514782 307026806 306330223 305533276 304732227
2946.2 304732227 303970432 303245487 302548141 301887665 301285534 300749340 300251255 299732666 299135933 298440800
2955.8 298440800 297674599 296881142 296073761 295220337 294271832 293208332 292054958 290861530 289676189
2964.5 289676189 288538647 287483444 286533527 285690365 284937763 284266281 283688107 283221283 282861233
2973.2 282861233 282572556 282311440 282047844 281763611 281436806 281037464 280537510 279915867 279149799 278213673
2982.8 278213673 277096672 275821285 274426689 272923794 271264973 269360905 267130566 264551678
2990.5 264551678 261702423 258808899 256272945 254614143 254285412 255435123 257774429 260667286
2998.2 260667286 263402481 265473480 266702614 267174549 267080860 266601715 265877647 265029640 264161720
3006.9 264161720 263331604 262534008 261733246 260923061 260151615 259480991 258928471 258460045 258042316 257684250
3016.6 257684250 257408028 257181244 256897240 256444607 255797825 255028038 254223862 253404617 252518501 251512775
3026.2 251512775 250393257 249211540 248013992 246820126 245648689 244546623 243579655 242794476 242201748
3034.9 242201748 241792908 241559849 241485138 241520100 241589851 241633987 241645107 241665649 241748333 241923065 242193489
3045.5 242193489 242548218 242964611 243404541 243823051 244191322 244517097 244859009 245338821 246147270 247501068
3055.1 247501068 249532356 252169857 255123596 258021336 260603352 262812958 264719028 266373405
3062.9 266373405 267760468 268882408 269867401 270963135 272396908 274215775 276240540 278163166
3070.6 278163166 279711094 280771427 281405926 281770763 282005367 282165127 282233887 282187767 282042580 281845036
3080.2 281845036 281625042 281371803 281069069 280755329 280541801 280547409 280797882 281178131 281489677 281571522
3089.9 281571522 281385174 280999870 280504360 279936066 279283504 278538036 277728615 276905422 276104908 275338764
3099.5 275338764 274611397 273931465 273295746 272669220 271995888 271241951 270425529 269599266 268797512 268005943
3109.1 268005943 267182274 266307316 265409069 264537010 263718281 262944794 262198296 261475430 260784454 260126305
3118.8 260126305 259494781 258896275 258353729 257876987 257434883 256979160 256505985 256083241 255798168 255674763
3128.4 255674763 255651932 255645714 255622845 255603962 255606861 255610638 255584583 255534954 255506115 255534573 255620613 255749817
3140 255749817 255923100 256150665 256417027 256673889 256880741 257039032 257175808 257291527 257341709 257280922
3149.6 257280922 257120972 256934586 256801300 256751156 256757011 256771564 256764984 256738434 256715965 256728344 256793251
3160.3 256793251 256901474 257023754 257139301 257257938 257410431 257613220 257851353 258099861 258355274 258634892
3169.9 258634892 258945961 259273300 259607525 259976864 260425034 260951023 261485386 261949024 262334137 262711716
3179.5 262711716 263148937 263634148 264098263 264508858 264919510 265411587 266000195 266612415 267160110 267623882
3189.2 267623882 268054943 268509998 268996696 269480534 269928169 270332623 270705395 271058521 271394882 271711426
3198.8 271711426 272002735 272265911 272506771 272740135 272982082 273240490 273512249 273789082 274061642 274327259
3208.5 274327259 274597702 274902096 275266552 275682106 276097069 276457977 276765614 277082043 277471066 277931023
3218.1 277931023 278394451 278796234 279133682 279455814 279802628 280166492 280515633 280839920 281164665 281522751
3227.8 281522751 281921291 282338696 282743168 283109360 283424606 283696060 283960629 284277344 284691315 285190506
3237.4 285190506 285701771 286141357 286482449 286775112 287097950 287488441 287921638 288357410 288797016 289283733
3247 289283733 289849167 290469246 291084709 291662922 292231236 292846470 293534927 294264107 294967442 295592213
3256.7 295592213 296130486 296617718 297105751 297629089 298184242 298738079 299262505 299761238 300261326 300778008
3266.3 300778008 301295586 301786041 302240582 302673321 303097858 303512993 303919239 304338837 304801559 305310211
3276 305310211 305831070 306327209 306796398 307265759 307752914 308245125 308720818 309182835 309653854 310141392
3285.6 310141392 310621700 311068764 311496296 311959400 312506542 313130589 313765469 314331856 314789925 315160236
3295.3 315160236 315502014 315869198 316273232 316677895 317033653 317326393 317599564 317923450 318335934 318809433
3304.9 318809433 319274540 319678555 320021629 320340424 320667763 321010056 321358109 321703758 322038307 322337761
3314.6 322337761 322565384 322700462 322769127 322841911 322995071 323262901 323616104 323979874 324276123 324460793
3324.2 324460793 324539299 324551697 324543839 324542236 324546509 324542427 324520149 324487610 324465981 324472313 324499168 324510155
3335.8 324510155 324460945 324335365 324166794 324021492 323953590 323967934 324019699 324048500 324017448 323933983 323846130
3346.4 323846130 323815689 323873863 323978920 324018021 323871574 323505020 323006058 322520294 322136879 321831627
3356 321831627 321518402 321149063 320754547 320388565 320047417 319659901 319159489 318560162 317956314 317450542
3365.7 317450542 317084007 316828003 316633167 316475391 316357937 316284218 316242008 316221828 316245174 316364326
3375.3 316364326 316629677 317058563 317636871 318339329 319129658 319941082 320681458 321290855 321810608 322376442
3384.9 322376442 323118057 324052086 325069542 326029778 326861000 327580490 328246422 328907127 329587212
3393.6 329587212 330289726 330995789 331673813 332314110 332950630 333632889 334364738 335078316 335682869 336141930
3403.3 336141930 336501694 336852913 337272110 337793503 338412018 339095116 339798508 340486183 341156425 341851425
3412.9 341851425 342644501 343609848 344780769 346111374 347479324 348755074 349897232 350980301 352106361
3421.6 352106361 353286743 354430008 355456161 356396446 357347145 358327332 359221840 359891510 360327377
3430.3 360327377 360667953 361063995 361553268 362070847 362556114 363018913 363511810 364065399 364663048 365260277
3439.9 365260277 365813408 366304054 366758156 367235146 367772408 368329277 368803329 369126282 369347191 369604111
3449.6 369604111 370006027 370543938 371113472 371614647 372021561 372377319 372745247 373169937 373661461 374192009
3459.2 374192009 374706993 375160484 375554352 375942726 376388016 376902771 377434654 377911186 378304710 378660240
3468.8 378660240 379060631 379556885 380120697 380661697 381103287 381454926 381815376 382295418 382920837 383600922
3478.5 383600922 384197350 384634056 384955215 385278587 385690193 386176834 386653976 387055473 387396278 387751846
3488.1 387751846 388184471 388689499 389206772 389676476 390084763 390466805 390880394 391374550 391973305 392675247
3497.8 392675247 393455544 394260292 395001640 395580902 395951920 396180191 396425209 396825790 397382889 397965813
3507.4 397965813 398451042 398853149 399301758 399887009 400552483 401155624 401618462 401996040 402395401 402864380
3517.1 402864380 403377953 403909988 404476891 405097389 405737915 406327744 406829948 407280655 407758293 408324547
3526.7 408324547 408991089 409724274 410466270 411170464 411837540 412514381 413235931 413956985 414570389 415022583
3536.4 415022583 415408630 415927849 416720505 417747650 418827438 419772568 420488014 420970306 421272736
3545 421272736 421506538 421840973 422434998 423319435 424344940 425277443 425973206 426480408 426983147 427646866
3554.7 427646866 428501015 429442139 430331306 431096153 431768608 432446365 433214035 434073792 434926224 435618324
3564.3 435618324 436043434 436237907 436396065 436763535 437473068 438455391 439515381 440507622 441434212
3573 441434212 442375145 443343964 444253578 445035248 445753784 446564140 447546883 448628578 449686813 450695686
3582.6 450695686 451709633 452696762 453459053 453802185 453804092 453861160 454401360 455522346 456911278 458123283
3592.3 458123283 458938103 459474716 460015144 460751114 461677132 462657356 463554687 464316101 464993134 465711098
3601.9 465711098 466598740 467695923 468892326 469958267 470681267 471034431 471243896 471658897 472479591
3610.6 472479591 473569641 474560509 475198975 475603371 476135941 476997910 477991371 478731537 479075279
3619.3 479075279 479277344 479718475 480559883 481708374 483012886 484324493 485345192 485627441 484964638
3628 484964638 483810501 483124504 483621902 485151596 486875648 488055878 488611450 488948898 489404869
3636.6 489404869 489967308 490470543 490882835 491333923 491939240 492692451 493511963 494309235 494986000 495405884
3646.3 495405884 495408363 494871216 493825302 492593231 491798859 492060471 493476639 495392227 496820717
3655 496820717 497232094 496934128 496655006 496814575 497266884 497667923 497898865 498069077 498282013 498589478
3664.6 498589478 499097939 499863129 500590210 500674667 499819870 498584785 498024673 498600311 499564438 499656830
3674.3 499656830 498438606 496789742 496025429 496638603 498003426 499185219 499811287 500137367 500515060
3682.9 500515060 501027603 501582069 502093735 502437210 502351570 501615410 500385094 499250526 498834610
3691.6 498834610 499303284 500266342 501138306 501581306 501656265 501641312 501743050 501930923 501998253 501779404
3701.3 501779404 501346245 500986786 500961914 501269417 501666145 501917534 501971779 501868019 501549911 500901146
3710.9 500901146 500001564 499254112 499129601 499753304 500788727 501741982 502334671 502568474 502530708 502272301
3720.5 502272301 501882553 501544533 501396179 501362190 501235733 500961456 500758286 500892258 501359482 501864624
3730.2 501864624 502102852 501989136 501595955 500967484 500104752 499124908 498333015 498065300 498463593 499389610
3739.8 499389610 500481377 501249008 501230392 500278091 498816109 497705536 497626572 498457642 499308510
3748.5 499308510 499279556 498251801 496951332 496275406 496588211 497604904 498784981 499703560 500117187
3757.2 500117187 499914589 499204636 498417320 498114243 498534851 499337769 499890480 499856796 499458275 499137611
3766.8 499137611 499040565 498920174 498530197 497984085 497642136 497707367 498047028 498413467 498709526 498943748
3776.5 498943748 499009209 498688202 497951546 497151947 496775589 496969452 497376785 497486534 497126160 496593056
3786.1 496593056 496334000 496532745 496988068 497341652 497404594 497282753 497201996 497221107 497161484 496868324
3795.8 496868324 496498566 496399879 496611862 496605225 495757713 494168968 492815247 492669754 493668633 494728508
3805.4 494728508 494856758 494108124 493348732 493243561 493714943 494345360 494947853 495506516 495775642 495374680
3815.1 495374680 494396591 493595886 493640366 494238701 494330978 493283768 491699066 490834198 491284180 492439728
3824.7 492439728 493257065 493341484 493126183 493136253 493348465 493348389 492935257 492380486 492091293 492137184 492162933
3835.3 492162933 491728554 490722504 489500275 488661613 488632660 489356155 490339470 491034927 491229439
3844 491229439 491108818 490999146 491099052 491438065 491952896 492458038 492553291 491755371 489932442 487649536
3853.6 487649536 485943146 485581322 486466522 487777710 488718376 489116173 489313202 489568863 489703255
3862.3 489703255 489378548 488645554 488057060 488140335 488788147 489285316 489014626 488106155 487306099 487181969
3871.9 487181969 487542763 487731476 487447815 487119484 487352371 488100929 488586082 488137169 487008476
3880.6 487008476 486183357 486339188 487129326 487591095 487206421 486422653 486105804 486588020 487348671 487581367
3890.3 487581367 486977196 485952187 485226135 485245438 485921974 486775322 487274399 487151680 486532059 485808563
3899.9 485808563 485333710 485156288 485026321 484674454 484105186 483626556 483577385 484006805 484608459 484983215
3909.6 484983215 484984856 484819641 484807243 485050049 485343399 485389900 485068016 484496613 483903008 483482361
3919.2 483482361 483348999 483507805 483807716 483974838 483799515 483331070 482853851 482637672 482710037 482868805
3928.8 482868805 482875633 482624474 482179375 481725121 481467781 481496468 481691437 481812744 481736374 481582527
3938.5 481582527 481563492 481713486 481835556 481732025 481428413 481128807 480988274 480984650 480991020 480901604 480684891
3949.1 480684891 480380211 480090866 479936600 479958305 480073128 480156021 480154762 480093727 479995651 479859772 479712563
3959.7 479712563 479602432 479511566 479346161 479070206 478795319 478655472 478627205 478572273 478448944 478349991
3969.3 478349991 478294220 478124924 477731361 477266731 476973648 476838074 476620560 476248322 475938492 475816994
3979 475816994 475659103 475255699 474851189 474824905 474978943 474635849 473631058 472695465 472386436 472073517
3988.6 472073517 470802803 469019890 468223648 468378983 467009010 462521210 457656326 456298599 454442520
3997.3 454442520 436100578 383134499 292994690
4000.2 292994690
##END=$$ End of the data block
