##TITLE=$$ Begin of the data block
##JCAMP-DX=5.00 $$ ACD/SpecManager v 10.08
##SPECTROMETER/DATA SYSTEM=Varian
##DATE=30 Apr 2013 10:44:26
##DATA TYPE=INFRARED SPECTRUM
##DATA CLASS=XYDATA
##ORIGIN=
##OWNER=
##NPOINTS=3735
##FIRSTX=399.26403809
##LASTX=4000.35498047
##MAXX=4000.35498047
##MINX=399.26403809
##MAXY=73.51122284
##MINY=19.25265694
##XFACTOR=1.0000000000
##YFACTOR=0.000000100000000
##FIRSTY=44.31858826
##DELTAX=0.96440572
##XUNITS=1/CM
##YUNITS=TRANSMITTANCE
##XYDATA=(X++(Y..Y))
$$ plain form
399.3 443185883 578199348 657086792 683573532 684537582 684295120 690121536 697280426 701136780
407 701136780 701987839 701747208 700817261 699251251 698478241 699975052 703066788 705638275 706910324
415.7 706910324 708193741 710581131 713034668 713620071 712044830 709957275 708792953 708226089 707059021
424.3 707059021 704927826 702487946 700256882 698034821 695567093 693181915 691367950 689960403
432.1 689960403 688126221 685172729 681247025 677372437 675017853 675437927 678883591 684156036 689205322
440.7 689205322 692592621 694454422 695893860 697486267 698651428 698512421 697013397 694897156 692774353
449.4 692774353 690633698 688322449 686088638 684272232 682554855 679877014 675262222 668607864
457.1 668607864 660617523 652192307 644163742 637581825 633879585 634343987 639237900 647439041 656981201
$$ packed form
399.3D43185883J35013465P8887444K6486740R64050k42462N826416P158890L856354
407G01136780Q51059k40631r29947j566010p73010J496811L091736K571487J272049
415.7G06910324J283417K387390K453537N85403j575241k087555j164322n66864j167068
424.3G07059021k131195k439880k231064k222061k467728k385178j813965j407547
432.1F89960403j834182k953492l925704l874588k354584M20074L445664N272445N049286
440.7F89205322L387299J861801J439438J592407J165161j39007j499024k116241k122803
449.4F92774353k140655k311249k233811j816406j717377k677841m614792o654358
457.1F68607864p990341q425216q028565o581917l702240M64402M893913Q201141R542160
$$ plain form
465.8 656981201 666032028 673562775 679394379 683847733 687353745 690187454 692362671 693717270
473.5 693717270 694161148 693878555 693248138 692522507 691642303 690455170 689108963 688094482 687792969
482.2 687792969 688028564 688191452 687823868 686971359 685900726 684595795 682728424 680149612 677234955
490.9 677234955 674584274 672401276 670298538 667757034 664726715 661750259 659573822 658672180 659046249
499.6 659046249 660298309 661822357 663017197 663469772 663037186 661788940 659882202 657470856 654660339
508.2 654660339 651460342 647752228 643329315 637993317 631612244 624087830 615303040 605121078
516 605121078 593460274 580477486 566913567 554441872 545543518 542529373 546082382 554434662
523.7 554434662 564060326 571542168 575239716 575632019 574441948 573531990 574326591 577717133 584038887
$$ packed form
465.8F56981201R050827P530747N831604M453354L506012K833709K175217J354599
473.5F93717270M43878k82593o30417p25631q80204j187133j346207j014481l01513
482.2F87792969K35595J62888l67584q52509j070633j304931j867371k578812k914657
490.9F77234955k650681k182998k102738k541504l030319k976456k176437r01642L74069
499.6F59046249J252060J524048J194840M52575m32586j248246j906738k411346k810517
508.2F54660339l199997l708114m422913n335998o381073p524414q784790j0181962
516F05121078j1660804j2982788j3563919j2471695q898354l014145L553009Q352280
523.7E54434662R625664P481842L697548L92303j190071r09958P94601L390542O321754
$$ plain form
532.4 584038887 593003616 603778915 615291939 626549988 636775055 645411835 652175522 657132187
540.1 657132187 660648727 663166046 664967422 666129532 666633224 666468811 665652466 664222870 662294464
548.7 662294464 660109482 657979355 656115799 654491730 652866287 650951385 648573761 645719223
556.5 645719223 642469864 638926888 635168381 631217194 627001915 622357597 617120667 611275940
564.2 611275940 605016441 598638992 592357788 586213760 580140686 574081535 568016319 561907349
571.9 561907349 555688629 549364738 543134842 537386131 532530365 528808365 526227303 524674492
579.6 524674492 524114037 524708595 526780586 530640945 536402397 543887863 552664757 562170372 571865005
588.3 571865005 581364632 590498161 599244041 607579155 615366821 622399521 628550873 633856354
$$ packed form
532.4E84038887Q964729J0775299J1513024J1258049J0225067Q636780O763687M956665
540.1F57132187L516540K517319J801376J162110N03692j64413q16345j429596j928406
548.7F62294464k184982k130127j863556j624069j625443j914902k377624k854538
556.5F45719223l249359l542976l758507l951187m215279m644318n236930n844727
564.2F11275940o259499o377449o281204o144028o073074o059151o065216o108970
571.9E61907349o218720o323891o229896n748711m855766l722000k581062j552811
579.6E24674492n60455N94558K071991L860359N761452P485466Q776894R505615R694633
588.3E71865005R499627R133529Q745880Q335114P787666P032700O151352N305481
$$ plain form
596 633856354 638418427 642247162 645231934 647255783 648243332 648015747 646156769 642253723 636541367
604.7 636541367 630428925 626250687 626144295 630776711 638897629 648087616 656097336 661756058 664928131
613.4 664928131 665879593 664795532 661775818 657033691 650946655 644034653 637144051 631690979 629364433
622 629364433 631048470 635749207 640776749 643476410 643200302 641739273 641773605 644754410 650058289
630.7 650058289 655897827 660842743 664546356 667367020 669653015 671466293 672779694 673690872 674368439
639.4 674368439 674869385 675096741 674935913 674367142 673370285 671674957 668647537 663602905 656503906
648.1 656503906 648558121 642093735 639543152 642112427 649065247 658136063 666758881 673261032
655.8 673261032 677339554 679708099 681322861 682745590 683994522 684853210 685249634 685320206 685148544
$$ packed form
596F33856354M562073L828735K984772K023849R87549k27585j858978l903046n712356
604.7F36541367o112442m178238j06392M632416Q120918R189987Q009720N658722L172073
613.4F64928131R51462j084061l019714m742127o087036o912002o890602n453072k326546
622F29364433J684037M700737N027542K699661k76108j461029L4332K980805N303879
630.7F50058289N839538M944916L703613K820664K285995J813278J313401R11178O77567
639.4F74368439N00946K27356j60828n68771r96857j695328l027420n044632p098999
648.1F56503906p945785o464386k550583K569275O952820R070816Q622818O502151
655.8F73261032M078522K368545J614762J422729J248932Q58688L96424P0572j71662
$$ plain form
664.5 685148544 684571762 683385162 681757584 680312347 679642563 679701004 679719315 678770828 676430893
673.2 676430893 672967529 669081955 665614853 663425140 663235931 665282059 669013977 673272705 676934280
681.8 676934280 679496384 681117096 682164154 682782440 682856140 682282867 681197968 679933701 678793564
690.5 678793564 677860794 676977386 675866241 674282837 672102127 669335327 666113052 662627716 658982010
699.2 658982010 654988022 650147247 644041138 636976624 630322495 626049995 625672073 629392281 636130791
707.9 636130791 644285126 652480850 659784012 665537262 669302444 671051407 671282883 670771179 670094070
716.6 670094070 669345856 668241043 666428375 663728867 660190201 656041870 651647873 647461395 643953476
725.2 643953476 641503296 640267639 640080032 640465317 640804367 640558167 639373779 636992683 633084335
$$ packed form
664.5F85148544n76782j186600j627578j445237o69784N8441J8311r48487k339935
673.2F76430893l463364l885574l467102k189713j89209K046128L731918M258728L661575
681.8F76934280K562104J620712J047058O18286P3700n73273j084899j264267j140137
690.5F78793564r32770q83408j111145j583404k180710k766800l222275l485336l645706
699.2F58982010l993988m840775o106109p064514o654129m272500l77922L720208O738510
707.9F36130791Q154335Q195724P303162N753250L765182J748963K31476n11704o77109
716.6F70094070p48214j104813j812668k699508l538666m148331m393997m186478l507919
725.2F43953476k450180j235657j87607L85285L39050k46200j184388k381096l908348
$$ plain form
733.9 633084335 627177544 618730240 607290230 592802048 576155128 559750671 547431297 543220825
741.6 543220825 549261169 564308243 584072990 603362350 618542175 628675652 634877853 638807983
749.3 638807983 641560516 643485718 644592667 644935608 644717026 644205856 643638000 643156738 642782822
758 642782822 642420578 641919174 641163712 640143127 638949356 637711639 636505775 635300903 633978157
766.7 633978157 632407074 630520630 628335075 625915680 623328857 620609055 617745056 614683228
774.4 614683228 611349182 607678642 603636169 599214821 594431686 589328804 583952103 578298950
782.1 578298950 572284813 565790596 558762856 551249886 543332062 535036659 526339340 517198181
789.9 517198181 507526093 497217216 486514702 476690979 470381584 470761490 479615898 495589218
$$ packed form
733.9F33084335n906791q447304j1440010j4488182j6646920j6404457j2319374m210472
741.6E43220825O040344J5047074J9764747J9289360J5179825J0133477O202201L930130
749.3F38807983K752533J925202J106949L42941k18582n11170n67856m81262l73916
758F42782822l62244n01404p55462j020585j193771j237717j205864j204872j322746
766.7F33978157j571083j886444k185555k419395k586823k719802k863999l061828
774.4F14683228l334046l670540m042473m421348m783135n102882n376701n653153
782.1E78298950o014137o494217p027740p512970p917824q295403q697319r141159
789.9E17198181r672088j0308877j0702514r823723o309395L79906Q854408J5973320
$$ plain form
797.6 495589218 514167709 529720230 538235703 538863869 533477898 525051422 516242714 508883896
805.3 508883896 504097023 502452583 503981209 508238792 514566154 522407150 531443558 541491241
813 541491241 552300987 563433418 574272728 584147263 592492065 598960381 603407784 605765800
820.7 605765800 605941963 603863144 599590416 593289986 584989014 574359894 560851440 544119225
828.4 544119225 524333382 502093391 478277740 454334450 432822952 417197571 410191689 411783257
836.1 411783257 418826447 427336731 435785141 446363945 462835426 486819267 515851898 544769745
843.9 544769745 568888054 586212273 597353783 603959007 607208633 607238388 603520203 595949249
851.6 595949249 586115379 577764664 575562363 582534256 598013878 617878113 637000351 651976242
$$ packed form
797.6D95589218J8578491J5552521Q515473O28166n385971q426476q808708p358818
805.3E08883896m786873j644440J528626M257583O327362P840996R036408J0047683
813E41491241J0809746J1132431J0839310R874535Q344802O468316M447403K358016
820.7F05765800J76163k078819m272728o300430q300972j0629120j3508454j6732215
828.4E44119225j9785843k2239991k3815651k3943290k1511498j5625381p005882J591568
836.1D11783257P043190Q510284Q448410J0578804J6471481K3983841K9032631K8917847
843.9E44769745K4118309J7324219J1141510O605224L249626K9755l718185p570954
851.6E95949249r833870q350715k202301O971893J5479622J9864235J9122238J4975891
$$ plain form
859.3 651976242 662154007 668718338 673144608 676344910 678722763 680521622 681967850 683209991
867 683209991 684270325 685078659 685538788 685605621 685362244 685028534 684841766 684888763 685051880 685119934
876.7 685119934 684945831 684516830 683931046 683350830 682945175 682797089 682822037 682799759 682533417 681995239
886.3 681995239 681313477 680638428 680043945 679544983 679144821 678812714 678432770 677845230 676987305 675987549
895.9 675987549 675094452 674492187 674185104 674036179 673884735 673614502 673140564 672397614 671389008 670247345
905.6 670247345 669207230 668466492 668042984 667758179 667374420 666762772 665960617 665100403 664301453 663604279
915.2 663604279 662932358 662057266 660643387 658472519 655764847 653283005 651976852 652337494 653990860
923.9 653990860 655921326 657162628 657371063 656849365 656120224 655501251 655000153 654477158 653824005
$$ packed form
859.3F51976242J0177765O564331M426270L200302K377853J798859J446228J242141
867F83209991J060334Q08334M60129O6833k43377l33710j86768M6997J63117O8054
876.7F85119934j74103m29001n85784n80216m05655j48086K4948k2278k66342n38178
886.3F81995239o81762o75049n94483m98962m00162l32107l79944n87540q57925r99756
895.9F75987549q93097o02265l07083j48925j51444k70233m73938p42950j008606j141663
905.6F70247345j040115p40738m23508k84805l83759o11648q02155q60214p98950o97174
915.2F63604279o71921q75092j413879k170868k707672k481842j306153L60642J653366
923.9F53990860J930466J241302K08435n21698p29141o18973n01098n22995o53153
$$ plain form
932.6 653824005 653008041 652025681 650867920 649537659 648086624 646617508 645234222 643956680 642674408
941.3 642674408 641188049 639313393 636954803 634095230 630760345 627050095 623230171 619767113
949 619767113 617223053 616072273 616571808 618736877 622356224 626991043 631993103 636619072 640238571
957.7 640238571 642530289 643545303 643601685 643083496 642270432 641294250 640204315 639031525 637763214
966.3 637763214 636293793 634487839 632369041 630248375 628596039 627726974 627586823 627829590 628067322
975 628067322 628033638 627573662 626590500 625071831 623144569 621048088 619025421 617216606 615607414
983.7 615607414 614029655 612236824 610060349 607543907 604892693 602261238 599621010 596862335
991.4 596862335 593957176 590905952 587537956 583512383 578626404 573040199 567066803 560764656
$$ packed form
932.6F53824005q15964r82360j157761j330261j451035j469116j383286j277542j282272
941.3F42674408j486359j874656k358590k859573l334885l710250l819924l463058
949F19767113k544060j150780M99535K165069L619347M634819N002060M625969L619499
957.7F40238571K291718J015014N6382n18189q13064r76182j089935j172790j268311
966.3F37763214j469421j805954k118798k120666j652336q69065j40151K42767K37732
975F28067322l3684m59976r83162j518669j927262k096481k022667j808815j609192
983.7F15607414j577759j792831k176475k516442k651214k631455k640228k758675
991.4E96862335k905159l051224l367996m025573m885979n586205n973396o302147
$$ plain form
999.1 560764656 553852882 545924797 536367264 523871536 506509285 483315468 456605377 432687035
1006.8 432687035 419485550 422445107 441854362 473394203 510734444 547733383 579249535
1013.6 579249535 601512299 612954559 614872322 610687294 603917694 596472816 588582687 579941711
1021.3 579941711 570606651 560903816 550904274 540315018 528850937 516568832 503898392 491628914
1029 491628914 481070633 474140244 472966766 479024849 492302208 511052628 532311592 552919922
1036.7 552919922 570567970 584369011 594713211 602576981 608793755 613740196 617474670 620011444
1044.5 620011444 621440277 621884766 621461716 620307465 618591919 616462402 613976707 611115112 607857094
1053.1 607857094 604231453 600294724 596077423 591542320 586547089 580808868 573945122 565699768
$$ packed form
999.1E60764656o911774p928085r557533j2495728j7362251k3193817k6710091k3918342
1006.8D32687035j3201485K959557J9409255L1539841L7340241L6998939L1516152
1013.6E79249535K2262764J1442260J917763m185028o769600p444878p890129q640976
1021.3E79941711r335060r702835r999542j0589256j1464081j2282105j2670440j2269478
1029D91628914j0558281o930389j173478O058083J3277359J8750420K1258964K0608330
1036.7E52919922J7648048J3801041J0344200P863770O216774M946441L734474K536774
1044.5F20011444J428833M44489m23050j154251j715546k129517k485695k861595l258018
1053.1F07857094l625641l936729m217301m535103m995231n738221o863746q245354
$$ plain form
1060.9 565699768 556325798 546866226 538996086 534336853 533585014 536038742 539882927 543046150
1068.6 543046150 544030571 542210579 537570419 530265770 520438194 508439751 495303154 483096237
1076.3 483096237 474768372 473303070 480431786 495615692 516024780 537651100 556904449 571736183
1084 571736183 581787453 587795105 590863495 592003479 591963768 591203995 589934006 588208275 586035042
1092.7 586035042 583436279 580450172 577131119 573565445 569863815 566102943 562270927 558274994
1100.4 558274994 554000778 549352875 544250259 538611412 532344933 525317497 517299500 507977257
1108.1 507977257 497090378 484601707 470752525 456046562 441420326 428669930 420678291
1114.9 420678291 420741463 430898628 450258904 474738846 498734589 517676926 529699059 535472374
$$ packed form
1060.9E65699768r373970r459572p870140m659233p51839K453728L844185L163223
1068.6E43046150R84421j819992m640160p304649r827576j1998443j3136597j2206917
1076.3D83096237q327865j465302P128716J5183906K0409088K1626320J9253349J4831734
1084E71736183J0051270O007652L068390J139984l9711p59773j269989j725731k173233
1092.7E86035042k598763k986107l319053l565674l701630l760872l832016l995933
1100.4E58274994m274216m647903n102616n638847o266479p027436q017997r322243
1108.1E07977257j0886879j2488671j3849182j4705963j4626236j2750396p991639
1114.9D20678291O3172J0157165J9360276K4479942K3995743J8942337J2022133N773315
$$ plain form
1122.6 535472374 536816216 535441895 532580948 529168396 525890350 522938576 519893227 516050262
1130.3 516050262 510953026 504638710 497442398 489649048 481346703 472528992 463243408 453631668
1138 453631668 443865776 434058533 424201546 414159317 403733902 392768173 381207047 369097099
1145.7 369097099 356599579 344080048 332208061 321928101 314294682 310296402 310761375 316273785
1153.4 316273785 327004967 342534027 361834526 383479652 405928421 427762375 447881699
1160.2 447881699 465667610 480977211 493883400 504363441 512264290 517546387 520409851 521073952
1167.9 521073952 519542351 515763130 509903908 502045784 491428757 476617012 457559090 438131027
1175.6 438131027 425980797 428208961 445726700 471491661 494958458 509337921 515464668 519285507
$$ packed form
1122.6E35472374J343842j374321k860947l412552l278046k951774l045349l842965
1130.3E16050262n097236o314316p196312p793350q302345q817711r285584r611740
1138D53631668r765892r807243r856987j0042229j0425415j0965729j1561126j2109948
1145.7C69097099j2497520j2519531j1871987j0279960p633419l998280M64973N512410
1153.4C16273785J0731182J5529060J9300499K1645126K2448769K1833954K0119324
1160.2D47881699J7785911J5309601J2906189J0480041P900849N282097K863464O64101
1167.9E21073952j531601l779221n859222p858124j0617027j4811745j9057922j9428063
1175.6D38131027j2150230K228164J7517739K5764961K3466797J4379463O126747L820839
$$ plain form
1183.3 519285507 525904427 535747528 545573044 552241554 555305214 556617088 558270340 561102791
1191 561102791 564662094 567991142 570317230 571322098 571120415 570082359 568586731 566834221 564845619
1199.7 564845619 562594337 560112267 557489738 554838066 552276115 549910240 547765656 545732689
1207.4 545732689 543612366 541241722 538583908 535714607 532754822 529820023 526988564 524264870
1215.1 524264870 521556244 518709412 515594101 512157784 508408852 504371910 500072975 495546303
1222.9 495546303 490817871 485863037 480599594 474944839 468888130 462503586 455895691 449152031
1230.6 449152031 442364578 435702972 429443207 423876648 419108849 414869232 410482292 405061188
1238.3 405061188 397828407 388382454 376822891 363784485 350457878 338515816 329764099 325500259
$$ packed form
1183.3E19285507O618920R843101R825516O668510L063660J311874J653252K832451
1191E61102791L559303L329048K326088J004868k01683j038056j495628j752510j988602
1199.7E64845619k251282k482070k622529k651672k561951k365875k144584k032967
1207.4E45732689k120323k370644k657814k869301k959785k934799k831459k723694
1215.1E24264870k708626k846832l115311l436317l748932m036942m298935m526672
1222.9D95546303m728432m954834n263443n654755o056709o384544o607895o743660
1230.6D49152031o787453o661606o259765n566559m767799m239617m386940n421104
1238.3D05061188p232781r445953j1559563j3038406j3326607j1942062q751717m263840
$$ plain form
1246 325500259 325904999 329937057 335900116 342308731 348426361 354133530 359355927 363605576 365998344
1254.7 365998344 365661621 362151604 355581856 346448021 335339890 322736282 308967628 294319057
1262.4 294319057 279193592 264240189 250378571 238719463 230441914 226691380 228499603 236675262
1270.1 236675262 251641636 273283329 300892944 333253860 368809547 405843048 442649994
1276.9 442649994 477721901 509927101 538615227 563569908 584831314 602503090 616656685
1283.6 616656685 627343826 634637451 638651619 639588776 637887268 634411926 630469208 627460861
1291.3 627460861 626277657 626833687 628124390 628807030 627894859 625110474 620789795 615568504 610102844
1300 610102844 604857178 599889336 594730377 588611336 581108475 572833786 565567245 561546898 562283249
$$ packed form
1246C25500259M04740M032058N963059O408615O117630N707169N222397M249649K392768
1254.7C65998344l36723l510017o569748r133835j1108131j2603608j3768654j4648571
1262.4B94319057j5125465j4953403j3861618j1659108q277549l750534J808223Q175659
1270.1B36675262J4966374K1641693K7609615L2360916L5555687L7033501L6806946
1276.9D42649994L5071907L2205200K8688126K4954681K1261406J7671776J4153595
1283.6F16656685J0687141P293625M014168R37157j701508l475342l942718l008347
1291.3F27460861j183204N56030J290703O82640r12171k784385m320679n221291n465660
1300F10102844n245666m967842n158959o119041p502861q274689p266541m020347P36351
$$ plain form
1308.7 562283249 567683372 576068573 585034599 592562828 597717781 600640907 602030334 602545013
1316.4 602545013 602496223 601902122 600721817 599018021 596946220 594638748 592132607 589399490 586424179
1325.1 586424179 583241997 579910088 576462402 572903786 569238167 565484810 561653023 557695351
1332.8 557695351 553499184 548934898 543929520 538497047 532702484 526595535 520170975 513373184
1340.5 513373184 506111908 498262482 489671974 480203629 469804649 458532524 446513290 433881302
1348.2 433881302 420781822 407436714 394197731 381528778 369959221 360079918 352567062 348141975
1355.9 348141975 347425995 350788383 358311920 369863396 385124588 403502197 424037819 445512390
1363.7 445512390 466759186 486954498 505650215 522563133 537389297 549867744 560038719
$$ packed form
1308.7E62283249N400123Q385201Q966026P528229N154953K923126J389427N14679
1316.4F02545013m8790n94101j180305j703796k071801k307472k506141k733117k975311
1325.1E86424179l182182l331909l447686l558616l665619l753357l831787l957672
1332.8E57695351m196167m564286n005378n432473n794563o106949o424560o797791
1340.5E13373184p261276p849426q590508r468345j0398980j1272125j2019234j2631988
1348.2D33881302j3099480j3345108j3238983j2668953j1569557r879303p512856m425087
1355.9C48141975p15980L362388P523537J1551476J5261192J8377609K0535622K1474571
1363.7D45512390K1246796K0195312J8695717J6912918J4826164J2478447J0170975
$$ plain form
1370.4 560038719 568418121 575867271 583205261 590833206 598618164 606072769 612665634 618048553
1378.1 618048553 622116890 624955826 626764336 627788315 628249550 628274193 627868958 626958694 625450134
1386.8 625450134 623265495 620341873 616616173 611980209 606200523 598904533 589808540 579193497
1394.5 579193497 568296204 559153442 553800926 553305397 557320862 564444466 573005486 581683846
1402.2 581683846 589662857 596469498 601803703 605492554 607518578 608037338 607340584 605769539 603612823
1410.9 603612823 601066017 598283653 595433388 592620049 589729767 586435013 582512817 578242416
1418.6 578242416 574423561 571853600 570671959 570188675 569375916 567573280 564792252 561448364 557875481
1427.3 557875481 554096565 549983559 545560226 541099167 536876297 532787285 528216629 522426147
$$ packed form
1370.4E60038719Q379402P449150P337990P627945P784958P454605O592865N382919
1378.1F18048553M068337K838936J808510J023979M61235K4643m05235r10264j508560
1386.8F25450134k184639k923622l725700m635964n779686p295990r095993j0615043
1394.5E79193497j0897293r142762n352516m95529M015465P123604Q561020Q678360
1402.2E81683846P979011O806641N334205L688851K026024N18760o96754j571045k156716
1410.9F03612823k546806k782364k850265k813339k890282l294754l922196m270401
1418.6E78242416l818855k569961j181641m83284q12759j802636k781028l343888l572883
1427.3E57875481l778916m113006m423333m461059m222870m089012m570656n790482
$$ plain form
1435 522426147 515279579 507718086 501468925 498086891 498044701 500573769 504280205 507901077 510596619
1443.7 510596619 511780510 510951576 507840500 502693253 496320076 489811745 484158974 480008278
1451.4 480008278 477541466 476377487 475572166 473918304 470548668 465494003 459776917 454952812
1459.1 454952812 452406807 452803802 455872993 460502014 465102425 468183670 468929710 467419510 464295502
1467.8 464295502 460130348 455025673 448758392 441240578 432777977 423873444 414825974 405558167
1475.5 405558167 395814362 385504532 374888763 364528008 355120773 347362061 341884155 339296265
1483.2 339296265 340275879 345521088 355351524 369035149 384384308 398211250 407614632 411234589
1491 411234589 409506683 403785400 395218811 384358063 371585808 357575417 343133583 328678055
$$ packed form
1435E22426147p146568p561493o249161l382034m2190K529068L706436L620872K695542
1443.7E10596619J183891q28934l111076n147247o373177o508331n652771m150696
1451.4D80008278k466812j163979q05321j653862l369636n054665n717086m824105
1459.1D54952812k546005L96995L069191M629021M600411L081245P46040j510200l124008
1467.8D64295502m165154n104675o267281p517814q462601q904533r047470r267807
1475.5D05558167r743805j0309830j0615769j0360755r407235p758712n477906k587890
1483.2C39296265R79614N245209R830436J3683625J5349159J3826942R403382L619957
1491D11234589j727906n721283q566589j0860748j2772255j4010391j4441834j4455528
$$ plain form
1498.7 328678055 314118214 299368992 284830132 271089363 258071365 244721813 229959030
1505.4 229959030 214274635 200459938 192526569 193456688 203450718 219896488 238886738 257069931
1513.1 257069931 272685623 285485516 296005173 304833260 312236633 318153801 322379265 324752426
1520.8 324752426 325229187 323827934 320539627 315322514 308219910 299501648 289680996 279356060
1528.6 279356060 268997707 258880177 249229431 240453873 233240414 228431797 226808243 228944817
1536.3 228944817 235154305 245382366 259001465 274683552 290615044 305066204 316972218
1543 316972218 326104164 332747498 337220840 339649277 340093536 338779945 336146851 332678108 328731155
1551.7 328731155 324533195 320322685 316478596 313519497 311969070 312173462 314190350 317862720
$$ packed form
1498.7C28678055j4559841j4749222j4538860j3740769j3017998j3349552j4762783
1505.4B29959030j5684395j3814697p933369R30119R994030J6445770J8990250J8183193
1513.1B57069931J5615692J2799893J0519657Q828087P403373N917168M225464K373161
1520.8C24752426M76761j401253l288307n217113p102604q718262r820652j0324936
1528.6B79356060j0358353j0117530r650746q775558p213459m808617j623554K136574
1536.3B28944817O209488J0228061J3619099J5682087J5931492J4451160J1906014
1543C16972218R131946O643334M473342K428437M44259j313591k633094l468743l946953
1551.7C28731155m197960m210510l844089k959099j550427K04392K016888L672370
$$ plain form
1559.4 317862720 323085899 330099869 339544754 352149849 368238869 387413063 408620911 430503922
1567.1 430503922 451755447 471344604 488627090 503360176 515557976 525196609 531986465 535468521
1574.9 535468521 535406837 532105522 526303978 518715553 509619827 498834038 485973854 470674744
1582.6 470674744 452603874 431457787 407271004 381093521 355633507 335179825 324360619
1589.3 324360619 326040535 339484978 360094604 381165733 396740341 403812294 402683258 395675163
1597 395675163 385449829 374044189 362798767 352649460 344310608 338308983 335021744 334740524
1604.7 334740524 337652283 343737755 352717972 364118080 377359009 391786880 406712036 421572456
1612.5 421572456 436163864 450682411 465441513 480459023 495298042 509332275 522197266
$$ packed form
1559.4C17862720N223179P013970R444885J2605095J6089020J9174194K1207848K1883011
1567.1D30503922K1251525J9589157J7282486J4733086J2197800R638633O789856L482056
1574.9E35468521o1684l301315n801544p588425r095726j0785789j2860184j5299110
1582.6D70674744j8070870k1146087k4186783k6177483k5460014k0453682j0819206
1589.3C24360619J679916J3444443K0609626K1071129J5574608P071953j129036p008095
1597C95675163j0225334j1405640j1245422j0149307q338852o001625l287239k81220
1604.7C34740524K911759O085472Q980217J1400108J3240929J4427871J4925156J4860420
1612.5D21572456J4591408J4518547J4759102J5017510J4839019J4034233J2864991
$$ plain form
1619.2 522197266 534009056 545165596 555942574 566268654 575857277 584518585 592330132 599529381
1626.9 599529381 606289177 612632904 618545418 624091415 629358902 634290771 638640556 642155762
1634.6 642155762 644816132 646866684 648605804 650148163 651384430 652147446 652408066 652338409 652195969
1643.3 652195969 652114944 651972961 651519165 650752335 650189743 650598755 652223663 654218521 655026169
1652 655026169 653552704 650054321 645812836 641906586 638323097 634215279 628805809 621872139 613474960
1660.7 613474960 603579369 592175217 579618645 566503143 553013268 538520584 522015839
1667.4 522015839 503030586 482175827 460875854 440653915 422551003 406980972 394045448
1674.2 394045448 384185905 378744087 379757080 388780785 405611458 428235664 454258461 482401962
$$ packed form
1619.2E22197266J1811790J1156540J0776978J0326080R588623Q661308P811547P199249
1626.9E99529381O759796O343727N912514N545997N267487M931869M349785L515206
1634.6F42155762K660370K050552J739120J542359J236267P63016K60620o9657j42440
1643.3F52195969q1025j41983m53796p66830n62592M09012J624908J994858Q07648
1652F55026169j473465l498383m241485l906250l583489m107818n409470o933670q397179
1660.7F13474960r895591j1404152j2556572j3115502j3489875j4492684j6504745
1667.4E22015839j8985253k0854759k1299973k0221939j8102912j5570031j2935524
1674.2C94045448r859543n441818J012993R023705J6830673K2624206K6022797K8143501
$$ plain form
1681.9 482401962 512457428 543810692 574385300 601424561 623376236 640848618 655681534
1688.6 655681534 669248657 681704178 692557678 701540604 708826523 714742584 719596786 723722992
1696.4 723722992 727393570 730548706 732791595 733849640 734023285 734026337 734343338 734850235 735112228
1705 735112228 734949722 734597321 734363098 734291840 734220047 734060898 733914490 733908386 734007874 734009323 733680267
1715.6 733680267 732911148 731810608 730707016 729997406 729867783 730112076 730279465 730066986 729565430
1724.3 729565430 729088898 728784485 728482056 727955093 727253799 726683807 726435547 726317215 725937881 725157013
1734 725157013 724289169 723816605 723915634 724302216 724534149 724419250 724106369 723832550 723657608 723467026
1743.6 723467026 723170624 722823029 722541504 722353210 722159805 721846771 721407700 720965729 720682678 720628891
$$ packed form
1681.9D82401962L0055466L1353264L0574608K7039261K1951675J7472382J4832916
1688.6F55681534J3567123J2455521J0853500Q982926P285919N916061M854202M126206
1696.4G23722992L670578L155136K242889J058045J73645L052L17001N06897K61993
1705G35112228j62506l52401k34223p1258p1793j59149j46408o104R9488J449l29056
1715.6G33680267p69119j100540j103592p09610j29623K44293J67389k12479n01556
1724.3G29565430m76532l04413l02429n26963p01294n69992k48260j18332l79334p80868
1734G25157013q67844m72564R9029L86582K31933j14899l12881k73819j74942j90582
1743.6G23467026k96402l47595k81525j88294j93405l13034m39071m41971k83051n3787
$$ plain form
1753.3 720628891 720707855 720710526 720482559 720061493 719625092 719274597 718893967 718283539 717444000 716657486
1762.9 716657486 716223297 716126709 716043243 715683594 715074997 714451675 713918457 713327255 712511902 711565628
1772.5 711565628 710799255 710432968 710386734 710387726 710219650 709833221 709266205 708555374 707749176 706939850
1782.2 706939850 706213684 705582962 705023193 704586487 704413147 704567719 704870453 704958954 704571075 703779678
1791.8 703779678 702935333 702373581 702171326 702154236 702082901 701808395 701287079 700527878 699583435 698579178
1801.5 698579178 697696075 697083511 696786194 696762390 696955566 697321701 697786942 698222885 698507614 698617630
1811.1 698617630 698632050 698635788 698626785 698533325 698301010 697943192 697512360 697060089 696632309 696265488 695941467
1821.7 695941467 695560913 695015640 694320602 693641281 693135757 692769241 692324677 691626282 690728073 689855728
$$ packed form
1753.3G20628891P8964K671k27967m21066m36401l50495l80630o10428q39539p86514
1762.9G16657486m34189r6588q3466l59649o08597o23322n33218n91202q15353r46274
1772.5G11565628p66373l66287m6234R92j68076l86429n67016p10831q06198q09326
1782.2G06939850p26166o30722n59769m36706j73340J54572L02734Q8501l87879p91397
1791.8G03779678q44345n61752k02255j7090p1335k74506n21316p59201r44443j004257
1801.5F98579178q83103o12564k97317k3804J93176L66135M65241M35943K84729J10016
1811.1F98617630J4420L738r003r3460k32315l57818m30832m52271m27780l66821l24021
1821.7F95941467l80554n45273o95038o79321n05524l66516m44564o98395q98209q72345
$$ plain form
1831.4 689855728 689174042 688642197 688083420 687334747 686299820 684923782 683233490 681452942 680015640
1840.1 680015640 679347305 679574127 680442810 681533737 682547073 683386688 684034348 684431458 684514999
1848.7 684514999 684325790 684011078 683700562 683404617 683048935 682587280 682055435 681523132 681024857 680551682
1858.4 680551682 680084610 679609528 679102402 678533020 677901535 677255249 676637421 676010895 675251617 674246063
1868 674246063 673005219 671671524 670410385 669294510 668310852 667476044 666926498 666863174 667387543
1876.7 667387543 668384781 669569931 670652618 671472549 672011642 672322617 672472992 672530670 672544479 672496872
1886.3 672496872 672291565 671831512 671143112 670403671 669815292 669431992 669116058 668672104 668017120 667222977
1896 667222977 666415176 665657578 664931564 664188080 663390961 662518616 661570816 660607147 659773941 659256287
$$ packed form
1831.4F89855728o81686n31845n58777p48673j034927j376038j690292j780548j437302
1840.1F80015640o68335K26822Q68683J090927J013336Q39615O47660L97110Q3541
1848.7F84514999j89209l14712l10516k95945l55682m61655n31845n32303m98275m73175
1858.4F80551682m67072m75082n07126n69382o31485o46286o17828o26526p59278j005554
1868F74246063j240844j333695j261139j115875r83658q34808n49546o3324N24369
1876.7F67387543R97238J185150J082687Q19931N39093L10975J50375N7678J3809m7607
1886.3F72496872k05307m60053o88400p39441n88379l83300l15934m43954o54984p94143
1896F67222977q07801p57598p26014p43484p97119q72345r47800r63669q33206n17654
$$ plain form
1905.6 659256287 659174805 659507141 660100937 660759506 661333771 661773453 662117767 662439194 662762833 663021011
1915.3 663021011 663094788 662921906 662573395 662208176 661939468 661745377 661520004 661205673 660857086 660571365
1924.9 660571365 660362396 660125122 659719086 659083710 658272018 657395859 656548615 655769730 655044174 654319839
1934.6 654319839 653541718 652713165 651946259 651439514 651370773 651775589 652513733 653351669 654086761 654619293
1944.2 654619293 654940643 655088501 655118637 655097733 655087204 655110474 655132065 655078583 654892349 654575729 654189835
1954.8 654189835 653815842 653507309 653267822 653057480 652821274 652519836 652148209 651732483 651310883 650912323
1964.5 650912323 650550613 650228119 649935608 649643097 649299316 648857269 648319550 647759247 647287979 646981049
1974.1 646981049 646826019 646735992 646618118 646436768 646221695 646028595 645893860 645817337 645766830 645689697
$$ packed form
1905.6F59256287q1482L32336N93796O58569N74265M39682L44314L21427L23639K58178
1915.3F63021011P3777j72882l48511l65219k68708j94091k25373l14331l48587k85721
1924.9F60571365k08969k37274m06036o35376q11692q76159q47244p78885p25556p24335
1934.6F54319839p78121q28553p66906n06745o8741M04816P38144Q37936P35092N32532
1944.2F54619293L21350J47858L0136k0904j0529K3270K1591n3482j86234l16620l85894
1954.8F54189835l73993l08533k39487k10342k36206l01438l71627m15726m21600l98560
1964.5F50912323l61710l22494k92511Tl43781m42047n37719n60303m71268l06930
1974.1F46981049j55030r0027j17874j81350k15073j93100j34735p6523n0507p7133
$$ plain form
1983.7 645689697 645527802 645245667 644862518 644454498 644109802 643866959 643689880 643508072 643278198 643011169
1993.4 643011169 642745056 642504425 642297974 642141647 642065125 642076263 642123871 642110901 641960144 641672440
2003 641672440 641320114 640988083 640718460 640502625 640304565 640079880 639782104 639378624 638878059 638341370
2012.7 638341370 637845917 637429161 637068214 636719437 636377220 636084442 635884552 635769920 635685081 635578384
2022.3 635578384 635440979 635289993 635120239 634884529 634531441 634059334 633530579 633030090 632605820 632240181
2032 632240181 631869316 631424561 630868797 630210915 629499130 628797798 628157883 627596588 627099876 626642838
2041.6 626642838 626208801 625794182 625405617 625065308 624819412 624727325 624823990 625080719 625408821 625712204
2051.2 625712204 625946999 626140518 626355782 626639862 626999283 627406311 627817574 628187523 628476257 628658104
$$ packed form
1983.7F45689697j61895k82135l83149m08020l44696k42843j77079j81808k29874k67029
1993.4F43011169k66113k40631k06451j56327p6522J1138M7608j2970j50757k87704
2003F41672440l52326l32031k69623k15835j98060k24685k97776m03480n00565n36689
2012.7F38341370m95453m16756l60947l48777l42217k92778j99890j14632q4839j06697
2022.3F35578384j37405j50986j69754k35710l53088m72107n28755n00489m24270l65639
2032F32240181l70865m44755n55764o57882p11785p01332o39915n61295m96712m57038
2041.6F26642838m34037m14619l88565l40309k45896r2087R6665K56729L28102L03383
2051.2F25712204K34795J93519K15264K84080L59421M07028M11263L69949K88734J81847
$$ plain form
2060.9 628658104 628730278 628712349 628640327 628557968 628505287 628499718 628517761 628499870 628389130 628178406 627922859
2071.5 627922859 627701035 627553329 627454338 627338257 627150459 626880913 626558838 626226044 625915031 625643425
2081.1 625643425 625415840 625225487 625052185 624865685 624639244 624367332 624078407 623825302 623657112 623586502
2090.8 623586502 623579597 623576202 623527107 623418808 623272476 623126717 623019104 622975502 622998848 623059196 623096848
2101.4 623096848 623053017 622911949 622722244 622570419 622520599 622569580 622653503 622700462 622675858 622582932 622433090
2112 622433090 622228584 621980820 621733551 621542931 621421089 621307144 621110802 620799866 620440559 620146370
2121.6 620146370 619983940 619931488 619917336 619884491 619813652 619701691 619548149 619371986 619220772 619138527
2131.3 619138527 619113083 619068184 618920097 618646698 618304901 617983208 617743912 617596359 617503319 617401581
$$ packed form
2060.9F28658104P2174j7929p2022q2359n2681n569J8043j7891j10740k10724k55547
2071.5F27922859k21824j47706r8991j16081j87798k69546l22075l32794l11013k71606
2081.1F25643425k27585j90353j73302j86500k26441k71912k88925k53105j68190p0610
2090.8F23586502o905l395m9095j08299j46332j45759j07613m3602K3346O0348L7652
2101.4F23096848m3831j41068j89705j51825m9820M8981Q3923M6959k4604r2926j49842
2112F22433090k04506k47764k47269j90620j21842j13945j96342l10936l59307k94189
2121.6F20146370j62430n2452j4152l2845p0839j11961j53542j76163j51214q2245
2131.3F19138527k5444m4899j48087k73399l41797l21693k39296j47553r3040j01738
$$ plain form
2140.9 617401581 617227173 616950836 616601677 616253052 615970993 615771790 615629005 615518494 615442657 615406494
2150.6 615406494 615380554 615304680 615138588 614904175 614670830 614496994 614388199 614307480 614216080 614096947
2160.2 614096947 613946991 613762283 613545914 613324089 613140907 613022461 612945862 612849426 612679520 612431145
2169.9 612431145 612143211 611862183 611611595 611394081 611204910 611035957 610868073 610675888 610449753 610211296
2179.5 610211296 609998436 609832153 609698410 609564133 609403152 609205437 608970833 608705635 608429260 608174133
2189.1 608174133 607962151 607780762 607587395 607346840 607067451 606795692 606576576 606411552 606252823 606034088
2198.8 606034088 605713577 605300560 604849129 604423256 604056931 603740082 603438148 603129311 602826347 602567368
2208.4 602567368 602392120 602320137 602342644 602423973 602514381 602576332 602608948 602647362 602728271 602852058 602978401
$$ packed form
2140.9F17401581j74408k76337l49159l48625k82059j99203j42785j10511p5837l6163
2150.6F15406494k5940p5874j66092k34413k33345j73836j08795q0719r1400j19133
2160.2F14096947j49956j84708k16369k21825j83182j18446p6599r6436j69906k48375
2169.9F12431145k87934k81028k50588k17514j89171j68953j67884j92185k26135k38457
2179.5F10211296k12860j66283j33743j34277j60981j97715k34604k65198k76375k55127
2189.1F08174133k11982j81389j93367k40555k79389k71759k19116j65024j58729k18735
2198.8F06034088l20511m13017m51431m25873l66325l16849l01934l08837l02964k58979
2208.4F02567368j75248p1983K2507Q1329R0408O1951L2616L8414Q0909J23787J26343
$$ plain form
2219 602978401 603062592 603091202 603088417 603087997 603107109 603138428 603158379 603140411 603071289 602967949 602876930 602846870
2230.6 602846870 602889519 602969131 603032379 603049049 603022652 602969780 602900276 602820740 602741432 602663155 602556267
2241.2 602556267 602367744 602068748 601695786 601336937 601066399 600887527 600739059 600554237 600315285 600054245
2250.9 600054245 599809914 599589195 599366875 599118233 598846855 598581123 598348312 598153572 597983398 597823486
2260.5 597823486 597667923 597514000 597354927 597185364 597011986 596851082 596713829 596594849 596479492 596357231
2270.2 596357231 596223068 596066933 595874901 595649452 595423088 595237045 595095139 594942932 594703751 594345818
2279.8 594345818 593916206 593510056 593203278 593008537 592879982 592749290 592560692 592288132 591941071 591559601
2289.4 591559601 591197243 590893135 590648270 590426750 590182114 589890442 589562378 589228592 588910904 588605499
$$ packed form
2219F02978401Q4191K8610k785m20J9112L1319J9951j7968o9122j03340r1019l0060
2230.6F02846870M2649P9612O3248J6670k6397n2872o9504p9536p9308p8277j06888
2241.2F02556267j88523k98996l72962l58849k70538j78872j48468j84822k38952k61040
2250.9F00054245k44331k20719k22320k48642k71378k65732k32811j94740j70174j59912
2260.5E97823486j55563j53923j59073j69563j73378j60904j37253j18980j15357j22261
2270.2E96357231j34163j56135j92032k25449k26364j86043j41906j52207k39181l57933
2279.8E94345818m29612m06150l06778j94741j28555j30692j88598k72560l47061l81470
2289.4E91559601l62358l04108k44865k21520k44636k91672l28064l33786l17688l05405
$$ plain form
2299.1 588605499 588292503 587959900 587618141 587295074 587019844 586818237 586721077 586771164 586999741 587385597
2308.7 587385597 587828217 588174019 588290596 588143425 587816849 587460632 587194977 587039337 586913109 586703148
2318.4 586703148 586350937 585890617 585418587 585020065 584715042 584458885 584190521 583880348 583539238 583192291
2328 583192291 582849579 582505608 582164192 581855545 581622391 581481476 581401253 581317596 581178131 580975075
2337.7 580975075 580742683 580531807 580385399 580325050 580342941 580402908 580466042 580535507 580674248 580951881
2347.3 580951881 581348686 581712723 581834106 581579819 580963707 580088692 579048386 577911644 576800613
2356 576800613 575935555 575538330 575657158 576083260 576460075 576499825 576132355 575495262 574826889 574359016
2365.6 574359016 574256363 574577332 575250664 576094856 576897469 577513084 577915726 578174210 578386116 578616257
$$ packed form
2299.1E88605499l12996l32603l41759l23067k75230k01607r7160N0087K28577L85856
2308.7E87385597M42620L45802J16577j47171l26576l56217k65655j55640j26228k09961
2318.4E86703148l52211m60320m72030l98522l05023k56157k68364l10173l41110l46947
2328E83192291l42712l43971l41416l08647k33154j40915q0223q3657j39465k03056
2337.7E80975075k32392k10876j46408o0349J7891N9967O3134O9465J38741K77633
2347.3E80951881L96805L64037J21383k54287o16112q75015j040306j136742j111031
2356E76800613q65058l97225J18828M26102L76815L9750l67470o37093o68373m67873
2365.6E74359016j02653L20969O73332Q44192Q02613O15615M02642K58484K11906K30141
$$ plain form
2375.3 578616257 578873482 579121094 579308052 579401894 579407120 579360962 579311485 579296265 579327354 579387321 579437408
2385.9 579437408 579439545 579383621 579296379 579222488 579195023 579220390 579283981 579355545 579386177 579317627 579117203
2396.5 579117203 578815956 578501396 578258171 578108330 578010712 577910919 577783432 577623291 577418518 577151527
2406.1 577151527 576833839 576522179 576279793 576118088 575980301 575788383 575505104 575155678 574797935 574479256
2415.8 574479256 574215126 573990822 573776550 573541946 573275986 572997169 572748108 572571831 572490425 572498169
2425.4 572498169 572570953 572675438 572774734 572836342 572849045 572834167 572835121 572884750 572974167 573049965 573048096 572939987
2437 572939987 572757988 572575417 572453880 572397995 572356186 572270622 572127571 571961594 571811523 571680527
2446.6 571680527 571547165 571409035 571298599 571241608 571205711 571108284 570891724 570589104 570306396 570135345
$$ packed form
2375.3E78616257K57225K47612J86958R3842N226m6158m9477j5220L1089N9967N0087
2385.9E79437408K137n5924q7242p3891k7465K5367O3591P1564L0632o8550k00424
2396.5E79117203l01247l14560k43225j49841r7618r9793j27487j60141k04773k66991
2406.1E77151527l17688l11660k42386j61705j37787j91918k83279l49426l57743l18679
2415.8E74479256k64130k24304k14272k34604k65960k78817k49061j76277q1406P744
2425.4E72498169P2784J04485R9296O1608J2703j4878R54M9629Q9417P5798j869j08109
2437E72939987j81999j82571j21537n5885m1809q5564j43051j65977j50071j30996
2446.6E71680527j33362j38130j10436n6991l5897r7427k16560l02620k82708j71051
$$ plain form
2456.3 570135345 570081978 570077324 570044022 569948692 569797020 569602661 569373589 569125404 568890877 568705139
2465.9 568705139 568581390 568502617 568437462 568358231 568247604 568096313 567906380 567698822 567510033 567370377
2475.6 567370377 567278099 567196083 567078018 566904869 566698914 566504555 566354103 566248016 566158066 566045456
2485.2 566045456 565878067 565642509 565354614 565058441 564807281 564629555 564504089 564368629 564160156 563857460
2494.8 563857460 563497124 563151665 562888794 562738495 562684708 562681808 562678490 562633629 562521935 562340546 562115364
2505.5 562115364 561898956 561742363 561658096 561610069 561547546 561454811 561363945 561317520 561325264 561364822 561421089
2516.1 561421089 561512032 561662560 561857605 562031479 562112770 562081909 561983490 561890144 561853333 561879082 561933327
2526.7 561933327 561959610 561902390 561735458 561482162 561207848 560976944 560806046 560654259 560460777 560195122
$$ packed form
2456.3E70135345n3367m654l3302r5330j51672j94359k29072k48185k34527j85738
2465.9E68705139j23749p8773o5155p9231j10627j51291j89933k07558j88789j39656
2475.6E67370377r2278q2016j18065j73149k05955j94359j50452j06087q9950j12610
2485.2E66045456j67389k35558k87895k96173k51160j77726j25466j35460k08473l02696
2494.8E63857460l60336l45459k62871j50299n3787k900l318m4861j11694j81389k25182
2505.5E62115364k16408j56593q4267m8027o2523r2735r0866m6425P744L9558N6267
2516.1E61421089R0943J50528J95045J73874Q1291l0861r8419r3346l6811K5749N4245
2526.7E61933327K6283n7220j66932k53296k74314k30904j70898j51787j93482k65655
$$ plain form
2536.3 560195122 559878654 559562874 559296532 559109268 559011955 558989944 558991508 558936005 558760834 558475914
2546 558475914 558169823 557947693 557850533 557834549 557822037 557766800 557672310 557557411 557426872 557281113 557141075
2556.6 557141075 557044640 557011108 557016830 557011566 556958809 556855392 556719131 556565857 556403847 556243095 556097755
2567.2 556097755 555981255 555896454 555831451 555755806 555622864 555390816 555059586 554692955 554389915 554213753
2576.8 554213753 554136696 554057770 553882141 553596382 553273277 553009033 552849693 552762985 552665176 552477074
2586.5 552477074 552172241 551794014 551433029 551174355 551043396 550990944 550931015 550804939 550625725 550471916
2596.1 550471916 550445442 550620766 551009560 551545525 552098083 552522964 552733459 552746010 552659683 552578735
2605.7 552578735 552543335 552527504 552492943 552436066 552379303 552329330 552257042 552130089 551960144 551807365 551728630
$$ packed form
2536.3E60195122l16468l15780k66342j87264r7313k2011J564n5503j75171k84920
2546E58475914l06091k22130r7160j5984j2512n5237r4490j14899j30539j45759j40038
2556.6E57141075r6435l3532N722n264n2757j03417j36261j53274j62010j60752j45340
2567.2E56097755j16500q4801o5003p5645j32942k32048l31230l66631l03040j76162
2576.8E54213753p7057p8926j75629k85759l23105k64244j59340q6708r7809j88102
2586.5E52477074l04833l78227l60985k58674j30959n2452n9929j26076j79214j53809
2596.1E50471916k6474J75324L88794N35965N52558M24881K10495J2551q6327q0948
2605.7E52578735l5400j5831l4561n6877n6763m9973p2288j26953j69945j52779p8735
$$ plain form
2616.4 551728630 551720619 551715279 551636620 551467094 551261635 551099396 551017685 550986557 550940170 550829735 550650482
2627 550650482 550431442 550209579 550020027 549894447 549850349 549867096 549878120 549805260 549612617 549333382 549040756
2637.6 549040756 548792572 548605080 548470917 548389816 548370628 548403435 548438721 548404350 548247757 547969742
2647.2 547969742 547627296 547308273 547091103 547005272 547009964 547010384 546913452 546688995 546389351 546111755 545931664
2657.8 545931664 545862274 545857582 545844955 545754814 545544662 545220490 544848366 544531364 544347992 544296188 544292984
2668.4 544292984 544242058 544106445 543925247 543762245 543647537 543565178 543485947 543396378 543295059 543172722
2678.1 543172722 543010101 542799683 542559967 542325592 542125702 541974640 541875343 541816521 541761169 541650238
2687.7 541650238 541436348 541128235 540796471 540528450 540364532 540272751 540177460 540014381 539766808 539465103
$$ packed form
2616.4E51728630q011n340p8659j69526k05459j62239q1711l1128m6387j10435j79253
2627E50650482k19040k21863j89552j25580m4098J6747J1024p2860j92643k79235k92626
2637.6E49040756k48184j87492j34163q1101j9188L2807L5286l4371j56593k78015
2647.2E47969742l42446l19023k17170q5831M692M20r6932k24457k99644k77596j80091
2657.8E45931664o9390m692j2627r0141k10152l24172l72124l17002j83372n1804l204
2668.4E44292984n0926j35613j81198j63002j14708q2359p9231q9569j01319j22337
2678.1E43172722j62621k10418k39716k34375j99890j51062r9297n8822n5352j10931
2687.7E41650238k13890l08113l31764k68021j63918r1781r5291j63079k47573l01705
$$ plain form
2697.4 539465103 539161911 538902512 538704300 538549309 538393021 538188362 537914429 537591286 537270393 537008629
2707 537008629 536842384 536779251 536806526 536900787 537026367 537130775 537156410 537075500 536920319 536770973 536696663
2717.6 536696663 536697807 536704826 536641273 536490555 536308327 536170044 536107483 536088028 536047478 535940399 535767174
2728.2 535767174 535562172 535361633 535178452 535004692 534832268 534669495 534532204 534418488 534297943 534133377
2737.9 534133377 533916740 533679619 533465919 533295135 533152504 533009644 532846985 532656326 532429848 532159958
2747.5 532159958 531851196 531528130 531224632 530963860 530743713 530540276 530322609 530072060 529799232 529547615
2757.2 529547615 529374962 529315300 529349861 529409523 529411087 529302750 529089241 528824272 528580513 528411179
2766.8 528411179 528317986 528244820 528104935 527834320 527438431 526995621 526611748 526353188 526207428 526097031
$$ packed form
2697.4E39465103l03192k59399j98212j54991j56288k04659k73933l23143l20893k61764
2707E37008629j66245o3133K7275R4261J25580J04408K5635q0910j55181j49346p4310
2717.6E36696663J144P019o3553j50718j82228j38283o2561j9455m0550j07079j73225
2728.2E35767174k05002k00539j83181j73760j72424j62773j37291j13716j20545j64566
2737.9E34133377k16637k37121k13700j70784j42631j42860j62659j90659k26478k69890
2747.5E32159958l08762l23066l03498k60772k20147k03437k17667k50549k72828k51617
2757.2E29547615j72653n9662L4561N9662J564j08337k13509k64969k43759j69334
2766.8E28411179r3193p3166j39885k70615l95889m42810l83873k58560j45760j10397
$$ plain form
2776.4 526097031 525935707 525684776 525374298 525077057 524860001 524746361 524709206 524695740 524657402 524569130
2786.1 524569130 524427490 524239731 524016571 523774223 523538628 523339653 523195305 523098106 523016701 522912064
2795.7 522912064 522754326 522530098 522240334 521900368 521537285 521175652 520819740 520447693 520038643 519605370
2805.4 519605370 519196739 518857460 518583603 518323860 518024292 517665558 517253647 516787262 516250839 515645103
2815 515645103 515007095 514383354 513781548 513159790 512467575 511687737 510833855 509914055 508913994 507812996
2824.7 507812996 506594887 505225220 503624725 501687737 499340935 496593208 493547516 490413589
2832.4 490413589 487546387 485457268 484703560 485656853 488294182 492178040 496648369 501074638 505009117
2841.1 505009117 508205338 510584793 512214355 513269882 513952484 514389420 514605103 514586449 514368362
$$ packed form
2776.4E26097031j61324k50931l10478k97241k17056j13640l7155j3466l8338q8272
2786.1E24569130j41640j87759k23160k42348k35595j98975j44348r7199q1405j04637
2795.7E22912064j57738k24228k89764l39966l63083l61633l55912l72047m09050m33273
2805.4E19605370m08631l39279k73857k59743k99568l58734m11911m66385n36423o05736
2815E15645103o38008o23741o01806o21758o92215p79838q53882r19800j000061j100998
2824.7E07812996j218109j369667j600495j936988k346802k747727l045692l133927
2832.4D90413589k867202k089119p53708R53293K637329L883858M470329M426269L934479
2841.1E05009117L196221K379455J629562J055527O82602M36936K15683j8654k18087
$$ plain form
2849.7 514368362 514045525 513708000 513382263 513046494 512694778 512368088 512115860 511932640 511750374 511496964
2859.4 511496964 511162338 510803986 510487442 510225105 509969749 509662514 509281082 508846359 508393440 507947083
2869 507947083 507518578 507112198 506720657 506320114 505884132 505415497 504957848 504568672 504269600 504025307
2878.7 504025307 503770447 503454819 503064842 502611351 502111282 501578979 501020699 500422058 499745789 498965721
2888.3 498965721 498117142 497304878 496638718 496143837 495736885 495299034 494775581 494202423 493642769 493111343
2897.9 493111343 492569199 491979523 491349983 490717049 490103302 489510689 488949356 488457489 488079147 487829971
2907.6 487829971 487692680 487646103 487682800 487793999 487948227 488094482 488183746 488171806 488000526 487595673
2917.2 487595673 486907425 485957909 484833717 483615952 482317696 480895844 479320946 477619057 475837326
$$ packed form
2849.7E14368362l22837l37525l25737l35769l51716l26690k52228j83220j82266k53410
2859.4E11496964l34626l58352l16544k62337k55356l07235l81432m34723m52919m46357
2869E07947083m28505m06380l91541m00543m35982m68635m57649l89176k99072k44293
2878.7E04025307k54860l15628l89977m53491n00069n32303n58280n98641o76269p80068
2888.3D98965721q48579q12264o66160m94881m06952m37851n23453n73158n59654n31426
2897.9D93111343n42144n89676o29540o32934o13747n92613n61333m91867l78342k49176
2907.6D87829971j37291m6577L6697J11199J54228J46255Q9264j1940j71280m04853
2917.2D87595673o88248r49516j124192j217765j298256j421852j574898j701889j781731
$$ plain form
2925.9 475837326 473981972 472023048 469990463 468076134 466632118 466039047 466528206 468072853 470400696
2934.6 470400696 473094521 475723000 477952576 479620819 480745010 481459579 481904755 482136879 482118721
2943.3 482118721 481790123 481156311 480320625 479442940 478664627 478057327 477620735 477313194 477084923 476892815
2952.9 476892815 476696014 476444550 476077347 475539703 474807968 473901558 472865562 471739311 470538254
2961.6 470538254 469267464 467947502 466623764 465351410 464174232 463124199 462233238 461537628 461059341
2970.3 461059341 460786819 460677414 460684586 460780525 460951691 461174126 461399155 461561470 461599121 461460342
2979.9 461460342 461100922 460488472 459617081 458510857 457195244 455657730 453839798 451672440 449112625
2988.6 449112625 446138725 442738380 438971748 435132446 431875992 430121078 430665321 433716049
$$ packed form
2925.9D75837326j855354j958924k032585j914329j444016n93071M89159J544647K327843
2934.6D70400696K693825K628479K229576J668243J124191P14569M45176K32124j8158
2943.3D82118721l28598o33812q35686q77685p78313o07300m36592l07541k28271j92108
2952.9D76892815j96801k51464l67203n37644p31735r06410j035996j126251j201057
2961.6D70538254j270790j319962j323738j272354j177178j050033q90961o95610m78287
2970.3D61059341k72522j09405P172R5939J71166K22435K25029J62315L7651j38779
2979.9D61460342l59420o12450q71391j106224j315613j537514j817932k167358k559815
2988.6D49112625k973900l400345l766632l839302l256454j754914N44243L050728
$$ plain form
2996.3 433716049 438674126 444360161 449550514 453468895 455938225 457187996 457543678 457246704 456471062
3005 456471062 455419350 454344673 453458481 452820091 452326279 451822701 451239967 450637894 450133934 449797211
3014.6 449797211 449606628 449488487 449375038 449223595 449000587 448668594 448192596 447546768 446709518 445661316
3024.3 445661316 444404564 442983665 441471710 439925308 438357620 436766968 435197067 433761559
3032 433761559 432603416 431825981 431453094 431436768 431685944 432092781 432558479 433020821 433467751 433919029
3041.6 433919029 434387169 434860344 435320358 435771866 436246414 436772194 437338753 437885780 438322945 438582420
3051.3 438582420 438697548 438875999 439496384 440968132 443496513 446901932 450653076 454124031 456903687
3060 456903687 458932915 460395050 461492653 462327538 462976341 463643761 464691925 466464577 469035454
$$ packed form
2996.3D33716049M958077N686035N190353L918381K469330J249771L55682k96974p75642
3005D56471062j051712j074677q86192o38390m93812n03578n82734o02073n03960l36723
3014.6D49797211j90583j18141j13449j51443k23008l31993m75998o45828q37250j048202
3024.3D45661316j256752j420899j511955j546402j567688j590652j569901j435508
3032D33761559j158143p77435l72887j6326K49176M06837M65698M62342M46930M51278
3041.6D33919029M68140M73175M60014M51508M74548N25780N66559N47027M37165K59475
3051.3D38582420J15128J78451O20385J471748K528381L405419L751144L470955K779656
3060D56903687K029228J462135J097603Q34885O48803O67420J048164J772652K570877
$$ plain form
3068.6 469035454 472104912 475150490 477720184 479645119 481032906 482097740 482994080 483771172 484429131
3077.3 484429131 484979553 485447998 485845337 486163216 486415482 486683388 487114372 487858772 488984261
3086 488984261 490422516 491985168 493442078 494616280 495442123 495956612 496247253 496399269 496477432
3094.7 496477432 496527672 496577721 496626625 496652069 496643677 496637726 496708031 496909637 497224045 497560196 497813263
3105.3 497813263 497924843 497897568 497768440 497574768 497340317 497077789 496792679 496489067 496176682 495869522
3114.9 495869522 495570717 495261002 494910965 494515266 494107628 493731880 493395729 493062592 492698746 492323914
3124.6 492323914 492008667 491818810 491765785 491810608 491902542 492008858 492115746 492225227 492364655 492586365
3134.2 492586365 492931938 493379097 493826828 494149170 494282570 494267921 494214935 494220428 494306870 494421539
$$ packed form
3068.6D69035454L069458L045578K569694J924935J387787J064834Q96340P77092O57959
3077.3D84429131N50422M68445L97339L17879K52266K67906M30984P44400J125489
3086D88984261J438255J562652J456910J174202Q25843N14489K90641J52016P8163
3094.7D96477432N0240N0049M8904K5444q392n951P0305K01606L14408L36151K53067
3105.3D97813263J11580k7275j29128j93672k34451k62528k85110l03612l12385l07160
3114.9D95869522k98805l09715l50037l95699m07638l75748l36151l33137l63846l74832
3124.6D92323914l15247j89857n3025M4823R1934J06316J06888J09481J39428K21710
3134.2D92586365L45573M47159M47731L22342J33400j4649n2986N493Q6442J14669
$$ plain form
3143.9 494421539 494483223 494433899 494264221 494000854 493673782 493287849 492823982 492265892 491630173 490967560
3153.5 490967560 490333061 489746399 489178848 488579178 487920113 487229919 486580887 486039696 485613594 485241394
3163.1 485241394 484841690 484385185 483921547 483534851 483266830 483080368 482895470 482656746 482363548 482051582
3172.8 482051582 481762962 481538773 481419678 481423798 481513863 481602669 481615601 481553459 481489601 481498795 481591682
3183.4 481591682 481716080 481811218 481847000 481817741 481720810 481557693 481351891 481148109 480980530 480845528
3193 480845528 480707283 480528145 480289650 479991188 479641113 479257240 478867645 478497047 478143425 477774544
3202.7 477774544 477355499 476885300 476407127 475980263 475639381 475375748 475154800 474942703 474714737 474442596
3212.3 474442596 474093094 473658485 473193817 472805519 472575760 472483406 472407684 472227325 471922302 471574020
$$ packed form
3143.9D94421539O1684m9324j69678k63367l27072l85933m63867n58090o35719o62613
3153.5D90967560o34499n86662n67551n99670o59065o90194o49032n41191m26102l72200
3163.1D85241394l99704m56505m63638l86696k68021j86462j84898k38724k93198l11966
3172.8D82051582k88620k24189j19095M120R0065Q8806J2932o2142o3858R194R2887
3183.4D81591682J24398R5138L5782k9259r6931j63117k05802k03782j67579j35002
3193D80845528j38245j79138k38495k98462l50075l83873l89595l70598l53622l68881
3202.7D77774544m19045m70199m78173m26864l40882k63633k20948k12097k27966k72141
3212.3D74442596l49502m34609m64668l88298k29759r2354p5722j80359l05023l48282
$$ plain form
3222 471574020 471265602 470996704 470703087 470350456 469984589 469677658 469442635 469215584 468925056 468560410
3231.6 468560410 468165016 467780914 467414932 467055359 466696815 466337204 465963974 465567169 465169067 464823265
3241.3 464823265 464572983 464411316 464292717 464178352 464058647 463933830 463791924 463623123 463455772 463356743
3250.9 463356743 463379936 463510361 463660736 463726540 463650932 463451080 463191376 462929878 462676430 462394371
3260.5 462394371 462047806 461653709 461285553 461016312 460853653 460732765 460572968 460335312 460029716 459680061
3270.2 459680061 459301414 458903923 458497200 458075066 457611046 457094002 456571198 456132011 455823631 455585175
3279.8 455585175 455285149 454839401 454289932 453759384 453333092 452992020 452659836 452303886 451974754 451748581
3289.5 451748581 451636696 451553764 451377106 451037483 450562057 450033760 449516182 449013710 448498077 447959824
$$ packed form
3222D71574020l08418k68898k93617l52631l65867l06931k35023k27051k90528l64646
3231.6D68560410l95394l84102l65982l59573l58544l59611l73230l96805l98102l45802
3241.3D64823265k50282j61667j18599j14365j19705j24817j41906j68801j67351r9029
3250.9D63356743K3193J30425J50375O5804p5608j99852k59704k61498k53448k82059
3260.5D62394371l46565l94097l68156k69241j62659j20888j59797k37656l05596l49655
3270.2D59680061l78647l97491m06723m22134m64020n17044n22804m39187l08380k38456
3279.8D55585175l00026m45748n49469n30548m26292l41072l32184l55950l29132k26173
3289.5D51748581j11885q2932j76658l39623m75426n28297n17578n02472n15633n38253
$$ plain form
3299.1 447959824 447422523 446908493 446405182 445879402 445320511 444754868 444207001 443657074 443051682 442363472
3308.8 442363472 441629333 440920677 440274887 439660110 439006424 438265686 437444878 436590614 435749474 434940033
3318.4 434940033 434150200 433353500 432527733 431664963 430769196 429850960 428925171 428006706 427096863 426165886
3328.1 426165886 425161896 424053764 422872772 421698799 420590630 419529114 418438835 417270813
3335.8 417270813 416052818 414852715 413701057 412567673 411414795 410255928 409144974 408114777
3343.5 408114777 407142372 406181870 405214882 404253387 403294563 402296257 401210022 400034866 398828316
3352.2 398828316 397654915 396528854 395405731 394226837 392965584 391634331 390255013 388834457
3359.9 388834457 387373047 385892677 384444695 383079338 381802788 380572395 379347191 378145103
$$ packed form
3299.1D47959824n37301n14030n03311n25780n58891n65643n47867n49927o05392o88210
3308.8D42363472p34139p08656o45790o14777o53686p40738q20808q54264q41140q09441
3318.4D34940033p89833p96700q25767q62770q95767r18236r25789r18465r09843r30977
3328.1D26165886j003990j108132j180992j173973j108169j061516j090279j168022
3335.8D17270813j217995j200103j151658j133384j152878j158867j110954j030197
3343.5D08114777r72405r60502r66988r61495r58824r98306j086235j175156j206550
3352.2C98828316j173401j126061j123123j178894j261253j331253j379318j420556
3359.9C88834457j461410j480370j447982j365357j276550j230393j225204j202088
$$ plain form
3367.6 378145103 377044754 376119423 375368690 374717369 374087715 373468323 372915344 372492523 372216454
3376.3 372216454 372060165 371995468 372023849 372167931 372441063 372829704 373297501 373797035 374280090 374706421
3385.9 374706421 375056343 375339279 375588341 375839806 376113586 376408730 376712074 377006721 377271729 377481041
3395.6 377481041 377613564 377671661 377690048 377722015 377809639 377966080 378176651 378413620 378643227 378826180
3405.2 378826180 378925400 378926582 378859787 378793297 378803482 378941231 379223785 379647255 380201263 380867157 381612663
3415.8 381612663 382399483 383203163 384019318 384843025 385641327 386359520 386966019 387491684 388010674 388570633
3425.5 388570633 389141960 389641037 390005035 390239258 390399208 390538368 390679817 390821114 390942955 391014557
3435.1 391014557 391019249 390995750 391034546 391200562 391448860 391649895 391724243 391740227 391841240 392066841 392281532
$$ packed form
3367.6C78145103j100349r25331p50733o51321o29654o19392n52979m22821k76069
3376.3C72216454j56289o4697K8381J44082K73132L88641M67797M99534M83055M26331
3385.9C74706421L49922K82936K49062K51465K73780K95144L03344K94647K65008K09312
3395.6C77481041J32523N8097J8387L1967Q7624J56441K10571K36969K29607J82953
3405.2C78826180R9220J182o6795o6490J0185J37749K82554M23470N54008O65894P45506
3415.8C81612663P86820Q03680Q16155Q23707P98302P18193O06499N25665N18990N59959
3425.5C88570633N71327M99077L63998K34223J59950J39160J41449J41297J21841P1602
3435.1C91014557M692k3499L8796J66016K48298K01035P4348J5984J01013K25601K14691
$$ plain form
3445.7 392281532 392312431 392153091 391997185 392057228 392364349 392754250 393030319 393118477 393085327 393051758
3455.3 393051758 393110924 393291206 393543968 393758278 393829498 393758698 393681107 393770866 394090538 394536400
3465 394536400 394928856 395156441 395237389 395266800 395329170 395457344 395642624 395861282 396093407 396339302
3474.6 396339302 396621933 396957855 397313004 397597084 397727661 397717934 397695961 397819176 398153992 398632164
3484.3 398632164 399119110 399522705 399839478 400111961 400359993 400563278 400701485 400796471 400907288 401084213
3493.9 401084213 401329575 401602821 401865616 402125282 402432060 402822952 403261185 403641434 403880730 404016457
3503.6 404016457 404195824 404538155 405003471 405418434 405654793 405769997 405949516 406313362 406800919 407256508
3513.2 407256508 407601585 407890739 408215370 408598557 409006767 409425430 409869194 410312538 410661964 410842400
$$ packed form
3445.7C92281532L0899j59340j55906O0043L07121L89901K76069Q8158l3150l3569
3455.3C93051758N9166J80282K52762K14310P1220p0800p7591Q9759L19672M45862
3465C94536400L92456K27585Q0948K9411O2370J28174J85280K18658K32125K45895
3474.6C96339302K82631L35922L55149K84080J30577r727k1973J23215L34816M78172
3484.3C98632164M86946M03595L16773K72483K48032K03285J38207R4986J10817J76925
3493.9D01084213K45362K73246K62795K59666L06778L90892M38233L80249K39296J35727
3503.6D04016457J79367L42331M65316M14963K36359J15204J79519L63846M87557M55589
3513.2D07256508L45077K89154L24631L83187M08210M18663M43764M43344L49426J80436
$$ plain form
3522.9 410842400 410906029 411020393 411329269 411835098 412415428 412935524 413329010 413600502 413797417 413998222
3532.5 413998222 414294014 414735947 415289497 415859299 416376038 416850662 417336540 417851105 418352623 418791847
3542.1 418791847 419163857 419495773 419801598 420078392 420350876 420693893 421175766 421773148 422357635 422789192
3551.8 422789192 423030739 423175011 423361549 423674545 424109802 424618225 425158920 425716438 426296005 426923676
3561.4 426923676 427636566 428433113 429210510 429776459 429976616 429847374 429638481 429650192 430018883 430648613
3571.1 430648613 431340485 431975403 432569771 433181763 433810501 434409714 434978600 435590591 436314392 437126732
3580.7 437126732 437937965 438704567 439476967 440300751 441082230 441610832 441768227 441718979 441846771 442448387
3590.4 442448387 443460312 444492149 445148125 445345421 445354996 445558586 446155586 447053757 447986298 448722038
$$ packed form
3522.9D10842400O3629J14364L08876N05829N80330N20096L93486K71492J96915K00805
3532.5D13998222K95792M41933N53550N69802N16739M74624M85878N14565N01518M39224
3542.1D18791847L72010L31916L05825K76794K72484L43017M81873N97382N84487M31557
3551.8D22789192K41547J44272J86538L12996M35257N08423N40695N57518N79567O27671
3561.4D26923676P12890P96547P77397N65949K00157j29242k08893J1711L68691O29730
3571.1D30648613O91872O34918N94368O11992O28738N99213N68886O11991P23801Q12340
3580.7D37126732Q11233P66602P72400Q23784P81479N28602J57395m9248J27792O01616
3590.4D42448387J011925J031837O55976J97296R575K03590N97000Q98171R32541P35740
$$ plain form
3600 448722038 449213638 449609299 450140800 450954323 451982880 452957687 453586006 453786736 453785172 453945389
3609.6 453945389 454454803 455156174 455727921 456063499 456449318 457298584 458674393 460116425 460998840
3618.3 460998840 461077309 460663834 460291862 460293884 460725784 461570091 462797470 464160385 465096130 465080795
3628 465080795 464173775 463108139 462716064 463235703 464210472 465023537 465447845 465685272 466008568 466482658
3637.6 466482658 466988487 467385521 467608948 467708015 467874641 468378716 469350128 470576057 471570969 471898994
3647.3 471898994 471450500 470450020 469306450 468493462 468429832 469241219 470545845 471606712 471872368
3655.9 471872368 471423683 470840378 470633049 470856171 471242218 471557350 471740341 471821251 471903191 472207489
3665.6 472207489 472899971 473723793 473978004 473173027 471778488 471060181 471897964 473762093 475065117
$$ packed form
3600D48722038M91600L95661N31501Q13523J028557R74807O28319K00730j564J60217
3609.6D53945389N09414P01371N71747L35578L85819Q49266J375809J442032Q82415
3618.3D60998840P8469m13475l71972K022M31900Q44307J227379J362915R35745j5335
3628D65080795r07020j065636l92075N19639R74769Q13065M24308K37427L23296M74090
3637.6D66482658N05829L97034K23427R9067J66626N04075R71412J225929R94912L28025
3647.3D71898994m48494j000480j143570q12988o3630Q11387J304626J060867K65656
3655.9D71872368m48685n83305k07329K23122L86047L15132J82991Q0910Q1940L04298
3665.6D72207489O92482Q23822K54211q04977j394539p18307Q37783J864129J303024
$$ plain form
3674.3 475065117 474647217 472859192 471130295 470566444 471082153 471810150 472113609 472069321 472120018 472507935
3683.9 472507935 473107567 473642616 473900032 473766060 473223381 472407990 471626244 471212578 471316681 471816826
3693.5 471816826 472430077 472906952 473163185 473280792 473394051 473535690 473573761 473331375 472806664 472253189
3703.2 472253189 471986351 472100639 472418022 472729111 473015099 473356934 473666420 473644943 473102455 472266731
3712.8 472266731 471656075 471605225 471968422 472327652 472436943 472395363 472423668 472584724 472766609 472851753
3722.5 472851753 472796745 472578316 472186127 471731720 471483307 471680260 472292480 473017540 473530197 473688812
3732.1 473688812 473496246 472954750 472068939 470982208 470011253 469478264 469525986 470095291 470990181 471874771
3741.8 471874771 472281876 471849976 470714722 469609947 469367828 470174255 471326180 471810493 471168556
$$ packed form
3674.3D75065117m17900j788025j728897n63851N15709P27997L03459m4288N0697L87917
3683.9D72507935N99632N35049K57416j33972n42679q15391p81746m13666J04103N00145
3693.5D71816826O13251M76875K56233J17607J13259J41639L8071k42386n24711n53475
3703.2D72253189k66838J14288L17383L11089K85988L41835L09486k1477n42488q35724
3712.8D72266731o10656n0850L63197L59230J09291m1580K8305J61056J81885Q5144
3722.5D72851753n5008k18429l92189m54407k48413J96953O12220P25060N12657J58615
3732.1D73688812j92566n41496q85811j086731r70955n32989M7722N69305Q94890Q84590
3741.8D71874771M07105m31900j135254j104775k42119Q06427J151925M84313o41937
$$ plain form
3750.4 471168556 469819489 468604279 468099060 468342285 469047050 469882965 470540886 470726585 470317612
3759.1 470317612 469570847 469038620 469125099 469701653 470229988 470307045 470049248 469897995 470086670 470385513
3768.8 470385513 470388489 469971466 469393501 468991432 468885460 469007034 469288559 469687920 470039673 470045280
3778.4 470045280 469541969 468758354 468193169 468175888 468568153 468923187 468920021 468616791 468307190 468187981
3788 468187981 468191986 468129692 467959518 467884789 468142548 468677521 469086876 468992195 468493233 468136864 468309097
3798.7 468309097 468696594 468532066 467469711 466099319 465413704 465767250 466518021 466764221 466289825
3807.3 466289825 465648537 465430298 465697289 466177368 466725349 467321472 467726974 467524910 466692810 465912781
3817 465912781 465973015 466813126 467422409 466876793 465392876 464158707 464109421 465025482 465897751 466028557
$$ packed form
3750.4D71168556j349067j215210n05219K43225P04765Q35915O57921J85699m08973
3759.1D70317612p46765n32227Q6479N76554N28335P7057k57797j51253J88675K98843
3768.8D70385513K976m17023n77965m02069j05972J21574K81525L99361L51753N607
3778.4D70045280n03311p83615n65185j7281L92265L55034l166l03230l09601j19209
3788D68187981M005o2294j70174p4729K57759N34973M09355r4681m98962l56369J72233
3798.7D68309097L87497j64528j062355j370392o85615L53546P50771K46200m74396
3807.3D66289825o41288k18239K66991M80079N47981N96123M05502k02064q32100p80029
3817D65912781O0234Q40111O09283n45616j483917j234169m9286R16061Q72269J30806
$$ plain form
3826.6 466028557 465605240 465252800 465265388 465420570 465431900 465360260 465486908 465872307 466173019 465931892
3836.3 465931892 465024033 463805809 462845573 462498856 462693977 463066826 463282013 463250351 463093185 462972946
3845.9 462972946 462998581 463267250 463879166 464792023 465643196 465832253 464935760 463130264 461182175
3854.6 461182175 459937820 459742584 460300026 461059952 461713028 462310867 462958298 463488235 463535995 462967110
3864.2 462967110 462160759 461747818 461994171 462486229 462529907 461888351 461045609 460665398 460848732 461067810
3873.9 461067810 460861473 460440102 460419617 460984650 461536369 461338692 460438499 459735832 460042038 461165962
3883.5 461165962 462064056 461893921 460831871 459830284 459652252 460205612 460755196 460670586 459945908
3892.2 459945908 459105339 458713989 458968735 459634819 460270462 460513725 460254059 459641495 458965111 458477020
$$ packed form
3826.6D66028557m23317l52440J2588J55182J1330p1640J26648L85399L00712k41127
3836.3D65931892r07859j218224r60236l46717J95121L72849K15187l1662j57166j20239
3845.9D62972946K5635K68669O11916R12857Q51173J89057q96493j805496j948089
3854.6D61182175j244355j95236N57442P59926O53076N97839O47431N29937M7760n68885
3864.2D62967110q06351m12941K46353M92058M3678o41556q42742l80211J83334K19078
3873.9D61067810k06337m21371k0485N65033N51719j97677r00193p02667L06206J123924
3883.5D61165962Q98094j70135j062050j001587j78032N53360N49584q4610p24678
3892.2D59945908q40569l91350K54746O66084O35643K43263k59666o12564o76384m88091
$$ plain form
3901.8 458477020 458248024 458152809 458009987 457771873 457578468 457607956 457872963 458192139 458370819 458379478
3911.5 458379478 458331261 458315163 458300819 458206215 457997894 457695465 457325897 456936264 456638718 456562653
3921.1 456562653 456716728 456932220 456991158 456814575 456507378 456240807 456128082 456188622 456354294 456473122
3930.8 456473122 456367416 455977402 455450706 455036316 454868355 454886284 454974518 455110779 455315361 455495415
3940.4 455495415 455449753 455082779 454572372 454260521 454358063 454767570 455179977 455326881 455157967 454827118
3950.1 454827118 454534988 454371605 454288940 454208870 454130135 454098854 454098244 454034958 453871422 453706818 453656349
3960.7 453656349 453677483 453610001 453398437 453176880 453074112 453026543 452883110 452643661 452451553 452349663
3970.3 452349663 452207489 451959419 451764717 451775131 451847153 451699791 451343460 451099625 451104469 451046524
$$ packed form
3901.8D58477020k28996r5215j42822k38114j93405K9488K65007L19176J78680Q659
3911.5D58379478m8217j6098j4344r4604k08321l02429l69568l89633k97546p6065
3921.1D56562653J54075K15492N8938j76583l07197k66571j12725O0540J65672J18828
3930.8D56473122j05706l90014n26696m14390j67961J7929Q8234J36261K04582J80054
3940.4D55495415m5662l66974n10407l11851R7542M09507M12407J46904j68914l30849
3950.1D54827118k92130j63383q2665q0070p8735l1281o10o3286j63536j64604n0469
3960.7D53656349K1134o7482k11564k21557j02768m7569j43433k39449j92108j01890
3970.3D52349663j42174k48070j94702J0414P2022j47362l56331k43835M844n7945
$$ plain form
3980 451046524 450606384 449962883 449525185 449253654 448698807 447814980 447213440 447211113 447061844 445869637
3989.6 445869637 444097252 443116570 442880211 441271858 437148705 433173218 432572861 430993805 413259201
3998.3 413259201 362743378 277526207
4000.2 277526207
$$ packed form
3980D51046524m40140o43501m37698k71531n54847q83827o01540k327j49269j192207
3989.6D45869637j772385r80682k36359j608353m123153l975487o00357j579056j7734604
3998.3D13259201n0515823q5217171
4000.2B77526207
##END=$$ End of the data block
