##TITLE=$$ Begin of the data block
##JCAMP-DX=5.00 $$ ACD/SpecManager v 10.08
##SPECTROMETER/DATA SYSTEM=Varian
##DATE=30 Apr 2013 13:59:00
##DATA TYPE=INFRARED SPECTRUM
##DATA CLASS=XYDATA
##ORIGIN=
##OWNER=
##NPOINTS=3735
##FIRSTX=399.26403809
##LASTX=4000.35498047
##MAXX=4000.35498047
##MINX=399.26403809
##MAXY=80.87687683
##MINY=42.19606781
##XFACTOR=1.0000000000
##YFACTOR=0.000000100000000
##FIRSTY=45.80735016
##DELTAX=0.96440572
##XUNITS=1/CM
##YUNITS=TRANSMITTANCE
##XYDATA=(X++(Y..Y))
399.3D58073502J41159629Q6364327L3009491N462723L184585R101944R328690L455353
407G49140244j201706n88379K582397L842163K276840K71988k29721K37503k1286j632309
416.6G54677734l529968m033050k291947R79920L898544M783020L530197J655731P59812
425.3G60429993R88464J225967P17926O3935L40881J567841K515182K074814M64249
434G70389252j102906j668090j211319l01514M94308P84150L44009o99463j731033
442.7G65297394k005997j289444o4545R34754J303329J084366N09339j84708p74613
451.3G64809875j143341j454925k044602k957229l654328l401336k059174l94592N00793
460G48201141J16425j150436k474976l285523l481674l159790k321090r21402Q52279
$$ y = [458073502, 599233131, 685597458, 718606949, 724069672, 727254257, 736356201, 745684891, 749140244, 747938538, 747350159, 749932556, 753774719, 756051559, 756323547, 756093826, 756331329, 756310043, 754677734, 751147766, 747114716, 744822769, 745802689, 749701233, 754484253, 758014450, 759670181, 760429993, 761418457, 762644424, 763362350, 763426285, 763767166, 765335007, 767850189, 769925003, 770389252, 769286346, 767618256, 766406937, 766105423, 766599731, 767383881, 767727890, 767028427, 765297394, 763291397, 762001953, 761937408, 762872162, 764175491, 765259857, 765769196, 765584488, 764809875, 763666534, 762211609, 760167007, 757209778, 753555450, 750154114, 748094940, 747700348, 748201141, 748317566, 747167130, 744692154, 741406631, 737924957, 734765167, 732444077, 731522675, 732374954]
468.7G32374954K475815L367081L344726K820359K472534K657623L121567L300857
476.4G55935516K891617K081146J255036N95169M4937m07181n91583l80096L2882K13776
486.1G61671219j16806q10242j416168j549759j147537m54483J71585M78744M50287
494.7G57276840K46811L815l04032p50045j219635j436005j318130j226426j669235
503.4G49603958k729339l999329n238190o890945r516449j2480087j3526841j0275955
511.1F84946823k565231O692276J3284912J4663162J1457672O406174K002869q95844
518.9G35992813k669678l731155l952637l058395j215286R25903K686310L762130M236374
527.5G32976379M342423M261627M061585L707656L115006K254715J263885M34418L9902
$$ y = [732374954, 734850769, 738217850, 741562576, 744382935, 746855469, 749513092, 752634659, 755935516, 758827133, 760908279, 762163315, 762758484, 762803421, 762396240, 761804657, 761424561, 761457443, 761671219, 761554413, 760744171, 759328003, 757778244, 756630707, 756176224, 756347809, 756826553, 757276840, 757523651, 757527466, 757223434, 756473389, 755253754, 753817749, 752499619, 751273193, 749603958, 746874619, 742875290, 737637100, 730746155, 721229706, 708749619, 695222778, 684946823, 682381592, 689073868, 702358780, 717021942, 728479614, 734885788, 736888657, 735992813, 733323135, 729591980, 725639343, 722580948, 721365662, 722291565, 724977875, 728740005, 732976379, 737318802, 741580429, 745642014, 749349670, 752464676, 754719391, 755983276, 756417694, 756457596]
536.2G56457596J43356N56336R87320J210861J130371P44476J26877n42755r89304
544.9G59825134r67483m43344L40423R90982J216812R89991N06439j068m16489p27234
554.5G61314163q99200q10700l49960M03442J125946J413041J049346J55182q86612
563.2G62514648j643295j829071j408157o10886J58157N12009L06854k85873r26819
571.9G56787567j361236j530381j477203j205139o96869o3477L98789L65753k52991
580.6G50964813j220321k123261k633438k659912k320252j817703j339569j020966
588.3G35829391r50317j176147j693116k400512l098145l554764l649749l477555l294906
597G12534180l315888l510055l579483l134613j923829N1880K558365N180512P343139
$$ y = [756457596, 756600952, 757157288, 758144608, 759355469, 760485840, 761230316, 761357193, 760814438, 759825134, 758857651, 758414307, 758754730, 759745712, 760962524, 761952515, 762458954, 762457886, 762041397, 761314163, 760414963, 759604263, 759254303, 759657745, 760783691, 762196732, 763246078, 763401260, 762514648, 760871353, 759042282, 757634125, 757023239, 757181396, 757693405, 758000259, 757714386, 756787567, 755426331, 753895950, 752418747, 751213608, 750516739, 750453262, 750852051, 751217804, 750964813, 749744492, 747621231, 744987793, 742327881, 740007629, 738189926, 736850357, 735829391, 734879074, 733702927, 732009811, 729609299, 726511154, 722956390, 719306641, 715829086, 712534180, 709218292, 705708237, 702128754, 698994141, 697070312, 697122192, 699680557, 704861069, 712204208]
605.6G12204208Q386002P816544N675125K719955J50375j033782n89448R38263K682648
614.3G38949890L977814M541778M340439L450547K067413N18036q79975j992263k826996
623G52146683l307877l194427k359162j139373k79542l94287j451034k813492l793793
631.7G33413696m151916m098511l938293l796769l657302l526230l466721l476944
639.4G03301010l399811k991256k094803p84760O26450J739120K305985K399521K356567
648.1G03458023K518768K979126L549881L937989L943634L547668K915192K347030
655.8G29197311K121735K264938K470627K395706K101059K074509K620010L223343
663.5G48469238K784577P56454j941376l381729k254181Q93326M062271N473938M855805
$$ y = [712204208, 720590210, 728406754, 734081879, 736801834, 736952209, 735918427, 735328979, 736267242, 738949890, 742927704, 747469482, 751809921, 755260468, 757327881, 757845917, 756965942, 754973679, 752146683, 748838806, 745644379, 743285217, 742145844, 741866302, 741472015, 740020981, 737207489, 733413696, 729261780, 725163269, 721224976, 717428207, 713770905, 710244675, 706777954, 703301010, 699901199, 696909943, 694815140, 694030380, 694656830, 696395950, 698701935, 701101456, 703458023, 705976791, 708955917, 712505798, 716443787, 720387421, 723935089, 726850281, 729197311, 731319046, 733583984, 736054611, 738450317, 740551376, 742625885, 745245895, 748469238, 751253815, 752010269, 750068893, 746687164, 744432983, 745326309, 749388580, 754862518, 759718323]
672.2G59718323L246689J790161Q72116K83661j31913k24227J42364P51953J156769
680.9G67605896J085663O54068J80359j29090k88925l83453l87573j67008L44391R83505
690.5G69497833J399613J297683O86341j18332p47986j053162j125030j103058j054764
699.2G67679138j066665j342621k023621k846146l093185k099686R5368K622604M391403
707.9G62316589M879074M367600L496246K673111J903916J052780J25580o98014j206894
716.6G78909988j258239q09250J9836Q68912J219177O94351o40258k272568l588333
725.2G73143616m259873m357452m144821l815232l398437k836533k085113j163941
733G47082214j98516N46951P48062K34299q83332k419510m517593p674789j2009278
$$ y = [759718323, 762965012, 764755173, 765627289, 765910950, 765779037, 765554810, 765697174, 766449127, 767605896, 768691559, 769345627, 769525986, 769396896, 769107971, 768724518, 768336945, 768169937, 768514328, 769497833, 770897446, 772195129, 772881470, 772763138, 772015152, 770961990, 769836960, 768733902, 767679138, 766612473, 765269852, 763246231, 760400085, 757306900, 755207214, 755302582, 757925186, 762316589, 767195663, 771563263, 775059509, 777732620, 779636536, 780689316, 780814896, 780116882, 778909988, 777651749, 776842499, 776862335, 777731247, 778950424, 779644775, 779004517, 776731949, 773143616, 768883743, 764526291, 760381470, 756566238, 753167801, 750331268, 748246155, 747082214, 746883698, 747430649, 748178711, 748413010, 747529678, 745110168, 740592575, 732917786, 720908508]
741.6G20908508j6286010j7880936j4281845n227051O428223J6160888K0582810J9355316
749.3G29759903J4794388R809494O080932L750153K301178J417465J095276J274719
757.1G70283508J639023J800385J593933J149368P18002M68674M04663M21829M18854
765.7G78898239L73459L32260L31345L30429K37655O104l06702n80597p25937p37228
775.4G78159027o65741n75638n30929n95322p99332j088714j321182j362534j225357
784.1G69994278j119919j321564j940765k807083l645706m406433n357361o704483
791.8G42690964q021775q170394o049500j684723L394089P002945P783661O071853
799.5G43017120L455963J512299Q33511R93424J194763Q73718j26800j698914l629913
$$ y = [720908508, 704622498, 686741562, 672459717, 667232666, 673660889, 689821777, 710404587, 729759903, 744554291, 754363785, 760444717, 764194870, 766496048, 767913513, 769008789, 770283508, 771922531, 773722916, 775316849, 776466217, 777184219, 777652893, 778057556, 778479385, 778898239, 779271698, 779603958, 779935303, 780265732, 780503387, 780509491, 780202789, 779622192, 778896255, 778159027, 777493286, 776917648, 776386719, 775791397, 774992065, 773903351, 772582169, 771219635, 769994278, 768874359, 767552795, 765612030, 762804947, 759159241, 754752808, 749395447, 742690964, 734669189, 726498795, 720449295, 718764572, 722158661, 729161606, 736945267, 743017120, 746473083, 747985382, 748818893, 749812317, 751007080, 751880798, 751753998, 750055084, 746425171]
808.2G46425171n679093p637557r393464j0942382j2310791j3469620j4326859j4806442
815.9F57858963j4925690j4815292j4651680j4494133j4071121j2663422r301605l347473
823.6E59588547M825973J3584709K0567360K3823357K2855415J8864594J4023514J0263290
831.3F88396759Q375855P923660P869339P366943O170807M510803K726898J077042
839G34418106j52588m93088N43290K969818N957641Q100891Q272553O387558L372421
847.7G69376602L63693k067489l924408n138550n140457l267288L61862M488830P412644
856.4G62465439Q166580P108841N437317M178619L583908L314667K998734K532501
864.1G99786606J975021J340790O01120j52893o65741o97784k52076L94669Q92868
$$ y = [746425171, 740746078, 733108521, 723715057, 712772675, 700461884, 686992264, 672665405, 657858963, 642933273, 628117981, 613466301, 598972168, 584901047, 572237625, 562936020, 559588547, 564414520, 577999229, 598566589, 622389946, 645245361, 664109955, 678133469, 688396759, 696772614, 704696274, 712565613, 719932556, 726103363, 730614166, 733341064, 734418106, 734265518, 733772430, 734315720, 737285538, 743243179, 751344070, 759616623, 766004181, 769376602, 769740295, 767672806, 763748398, 758609848, 753469391, 750202103, 750563965, 755052795, 762465439, 770632019, 777740860, 783178177, 787356796, 790940704, 794255371, 797254105, 799786606, 801761627, 803102417, 803703537, 803550644, 802884903, 802187119, 801935043, 802329712, 803222580]
872.8H03222580J048584Q94165N85175K67028K2812j01013p3471J00784L59497N96543
882.4H06922684P08923O42395M09546Q5220k11410l61481l06930r6970J38702K72065
892.1H08202744K50854J05743j03607l16086m61044m52957k48184Q1711L58200M26788
901.7H07844162K88086Q3771n2567j22757k17743l61938m45633l37525n3176K29950
911.4H06854630L28216K10571m196j77383k50702k32544j40915m349J06964R2240r7962
922H06684570l98101o56739p33566n90591l15171p4615k3194k06222n49469r69162
931.6H02167740j494980k219849l052978l554459l152466j663665L71246J958618K361374
940.3G91720581J610565L64304o92291j302643j596833j758880j836243j836777j866149
$$ y = [803222580, 804271164, 805165329, 805750504, 806017532, 806040344, 805939331, 805865860, 805966644, 806326141, 806922684, 807631607, 808274002, 808683548, 808768768, 808557358, 808195877, 807888947, 807791977, 807930679, 808202744, 808453598, 808559341, 808455734, 808139648, 807678604, 807225647, 806977463, 807059174, 807417374, 807844162, 808132248, 808216019, 808163452, 808040695, 807822952, 807461014, 807015381, 806677856, 806624680, 806854630, 807182846, 807393417, 807389221, 807211838, 806961136, 806728592, 806587677, 806583328, 806690292, 806782532, 806684570, 806286469, 805629730, 804896164, 804305573, 803990402, 803915787, 803892593, 803686371, 803136902, 802167740, 800672760, 798452911, 795399933, 791845474, 788693008, 787029343, 787400589, 789359207, 791720581, 793331146, 793695450, 793003159, 791700516, 790103683, 788344803, 786508560, 784671783, 782805634]
949G82805634k066346k381668k458877j850663l95660J548386L255157M069824L820114
957.7G86345901K876435J840896J135483Q03833O44303M75006K90069K04773K86484
966.3G94903183M43039M61273J86386l05328p07932p24945l52401R7427K95105K23389
976G94519196J48468K60772M08097K55508l09372j014175j452484j445313j121902
984.7G90248795p31965m61578l97110n30090p47147r09271j011200j209564j579743
993.3G82671127j916809j959076j828308k033539k851486l951111n047989o948013
1001.1G56134796j1247635j8178100k4665757k5418930j7078170j829911J3371582
1007.8F71087875K1772995K1595841J6410522J1281433Q705750P820740O640472M387894
$$ y = [782805634, 780739288, 778357620, 775898743, 774048080, 773652420, 775200806, 778455963, 782525787, 786345901, 789222336, 791063232, 792198715, 793002548, 793646851, 794121857, 794411926, 794616699, 794903183, 795346222, 795807495, 795993881, 795688553, 794980621, 794255676, 793903275, 794000702, 794295807, 794519196, 794667664, 794928436, 795336533, 795592041, 795282669, 794268494, 792816010, 791370697, 790248795, 789516830, 789055252, 788658142, 788128052, 787380905, 786471634, 785460434, 784250870, 782671127, 780754318, 778795242, 776966934, 774933395, 772081909, 768130798, 763082809, 756134796, 744887161, 726709061, 702043304, 676624374, 659546204, 657716293, 671087875, 692860870, 714456711, 730867233, 742148666, 750854416, 758675156, 765315628, 769703522]
1015.5G69703522J818466M806o78939n32761p935N68848R57642J007232P52640L89023
1025.2G73982544O0806k71530p07169j201400j562729j658096j565171j486664j545410
1033.8G64045181j671371j659928j317901n88761L91388J331940J927261K029419J713868
1042.5G66201096J189041O34079J22451l27224o79627q80661r07516p95365o13250
1051.2G63943024m59824m75235q15353j528778k451401l293228l937989m667663n967255
1059.9G40346298p916183r693222r829407p245178k320481L020401O452485O785278
1067.6G19599991M610748J564713j084519l231125n489425q073731j0141601j0242615
1075.3F87512436p464829k280731L601608Q236084J0505295J0521622R215546P561874
$$ y = [769703522, 771521988, 771526794, 770847855, 770315094, 770307159, 770876007, 771833649, 772840881, 773593521, 773982544, 774043350, 773771820, 773064651, 771863251, 770300522, 768642426, 767077255, 765590591, 764045181, 762373810, 760713882, 759395981, 758807220, 759198608, 760530548, 762457809, 764487228, 766201096, 767390137, 768024216, 768146667, 767819443, 767139816, 766259155, 765351639, 764556274, 763943024, 763483200, 763007965, 762192612, 760663834, 758212433, 754919205, 750981216, 746313553, 740346298, 732430115, 722736893, 712907486, 705662308, 703341827, 706362228, 712814713, 719599991, 724210739, 725775452, 724690933, 721459808, 715970383, 707896652, 697755051, 687512436, 680047607, 677766876, 681368484, 689604568, 700109863, 710631485, 719847031, 727408905]
1083G27408905O058807M736786L505326K416381J636658J241379J100311R69849O73370
1091.7G49747772J83792m29916j085587j715774k249069k634812k913208l250046l867263
1100.4G31785889m925614o483154q550262j1113739j3983384j6545562j7729187j6411171
1108.1F36043816j2105370n416946K136993Q853874J3573876J5951080J6246109J4979401
1115.8F90262833J2721023J0005036P245330M662552K339859M08783q60672j233597
1123.5G25551147q16574j53274O7291n38254j839142l402862m898911o319198p868195
1132.2F99782028r681320j1652603j3476181j4812012j5417824j5158729j3957062
1139F05626297j1754684q544884m446411K37770N024795R335785J2634392J4571037
$$ y = [727408905, 733467712, 738204498, 741709824, 744126205, 745762863, 747004242, 748104553, 749074402, 749747772, 749931564, 749501648, 748416061, 746700287, 744451218, 741816406, 738903198, 735653152, 731785889, 726860275, 720377121, 711826859, 700713120, 686729736, 670184174, 652454987, 636043816, 623938446, 618521500, 620658493, 629512367, 643086243, 659037323, 675283432, 690262833, 702983856, 712988892, 720234222, 724896774, 727236633, 727645416, 726784744, 725551147, 724734573, 724581299, 724648590, 724110336, 722271194, 718868332, 713969421, 707650223, 699782028, 690100708, 678448105, 664971924, 650159912, 634742088, 619583359, 605626297, 593871613, 585326729, 580880318, 581118088, 586142883, 595478668, 608113060, 622684097]
1146.7F22684097J5081139J4395561J2948151J1208648R524308Q049850O792298N716857
1154.4G06400909M826661M158783L725433L469543L287354L093109K874298K687378
1162.1G34523468K604446K653656K799302K953109L013230K904129K609558K181473
1169.8G56242371J705246J249542Q29544M22592K899m64248j073685k002487l407669
1178.5G53504105n206986o902466p654419o660385l667068P26089N225144Q429260
1186.2G37793274R516754Q600845O545716M396133K831803J979827J606751J429825
1193.9G74700928J291504J135635R21936O13022K17819j87073n06057o90384p54624
1202.6G76742706p47757p31964p77511r45969j234589j535110j666489j494903j041642
$$ y = [622684097, 637765236, 652160797, 665108948, 676317596, 685841904, 693891754, 700684052, 706400909, 711227570, 715386353, 719111786, 722581329, 725868683, 728961792, 731836090, 734523468, 737127914, 739781570, 742580872, 745533981, 748547211, 751451340, 754060898, 756242371, 757947617, 759197159, 760026703, 760449295, 760452194, 759987946, 758914261, 756911774, 753504105, 748297119, 741394653, 733740234, 727079849, 723412781, 724138870, 729364014, 737793274, 747310028, 755910873, 762456589, 766852722, 769684525, 771664352, 773271103, 774700928, 775992432, 777128067, 778050003, 778663025, 778880844, 778693771, 778187714, 777497330, 776742706, 775994949, 775262985, 774485474, 773539505, 772304916, 770769806, 769103317, 767608414, 766566772]
1211.3G66566772m83627l8605J73722J73645N0812j43281m22744q05512j227798j537247
1220.9G62306137j584701j336365r05838m80957k09580j36795k19650l74680n13305
1229.6G56544266n56870m58526k40174J602J38245Q6136j47400m94156q79059j263656
1239.3G52730408j629257j954499k214279k413483k608871k886505l310700l885040
1247G31827774m564133n298843o080475o934891p868347q829651r758224j0691452
1254.7F71801758j1801682j3209762j4629746j5150108j3491860q764305j241455P460099
1262.4F00972939J5057220J9724503K0910759J9346237J6376953J3187790J0411834
1269.2G15988235Q191758O439972N032196L871460K892532K070389J421661R77860
$$ y = [766566772, 766083145, 766044540, 766218262, 766391907, 766442719, 766299438, 765876694, 765071182, 763843384, 762306137, 760721436, 759385071, 758479233, 757998276, 757788696, 757651901, 757432251, 757057571, 756544266, 755987396, 755528870, 755288696, 755290298, 755428543, 755514679, 755367279, 754873123, 753994064, 752730408, 751101151, 749146652, 746932373, 744518890, 741910019, 739023514, 735712814, 731827774, 727263641, 721964798, 715884323, 708949432, 701081085, 692251434, 682493210, 671801758, 660000076, 646790314, 632160568, 617010460, 603518600, 594754295, 593512840, 600972939, 616030159, 635754662, 656665421, 676011658, 692388611, 705576401, 715988235, 724179993, 730619965, 735652161, 739523621, 742416153, 744486542, 745908203, 746886063]
1276.9G46886063P48520P09457Q16727J008911J202774J303711J241684J009369O52771
1285.5G55579987K34756j95007n96161r54895j323395j832733k605820l623810m710083
1294.2G39972839n693817o581268p467880q187180q087921o332474k631302K224350
1301.9F97215347O622544R091110R194412P648392N642319M019088K952957K194291
1309.7G44580460J472854O80161j84021j092530j971054k651214k913590k628250j872253
1318.3G33420563r31397j77917J05057j52131p94448j549607k180099k576599k757569
1327G22405853k804641k810288k861404l026657l330460l729019m131775m457779m679871
1335.7F90573959m822006m915161m966965m964523m914246m868545m915848n130615
$$ y = [746886063, 747634583, 748344040, 749160767, 750169678, 751372452, 752676163, 753917847, 754927216, 755579987, 755814743, 755619736, 755023575, 754068680, 752745285, 750912552, 748306732, 744682922, 739972839, 734279022, 727697754, 720229874, 712042694, 703954773, 697622299, 694990997, 697215347, 703837891, 712929001, 722123413, 729771805, 735414124, 739433212, 742386169, 744580460, 746053314, 746733475, 746549454, 745456924, 743485870, 740834656, 737921066, 735292816, 733420563, 732489166, 732311249, 732416306, 732264175, 731469727, 729920120, 727740021, 725163422, 722405853, 719601212, 716790924, 713929520, 710902863, 707572403, 703843384, 699711609, 695253830, 690573959, 685751953, 680836792, 675869827, 670905304, 665991058, 661122513, 656206665, 651076050]
1343.4F51076050n522003o028595o561089p049103p452621p750206p938996q045501
1351.1E94727936q088951p987976p484475o205177l861198m34800L790207Q350411
1358.8E72805977J2727432J6391144J8832855J9696236J8967590J7046509J4580002
1365.6F91047745J2153549J0064774Q323211O802597N394898M063492K823181J708831
1373.3G42382278P73468J00708k07977r8038L55454R15070J273040J231995Q31146
1382G47557144L02963j21765l78418n73730q48999j246185j695481k112198k520370
1390.7G38362961l101502m095459n550384p059021p741776o648025l421173J261825
1398.4G02007446N899048Q959046R710845Q499833O341247M229126K668457J667481
$$ y = [651076050, 645554047, 639525452, 632964363, 625915260, 618462639, 610712433, 602773437, 594727936, 586638985, 578651009, 571166534, 564961357, 561100159, 560665359, 564455566, 572805977, 585533409, 601924553, 620757408, 640453644, 659421234, 676467743, 691047745, 703201294, 713266068, 721589279, 728391876, 733786774, 737850266, 740673447, 742382278, 743155746, 743256454, 743048477, 742950439, 743305893, 744220963, 745494003, 746725998, 747557144, 747860107, 747738342, 747359924, 746786194, 745937195, 744691010, 742995529, 740883331, 738362961, 735261459, 731166000, 725615616, 718556595, 710814819, 704166794, 700745621, 702007446, 707906494, 716865540, 726576385, 735076218, 741417465, 745646591, 748315048, 749982529]
1406.1G49982529J011886N39780K27356J13983K00653M18167O65589Q56704R23386
1414.8G54940033Q00858M60433k4719m61197o44760n28564k69165q7281o4926r7961
1424.4G54022751n9586J5335n5465l96195q95614j258927j261215r58710o69021p22809
1434.1G47760544j196289j847077k307815k385788k206650k065964k122192k234573
1441.8G31394196k111664j636277j006698n59387m45252n07202m59518j45264L81622
1450.5G24904556R62067J437912J640701J384430N84183n68848j615906k111053j950531
1459.1G24667511j451569j090545j154709j593628k145310k555465k716446k687683
1466.8G09272156k664337k918930l670350m911880o343689p557755q392105r131469
$$ y = [749982529, 750994415, 751534195, 751761551, 751875534, 752076187, 752494354, 753159943, 754016647, 754940033, 755740891, 756201324, 756176605, 755715408, 755070648, 754542084, 754272919, 754185638, 754120712, 754022751, 753963165, 753978500, 753923035, 753526840, 752631226, 751372299, 750111084, 749152374, 748483353, 747760544, 746564255, 744717178, 742409363, 740023575, 737816925, 735750961, 733628769, 731394196, 729282532, 727646255, 726639557, 726080170, 725634918, 725127716, 724668198, 724522934, 724904556, 725866623, 727304535, 728945236, 730329666, 730913849, 730345001, 728729095, 726618042, 724667511, 723215942, 722125397, 720970688, 719377060, 717231750, 714676285, 711959839, 709272156, 706607819, 703688889, 700018539, 695106659, 688762970, 681205215, 672813110, 663681641]
1474.6F63681641j0252381j1799011j2910728j2054596q008881r38339P314834J4092064
1482.3F29124603J7381363J6841660J3692093R691391O081009L240585J071091m94156
1490F96629639j393967j718369j900100k471314l592682m874649n739898n967789n851059
1498.7F63119812n800323n887070n892792n830192o275292p965050j0970001j4308395
1506.4F00190697j6520653j6697922j4991836j2219429r130440o140976l616333k072411
1514.1E18800697j855240k650451l531037l648834k886314j795922r63821n42412m02908
1522.8E00523758n62363j273498k680435m508553o216087p420769q113594q454819
1530.5D61293640q444633p842980o373977l936234o18896L394317P847328J2301369
$$ y = [663681641, 653429260, 641630249, 628719521, 616664925, 608656044, 607717705, 615032539, 629124603, 646505966, 663347626, 677039719, 686731110, 692812119, 696052704, 697123795, 696629639, 695235672, 693517303, 691617203, 689145889, 685553207, 680678558, 674938660, 668970871, 663119812, 657319489, 651432419, 645539627, 639709435, 633434143, 625469093, 614499092, 600190697, 583670044, 566972122, 551980286, 539760857, 530630417, 524489441, 520873108, 518800697, 516945457, 514295006, 510763969, 507115135, 504228821, 502432899, 501469078, 500926666, 500523758, 499961395, 498687897, 496007462, 491498909, 485282822, 477862053, 469748459, 461293640, 452849007, 445006027, 438632050, 434695816, 434076920, 437471237, 445318565, 457619934]
1538.2D57619934J6059494J8319244J8551140J6859856J3994980J0907135Q165207
1545E60476990N733413L314133Q74748j240806k733231l766556m807586o024094o995506
1553.6E44831505p177773o630821o100616o214257o604232n934678k913360K615623
1561.4E05871391R412537J5529137J9324112K0173530J8622933J6014175J3767128
1568.1F18714943J2616653J2286492J1848907J0491867Q066712N025711J971130p19986
1575.8F80302429k991257n087203p525864j0876160j5209160j9553909k2003899k0726547
1583.5E76328430j5262947p089767J087417O816063R092484Q512153O492958M288750
1591.2E90265541K468262J013756k73056j455765k414551k970428l019219k582321
$$ y = [457619934, 473679428, 491998672, 510549812, 527409668, 541404648, 552311783, 560476990, 566210403, 569524536, 570399284, 569158478, 566425247, 562658691, 557851105, 551827011, 544831505, 537653732, 531022911, 524922295, 518708038, 512103806, 506169128, 503255768, 505871391, 515283928, 530813065, 550137177, 570310707, 588933640, 604947815, 618714943, 631331596, 643618088, 655466995, 665958862, 674025574, 679051285, 681022415, 680302429, 677311172, 672223969, 664698105, 653821945, 638612785, 619058876, 597054977, 576328430, 561065483, 553975716, 555063133, 561879196, 570971680, 579483833, 585976791, 590265541, 592733803, 593747559, 593474503, 592018738, 589604187, 586633759, 583614540, 581032219]
1599E81032219j794281q55408L6926P56531J285744J684113K026100K349167K642517
1607.6E89163628K857170K925338K813187K603455K535400K908440L872947N266877
1615.4F14946442O662483P611351P900314P622833P038193O374970N742874N176239
1623.1F69075699M708328M377060M167709L986512L724212L353882K957230K633972
1630.8F98984604K388534K124787J765137J371841J128464J180496J479111J782455
1638.5G12205429J833801J567612J163559Q83179Q17032P90329N66330J80740L4485
1647.2G20042496N26123J520386K239151J845016K40021j734391k991714l146362k790451
1655.9G15750275k869339l853150n515365p385712r205093j0876923j2106857j2305298
$$ y = [581032219, 579237938, 578382530, 578419456, 579175987, 580461731, 582145844, 584171944, 586521111, 589163628, 592020798, 594946136, 597759323, 600362778, 602898178, 605806618, 609679565, 614946442, 621608925, 629220276, 637120590, 644743423, 651781616, 658156586, 663899460, 669075699, 673784027, 678161087, 682328796, 686315308, 690039520, 693393402, 696350632, 698984604, 701373138, 703497925, 705263062, 706634903, 707763367, 708943863, 710422974, 712205429, 714039230, 715606842, 716770401, 717653580, 718470612, 719260941, 719827271, 720008011, 720042496, 720568619, 722089005, 724328156, 726173172, 726413193, 724678802, 721687088, 718540726, 715750275, 712880936, 709027786, 703512421, 696126709, 686921616, 676044693, 663937836, 651632538]
1663.6F51632538j0945282p981720l901444N78156M803963Q260536J0568847J1580811
1671.3F64596405J1496429J0783921R894867R026336Q156433P260972O439590N810547
1679G33465500N327148M776078L996963L116379K518616K519760L022232L504867L435059
1687.7G65682602K756348J962967J630096J845550K128373J957092J343689Q13751
1695.4G80120468Q08258J172409J319733Q92105J65634k40707k3804N17807Q37174
1704.1G85569077P01370L54996J86157L25546N92117P61490P93915Q16803R30557J077957
1713.7G92109985J082383P95822K48489l13034n54047l00064K86026Q01544R42383
1722.4G95099487P57904N49546N14297N43213M15497J32980m3030P4616L08685K84043
$$ y = [651632538, 640687256, 632705536, 628804092, 629382248, 634186211, 642446747, 653015594, 664596405, 676092834, 686876755, 696771622, 705797958, 713954391, 721215363, 727654953, 733465500, 738792648, 743568726, 747565689, 750682068, 753200684, 755720444, 758742676, 762247543, 765682602, 768438950, 770401917, 772032013, 773877563, 776005936, 777963028, 779306717, 780120468, 780928726, 782101135, 783420868, 784312973, 784478607, 784237900, 784214096, 784731903, 785569077, 786270447, 786625443, 786811600, 787137146, 787729263, 788490753, 789284668, 790101471, 791032028, 792109985, 793192368, 793988190, 794236679, 793923645, 793369598, 793069534, 793355560, 794157104, 795099487, 795857391, 796406937, 796921234, 797464447, 797879944, 798012924, 797969894, 798044510, 798353195, 798637238]
1732G98637238j16578n52826n62362o9962N11933P07016M39300M4708j25198k8229
1741.7G98885040J30005J82953J53809J48773J88522J91498R1629o8817j62811q1635
1751.3G99658966J72043M59747N80597M22440Q3542j85395k06756n4093L1967q1558
1761H00881500k63977k81448q7586J06964Q5755j14288k50321j72272M731N1651q7967
1771.6G99872742k34680j91880K8076K32926K70462J67007N3177M807j526j8006n6839
1782.2H00126266j12533j90582k82822l21655k20642J4724K39334K74048P4158k12555
1791.8G99387741l71323l00369p0648J62354K90603K97928K25525J25046L9673J373
1801.5G99787903J4648M8142O9351Q3618J25885K06680K76108K63519J52588L82j18256
$$ y = [798637238, 798520660, 797967834, 797405472, 797335510, 797847443, 798554459, 798993759, 799038467, 798913269, 798885040, 799015045, 799197998, 799351807, 799500580, 799689102, 799880600, 799972229, 799903412, 799740601, 799658966, 799831009, 800290756, 800871353, 801293793, 801377335, 801191940, 800985184, 800931091, 800963058, 800881500, 800617523, 800336075, 800248489, 800355453, 800441208, 800326920, 800076599, 799904327, 799909058, 799960709, 799872742, 799638062, 799446182, 799474258, 799707184, 799977646, 800144653, 800197830, 800202637, 800201111, 800183105, 800126266, 800013733, 799823151, 799540329, 799218674, 798998032, 799012756, 799252090, 799526138, 799600296, 799387741, 799016418, 798716049, 798645401, 798807755, 799098358, 799396286, 799621811, 799746857, 799786530, 799787903, 799802551, 799850693, 799920044, 800003662, 800129547, 800336227, 800612335, 800875854, 801028442, 801028824, 800910568]
1812.1H00910568j72653j77917j45951p7438J6479J01166J56250K00730K49328K54974
1821.7H01315536J39466q4763k61230k18964K7085K45819K07977o8817l31116l53088
1831.4H00617905j57700L9444P7210n112n9662r232J01319J87912J99280J04293j24359
1842H00971298m49219p13882p24030m28771l739K84882L06778J45645k9984j39465
1851.6G99219513k09961k67563k73361j76163q697J18408J17264m731j65557k88620
1861.3G98060532l43094l26157k51617j60294j21231j87225l30811m42734m16412k48566
1870.9G95232391m5929O9962P3547M9362R6360K23617L39356L42407K11487Q087j85547
1881.5G96415100l19977l69796l18833j85089n4779m8981k18811m74319o46286o43616
$$ y = [800910568, 800737915, 800559998, 800414047, 800336609, 800353088, 800454254, 800610504, 800811234, 801060562, 801315536, 801455002, 801370239, 801109009, 800890045, 800917130, 801162949, 801370926, 801302109, 800970993, 800617905, 800460205, 800499649, 800576859, 800571747, 800512085, 800502853, 800604172, 800792084, 800991364, 801095657, 800971298, 800522079, 799808197, 799084167, 798655396, 798651657, 798936539, 799243317, 799388962, 799358978, 799219513, 799009552, 798741989, 798468628, 798292465, 798283768, 798402176, 798519440, 798514709, 798349152, 798060532, 797717438, 797391281, 797139664, 796979370, 796858139, 796670914, 796340103, 795897369, 795480957, 795232391, 795186462, 795256424, 795329971, 795379333, 795475693, 795699310, 796038666, 796381073, 796592560, 796600647, 796415100, 796095123, 795725327, 795406494, 795221405, 795166626, 795117645, 794898834, 794424515, 793778229, 793134613]
1891.2G93134613n30624m45099m41742m41284l34473j10245J33820K94800L59344L82004
1900.8G92001114M07028M25415M00925L17840J92490N8136n0659j07956j11923q3847
1910.4G93448563n0965j2665M6311J07040J00708l0822k47269m15115m21143k86179
1920.1G92238464j38931p9956q7128o9656N875P6370O7673q393o7215m7836L0136J08261
1931.7G92027664J53732J67618J39618M5548j01700k27814k52762j82724j11389j20697
1941.3G91537094j91040k24533j62048m9973J5564l738m9515l8223N3100J70288K42005
1951.9G91298981K36129J63651N3406o7368j65710k11411j88217j09787p477Q7204
1961.6G91089401J45722J39084M6386j11618k59628l06320k15607m5547R1781J19476
$$ y = [793134613, 792603989, 792158890, 791717148, 791275864, 790941391, 790831146, 790964966, 791259766, 791619110, 792001114, 792408142, 792833557, 793234482, 793552322, 793744812, 793802948, 793752289, 793644333, 793532410, 793448563, 793397598, 793384933, 793431244, 793538284, 793638992, 793608170, 793360901, 792945786, 792524643, 792238464, 792099533, 792019577, 791932449, 791862793, 791868668, 791945038, 792012711, 792004318, 791937103, 791889267, 791919403, 792027664, 792181396, 792349014, 792488632, 792534180, 792432480, 792204666, 791951904, 791769180, 791657791, 791537094, 791346054, 791121521, 790959473, 790909500, 790925064, 790921326, 790871811, 790833588, 790886688, 791056976, 791298981, 791535110, 791698761, 791752167, 791684799, 791519089, 791307678, 791119461, 791009674, 791002197, 791089401, 791235123, 791374207, 791420593, 791308975, 791049347, 790743027, 790527420, 790481873, 790573654, 790693130]
1971.2G90693130M9286m7683j12992j43356j68076j95999k02331j58081o8589K3423
1980.8G89668732P0877N1346k4796j26953k15378k56500k37808j78528j14060o9961
1990.5G88566971m5471k8534k0829m1503j00327j74637k20947k09503j43204m6387
2000.1G87535629N2567J26190J40610O9046p7439k36358l22953k91366j64261j3123
2009.8G86818542R8801J48239J45264J04370K9450p2022j77231k45132k41318j59683
2019.4G86449280k9755R5520J64642J50681N9814p0266j84708k33078j95618r2544
2029.1G86113968K1210Q8729Q2016J1673q5296j73187k25678k27661j75476q4458P401
2039.7G85353241N2795K5254o2638j62429k18583j98288j08718O942R1782J07651N0735
$$ y = [790693130, 790742416, 790694733, 790581741, 790438385, 790270309, 790074310, 789871979, 789713898, 789645309, 789668732, 789739609, 789790955, 789766159, 789639206, 789423828, 789167328, 788929520, 788750992, 788636932, 788566971, 788521500, 788492966, 788472137, 788430634, 788330307, 788155670, 787934723, 787725220, 787582016, 787535629, 787588196, 787714386, 787854996, 787924042, 787846603, 787610245, 787287292, 786995926, 786831665, 786818542, 786917343, 787065582, 787210846, 787315216, 787344666, 787272644, 787095413, 786850281, 786608963, 786449280, 786419525, 786515045, 786679687, 786830368, 786890182, 786819916, 786635208, 786402130, 786206512, 786113968, 786135178, 786223907, 786305923, 786317596, 786232300, 786059113, 785833435, 785605774, 785430298, 785345840, 785353241, 785406036, 785431290, 785368652, 785206223, 784987640, 784789352, 784680634, 784687576, 784779358, 784887009, 784937744]
2050.3G84937744n0964j59149k41852k73056k32239j17416L5629J54266J72196P8735
2059.9G84303894p2098j99661k53906k29798j46255k8153R1629J61133J33057M349
2069.6G83764191j66245k95257l34320k95105k19193j34048m3869M3106R1781O1188
2079.2G82472229m7913j76849k37350j78757k3346J55029K87552L47519L41339K79541
2088.9G83218994J65100J9074j06583j50299r3460J8005J12686J50147J44043J18713
2098.5G83596420P0725k3575j55106k56958k48184j10855Q0490K09961K04697P8659
2108.1G83446274r1171k25296k82593k61841j77689m6920J09939K55127L32947K96783
2117.8G83355560J43891o6147k41013l09448k63519j48011k1514Q0490J44043J57470
$$ y = [784937744, 784886780, 784727631, 784485779, 784212723, 783980484, 783863068, 783898697, 784052963, 784225159, 784303894, 784231796, 784032135, 783778229, 783548431, 783402176, 783374023, 783465652, 783626785, 783759842, 783764191, 783597946, 783302689, 782968369, 782673264, 782454071, 782320023, 782276154, 782319260, 782411041, 782472229, 782424316, 782247467, 782010117, 781831360, 781808014, 781963043, 782250595, 782598114, 782939453, 783218994, 783384094, 783403168, 783296585, 783146286, 783052826, 783070831, 783183517, 783333664, 783477707, 783596420, 783667145, 783643570, 783488464, 783231506, 782983322, 782872467, 782952957, 783162918, 783367615, 783446274, 783355103, 783129807, 782847214, 782585373, 782407684, 782360764, 782470703, 782725830, 783058777, 783355560, 783499451, 783433304, 783192291, 782882843, 782619324, 782471313, 782449799, 782530289, 782674332, 782831802]
2127.4G82831802J08567q40j34582k34299k53296j83868n6687P6676J68915J89285
2137.1G82511673J27182L81j46026k52457k73895k05612q6212K7771R2849R5444M2114
2147.7G81933212m8217j45112k08816k05078j29624k0446O8512J05819R9564P5683
2157.3G81525497M3793m577p1335j27106j30081o6757K3651P4539M0588o9122k01721
2167.9G81037369k97852l23868k80990j92719q8043Q011P8659J10092R3231K7695o9580
2178.5G80102005j64108k11182j83182q8272K7085J01318R5520J1597j12915k26899
2188.2G79350967k92511k92892k34757j42974n8976j9989m0512j00937j63803j99890
2197.8G77803726k01874j70440j00937J2054J47171K52533K72141J95694O9580l6469
$$ y = [782831802, 782940369, 782939529, 782804947, 782570648, 782317352, 782133484, 782076797, 782153473, 782322388, 782511673, 782638855, 782639236, 782493210, 782240753, 781966858, 781761246, 781675034, 781702805, 781795654, 781891098, 781933212, 781884995, 781739883, 781531067, 781325989, 781196365, 781175919, 781244431, 781350250, 781449814, 781525497, 781569290, 781564713, 781493378, 781366272, 781236191, 781169434, 781193085, 781267624, 781308212, 781239090, 781037369, 780739517, 780415649, 780134659, 779941940, 779853897, 779861908, 779940567, 780050659, 780143890, 780171585, 780102005, 779937897, 779726715, 779543533, 779455261, 779482346, 779583664, 779679184, 779690781, 779577866, 779350967, 779058456, 778765564, 778530807, 778387833, 778328857, 778308868, 778268356, 778167419, 778003616, 777803726, 777601852, 777431412, 777330475, 777342529, 777489700, 777742233, 778014374, 778210068, 778279648, 778243179]
2207.5G78243179q0337o5384j6327M9515J23520J86462K02713J47934L9139o7597j16424
2218.1G78646393q9264j3123O7749J17417J20544Q0948J6785m5853q7509j08261j24817
2228.7G78581009j42975j43967r8571n799Q9340J23444O6071n2796j65634k20184k09503
2239.3G77820435j61820j10855o9733l5019n722N494k3880r9869j96533k63062k54211
2249.9G76605225j68000m9896L2349L4485l9063j42364k17667k30179j85852j20163
2259.5G75518875p3471o3858q3847j14594j42822j61590j60218j25732o1417L128K7008
2270.2G74561462m272o0043q8272o1646l510M0589M1885J5717M58J8768N4932O5078
2281.7G74581146J3047j02997k52152l92837m97589n55344n60303n12314m25033l35083
$$ y = [778243179, 778162842, 778097458, 778081131, 778130646, 778254166, 778440628, 778643341, 778791275, 778830414, 778762817, 778646393, 778557129, 778544006, 778611755, 778729172, 778849716, 778930664, 778947449, 778901596, 778814087, 778705826, 778581009, 778438034, 778294067, 778195496, 778189697, 778279037, 778402481, 778468552, 778415756, 778250122, 778029938, 777820435, 777658615, 777547760, 777478027, 777443008, 777437286, 777442780, 777418900, 777319031, 777122498, 776859436, 776605225, 776437225, 776387329, 776419678, 776454163, 776415100, 776272736, 776055069, 775824890, 775639038, 775518875, 775445404, 775381546, 775297699, 775183105, 775040283, 774878693, 774718475, 774592743, 774531326, 774534454, 774561462, 774557190, 774497147, 774408875, 774347229, 774343719, 774384308, 774426193, 774441910, 774442368, 774461136, 774516068, 774581146, 774594193, 774491196, 774239044, 773846207, 773348618, 772793274, 772232971, 771720657, 771295624, 770960541]
2291.4G70960541k82517k81448l13568l53012l93830m50439n21011n71595n65033n08651
2301G66719437m66919n15442o67801q52356r64890r52453q62503p90940p92160q24585
2310.7G59029388q02154p01523o03943o25458q00323j053391j286468j469040j623077
2319.3G50064011j729966j694717j436768j003952n72891l27377l48587o01349r76868
2328G41371536j310653j405182j134720n84030n2643J57623O11k86561m28695l71170
2337.7G35956116k81372l19519m59290n25665l56827J04065Q21686J660537K338105
2346.3G38937836K471847J799774M24424j186676k489701l189621l332061l138733
2354.1G30297089k809983k447052k075729j671906j184539n96619L281M54483O70318
$$ y = [770960541, 770678024, 770396576, 770083008, 769729996, 769336166, 768885727, 768364716, 767793121, 767228088, 766719437, 766252518, 765737076, 765069275, 764216919, 763252029, 762299576, 761437073, 760646133, 759853973, 759029388, 758227234, 757525711, 756921768, 756296310, 755495987, 754442596, 753156128, 751687088, 750064011, 748334045, 746639328, 745202560, 744198608, 743625717, 743298340, 742949753, 742348404, 741371536, 740060883, 738655701, 737520981, 736936951, 736884308, 737041931, 737042542, 736755981, 736327286, 735956116, 735674744, 735355225, 734895935, 734370270, 734013443, 734117508, 734939194, 736599731, 738937836, 741409683, 743209457, 743633881, 742447205, 739957504, 736767883, 733435822, 730297089, 727487106, 725040054, 722964325, 721292419, 720107880, 719511261, 719514542, 719969025, 720639343]
2362.7G20639343P50275R09042J279145J791000K257461K550965K682724K728729K722550
2371.4G38311234K645263K495270K327194K213288K176208K179031K167054K113342
2379.1G56627884K023544J912308J781235J617279J409149J164856R14993O96030N22766
2387.8G68670044L81088K51389J36795O1493L8452N0812O4544O2714M8141K1515l2959
2398.4G69754028j22604k16675k57950k15759j25427o1493p0572j26801j62429j36719
2408.1G68257599p3700l5172n8364j23673j76086j77155j31531o8206j1063L2883N7449
2418.7G67492981M9286K823n7144q5602n6916O562N1269M4174L815k3880r994L1280
2430.2G67448654N6992L1585m9362j51443k17819k03934j13754p401L9444n34q1558
$$ y = [720639343, 721389618, 722298660, 723577805, 725368805, 727626266, 730177231, 732859955, 735588684, 738311234, 740956497, 743451767, 745778961, 747992249, 750168457, 752347488, 754514542, 756627884, 758651428, 760563736, 762344971, 763962250, 765371399, 766536255, 767451248, 768147278, 768670044, 769051132, 769302521, 769439316, 769500809, 769539261, 769590073, 769654617, 769717331, 769765472, 769786987, 769754028, 769631424, 769414749, 769156799, 768941040, 768815613, 768754120, 768683548, 768556747, 768394318, 768257599, 768183899, 768148727, 768090363, 767966690, 767790604, 767613449, 767481918, 767413712, 767402649, 767435532, 767492981, 767542267, 767545090, 767487946, 767402344, 767345428, 767351990, 767403259, 767447433, 767451248, 767427368, 767417374, 767448654, 767505646, 767537231, 767487869, 767336426, 767118607, 766914673, 766800919, 766793518, 766832962, 766832428, 766750870]
2440.8G66750870j30463j16959p4615n3787o1112n9127j9303L8757O5003L2120m1657
2451.5G66329727j15814j65939j91880j96838j78986j36718q4610m4403k9602l7766
2461.1G65147171o1798r9793j48315j88980j93405j43967n0659N2948J29166J51519
2470.7G64593887J08490Q774j13983k07672k31552j85623j10703n4855l1510k2125
2480.4G63753128r384l204k5864p7362j22147j19400n8059L1662J05819J36795J20774
2491G63732758P1563P096n1194r1323j10169j09482q4152k1896P5226J73873K20566
2501.6G63812866J84403Q2016l3341j14059j43814j31760r7504o2027m5623n9204q6213
2512.2G63305740r5367p0572l3417k5711o3858j19247j51215j47400j33896j36108
$$ y = [766750870, 766620407, 766503448, 766428833, 766375046, 766313934, 766254807, 766235504, 766274261, 766339264, 766371384, 766329727, 766213913, 766047974, 765856094, 765659256, 765480270, 765343552, 765258942, 765214539, 765184937, 765147171, 765085373, 764985580, 764837265, 764648285, 764454880, 764310913, 764260254, 764313202, 764442368, 764593887, 764702377, 764711151, 764597168, 764389496, 764157944, 763972321, 763861618, 763806763, 763775253, 763753128, 763743744, 763740540, 763714676, 763637314, 763515167, 763395767, 763337708, 763369370, 763475189, 763611984, 763732758, 763804321, 763811417, 763760223, 763668900, 763558731, 763449249, 763365097, 763343201, 763418427, 763592300, 763812866, 763997269, 764079285, 764045944, 763931885, 763788071, 763656311, 763558807, 763496780, 763451157, 763391953, 763305740, 763210373, 763139801, 763106384, 763080673, 763016815, 762897568, 762746353, 762598953, 762465057, 762328949]
2521.9G62328949j44653j30768q2627k6016N951R308O561J5183K0523p401p6141j56708
2533.4G61762161k02713j87607j22299m2648J3657K4871o485n8899j01547j08566p6828
2544G60893097k5864J2894J6479j8844p5760j31073j66092j76849j72043j61133j50528
2554.6G59844284j35803j15738r3155p4615o6529p1182q7357j07269j15280r6054n1651
2565.2G58829651j4191k4872r7808j97525k62757k60315k08511j55792j31836j30387
2574.9G57345657j31836j30462j32752j37558j31683j13983j07804j33438j73339j73874
2584.5G55978928j03913M959Q0338Q1558M0817J8006L4790N5465M5548K1362K7848
2595.1G56285706P1868R8801N3177m8370j21842j05209k4719L6468L1052n036n188
$$ y = [762328949, 762184296, 762053528, 761970901, 761944885, 761950836, 761960144, 761966705, 761981888, 762002411, 761995010, 761918869, 761762161, 761559448, 761371841, 761249542, 761206894, 761220551, 761245422, 761238937, 761180038, 761078491, 760969925, 760893097, 760867233, 760880127, 760896606, 760877762, 760802002, 760670929, 760504837, 760327988, 760155945, 759994812, 759844284, 759708481, 759592743, 759499588, 759424973, 759358444, 759287262, 759199905, 759092636, 758977356, 758881302, 758829651, 758815460, 758790588, 758692780, 758495255, 758232498, 757972183, 757763672, 757607880, 757476044, 757345657, 757213821, 757083359, 756950607, 756813049, 756681366, 756567383, 756459579, 756326141, 756152802, 755978928, 755875015, 755879974, 755960312, 756041870, 756082687, 756100693, 756135483, 756190948, 756236496, 756257858, 756285706, 756357574, 756456375, 756509552, 756461182, 756339340, 756234131, 756209412, 756245880, 756276932, 756271896, 756266708]
2605.7G56266708M5395R1400P5379R003l8453j2970O4240J17798R1781l738j06583
2616.4G56599960j57547j44043r5367n1041l0136k5406k4109k3727l4409o2027r3460
2627G55858688j04828q3160m4174j8387k8152o5384j04905j24740j23062j14136j12228
2637.6G54935532j17951j23291j17264r9029p6065n9586n6000o5841q2855r9717j10016
2648.2G53927917j11160j06888r9487q8043o6910l6011j1749j7090o0043j14975j39313
2658.8G53076248j11847n7983l0365o0883j30157j87607j95084j54495r8724n7678
2668.4G51991425l9902l3570k4948j4267j6174m3869r0561j25503j18714p2860k6780
2679G51384277k0828n9967j11618j50681j84936k38724l06473l41034k97546j82419
$$ y = [756266708, 756312103, 756403503, 756478882, 756487885, 756449432, 756436462, 756500702, 756618500, 756710281, 756706543, 756599960, 756442413, 756298370, 756203003, 756151962, 756121826, 756096420, 756072311, 756048584, 756014175, 755952148, 755858688, 755753860, 755670700, 755626526, 755608139, 755579987, 755514603, 755409698, 755284958, 755161896, 755047760, 754935532, 754817581, 754694290, 754577026, 754477997, 754401932, 754342346, 754286346, 754220505, 754137650, 754037933, 753927917, 753816757, 753709869, 753610382, 753522339, 753455429, 753419418, 753407669, 753390579, 753330536, 753215561, 753076248, 752964401, 752906418, 752876053, 752815170, 752685013, 752497406, 752302322, 752147827, 752049103, 751991425, 751951523, 751917953, 751893005, 751878738, 751862564, 751818695, 751728134, 751602631, 751483917, 751411057, 751384277, 751363449, 751303482, 751191864, 751041183, 750856247, 750617523, 750311050, 749970016, 749672470, 749490051]
2688.7G49490051n7068J6480K0676j5946n6381q0872q4915o8512l5095J068K3499K4337
2700.3G49177322N036l3112r4909j71128k25677k11487j13907K1896J17188J22986
2709.9G48594208N6152k1744o3934p7057r5672j35727j67542j40686m1275Q5602J60522
2720.5G48152847J30997N341j62201l12882m09622m30527l59421k03857k1744Q7128
2730.2G46476059M7226j27258l26538m26941l81394k41012r5292M960O5689J09253
2739.8G45104752J37863J37253J07650P0801M5929K4109j8463q6441j46637j57929
2749.4G45218887j16043o4468n7373j08643j76620k02332j63727r3155m8294o0806
2759.1G44127426j18027j80664k18963k28958k22931k14310k10571k17057k32772k45209
$$ y = [749490051, 749432983, 749449463, 749470139, 749454193, 749397812, 749316940, 749232025, 749163513, 749128418, 749129486, 749152985, 749177322, 749182358, 749149246, 749054337, 748883209, 748657532, 748446045, 748332138, 748354034, 748471222, 748594208, 748650360, 748628616, 748564682, 748487625, 748391953, 748256226, 748088684, 747947998, 747906723, 747992325, 748152847, 748283844, 748289185, 748126984, 747814102, 747404480, 746973953, 746614532, 746410675, 746388931, 746476059, 746523285, 746396027, 746069489, 745642548, 745261154, 745020142, 744924850, 744929810, 744995499, 745104752, 745242615, 745379868, 745487518, 745558319, 745604248, 745628357, 745609894, 745523453, 745376816, 745218887, 745102844, 745038376, 744981003, 744872360, 744695740, 744493408, 744329681, 744236526, 744188232, 744127426, 744009399, 743828735, 743609772, 743380814, 743157883, 742943573, 742733002, 742515945, 742283173, 742037964]
2768.7G42037964k32926j87606j28022r0179r8724j41678j83411j93329j64184j10016
2778.4G40507889n0507n646K594l6544j04294j51062j31455m9591L2501L8376n7068
2789G39995193k01644l07618l17001k42996j50986j01013j07269j38703j54419j39236
2798.6G38134308j13220j06583j37482j93939k46124k62146k26898j52283p4997m1657
2808.3G36578979p9879j75095k73132l15323k83661k11487j57470j57776k04087k58102
2817.9G34462967k85034k76566k46353k17819k06299k13928k28882k32544k13776j79596
2827.6G32162170j52511j48010j62583j81427k01263k37274l05024l94821m74701n21698
2837.2G29382858n48477n86853o45981o89697o69251n69992m35943l31040k91137l04108
$$ y = [742037964, 741805038, 741617432, 741489410, 741399231, 741300507, 741158829, 740975418, 740782089, 740617905, 740507889, 740457382, 740451736, 740454330, 740417786, 740313492, 740162430, 740030975, 739981384, 740013885, 740052261, 739995193, 739793549, 739485931, 739168930, 738925934, 738774948, 738673935, 738566666, 738427963, 738273544, 738134308, 738021088, 737914505, 737777023, 737583084, 737336960, 737074814, 736847916, 736695633, 736620636, 736578979, 736499100, 736324005, 736050873, 735735550, 735451889, 735240402, 735082932, 734925156, 734721069, 734462967, 734177933, 733901367, 733655014, 733437195, 733230896, 733016968, 732788086, 732555542, 732341766, 732162170, 732009659, 731861649, 731699066, 731517639, 731316376, 731079102, 730774078, 730379257, 729904556, 729382858, 728834381, 728247528, 727601547, 726911850, 726242599, 725672607, 725236664, 724905624, 724614487, 724310379]
2846.8G24310379l31116l45611l42102l29361l18375l17535l25928l25851k93122k23923
2856.5G21157455j53579j36795j95160k88315l48663l46299l17077l18527l67432m21600
2866.1G18264008m23584l53241k31858j01700p6M4098J7090o1493j40152j72806j62887
2876.7G16677399j55030j85012k37656k71454k75421k83814l22189l62091l45535k59552
2886.4G13979645j66168j43509k00425k68554k79541k40479k22702k84652m12598n35813
2896G11225204n89752n61676m93011m46549m71649n74188p08160q03223q17642p77970
2905.7G04981384p60040q25882r63287j091996j126861j041641q78296o98090n28564
2914.3F97066727l55988j70135m349P3624K6702j00402j97907j85013p8125L2730P5150
$$ y = [724310379, 723979263, 723633652, 723291550, 722962189, 722643814, 722326279, 722000351, 721674500, 721381378, 721157455, 721003876, 720867081, 720671921, 720383606, 720034943, 719688644, 719371567, 719053040, 718685608, 718264008, 717840424, 717487183, 717255325, 717153625, 717153549, 717197647, 717214737, 717153244, 717013092, 716840286, 716677399, 716522369, 716337357, 716099701, 715828247, 715552826, 715269012, 714946823, 714584732, 714239197, 713979645, 713813477, 713669968, 713469543, 713200989, 712921448, 712680969, 712458267, 712173615, 711761017, 711225204, 710635452, 710073776, 709580765, 709134216, 708662567, 708088379, 707380219, 706576996, 705759354, 704981384, 704221344, 703395462, 702432175, 701340179, 700213318, 699171677, 698293381, 697595291, 697066727, 696710739, 696540604, 696536255, 696609879, 696636581, 696536179, 696338272, 696153259, 696075134, 696107864, 696183014]
2925F96183014O5689P3624J31759J89514J65177L8528j22223k22778k29340j91497
2934.6F96081467j88217k61002l90472n27115o33850p07474p67212q31223r03091r76639
2944.2F89895172j051559j133881j217117j266938j231613j086425q57239o03180l69644
2952.9F81077576j71357j7623O1569L7613p0343j92948k74963l35159m42963o27594
2962.6F79043808q26187r36432r21936q41827p78962p52563p20596o58188n99442n96542
2972.2F71411133o43158o73523o34995n45806m65317m23050l88642l20968k20490j29394
2981.8F66965790p7973n1345r308P5073J92947L17154M16489M62646M38919L56141
2991.5F69086533K54364J78604J44958J36719J35879J53504K22931L57666N25589O63605
$$ y = [696183014, 696248703, 696322327, 696454086, 696643600, 696808777, 696847305, 696725082, 696502304, 696272964, 696081467, 695893250, 695632248, 695241776, 694714661, 694080811, 693373337, 692606125, 691774902, 690871811, 689895172, 688843613, 687709732, 686492615, 685225677, 683994064, 682907639, 682050400, 681447220, 681077576, 680906219, 680888596, 680950165, 680987778, 680917435, 680724487, 680449524, 680114365, 679671402, 679043808, 678217621, 677281189, 676359253, 675517426, 674738464, 673985901, 673265305, 672607117, 672007675, 671411133, 670767975, 670094452, 669459457, 668913651, 668448334, 668025284, 667636642, 667315674, 667095184, 666965790, 666887817, 666836472, 666827164, 666902237, 667095184, 667412338, 667828827, 668291473, 668730392, 669086533, 669340897, 669519501, 669664459, 669801178, 669937057, 670090561, 670313492, 670671158, 671196747, 671860352]
3001.1F71860352P23266P06711O66580O70929P56836Q94470R99298R86939Q40988O34308
3010.8F79740677M71344M01153L81165L29819K10876O6681l7079q5373j27945k27432
3020.4F81123886l97797o00509p79190q86765q82263p23419l87726R4070O33469J120072
3030.1F78313828J461639J602478J526565J274796R58481P27157O81763P97501R48105
3038.7F88292313J011657R64661Q70514P85370O97250N62439L81394K18124J40533
3047.4F93924255J47705J82114J88599J65786J43204J34659J25961J04904R0180J17569
3057.1F95324936K04773L31802M57535N51682O06308O28585O26297O04248N70908N42450
3066.7G00449524N39093N68085O15234O47965O37741N81665M96673L99552K92129J73035
$$ y = [671860352, 672583618, 673290329, 673956909, 674627838, 675384674, 676279144, 677278442, 678265381, 679106369, 679740677, 680212021, 680613174, 680994339, 681324158, 681535034, 681601715, 681564636, 681479263, 681351318, 681123886, 680726089, 680125580, 679346390, 678459625, 677577362, 676853943, 676466217, 676560287, 677193756, 678313828, 679775467, 681377945, 682904510, 684179306, 685137787, 685864944, 686546707, 687344208, 688292313, 689303970, 690268631, 691139145, 691924515, 692621765, 693184204, 693565598, 693783722, 693924255, 694071960, 694254074, 694442673, 694608459, 694751663, 694886322, 695012283, 695117187, 695207367, 695324936, 695529709, 695861511, 696319046, 696870728, 697477036, 698105621, 698731918, 699336166, 699907074, 700449524, 700988617, 701556702, 702171936, 702819901, 703457642, 704039307, 704535980, 704935532, 705227661, 705400696]
3076.4G05400696N5084l4332q6060j21765j74637k51083l16696l36304l11508k81983
3086G03541412k78396k90146k74811j99966o6376J02920K82670M48837N74417O33316
3095.6G04473877O22940N72739N21087M82560M42504L79334K91138J98288J21994O5155
3105.3G08171616J7013l5934r7199j60827k14463k41394k34680k03934j75705j70517
3114.9G06653976j82800j84326j54266j08872r6817j55868k72904l86886m30603l74604
3124.6G04306030k41165p7362P1411J72272K00958J44882J8998j23749k16294k19268
3134.2G04036713j55487r2240q9187j54114k46430l17154l48968l55682l54920l45306
3143.9G01577225l13797k64817k24838k23617k63138l09601l22189k89231k39029k14920
$$ y = [705400696, 705455780, 705421448, 705335388, 705213623, 705038986, 704787903, 704471207, 704134903, 703823395, 703541412, 703263016, 702972870, 702698059, 702498093, 702431717, 702534637, 702817307, 703266144, 703840561, 704473877, 705096817, 705669556, 706190643, 706673203, 707115707, 707495041, 707786179, 707984467, 708106461, 708171616, 708188629, 708152695, 708055496, 707894669, 707680206, 707438812, 707204132, 707000198, 706824493, 706653976, 706471176, 706286850, 706132584, 706023712, 705926895, 705771027, 705498123, 705111237, 704680634, 704306030, 704064865, 703987503, 704058914, 704231186, 704432144, 704577026, 704596024, 704472275, 704255981, 704036713, 703881226, 703788986, 703699799, 703545685, 703299255, 702982101, 702633133, 702277451, 701922531, 701577225, 701263428, 700998611, 700773773, 700550156, 700287018, 699977417, 699655228, 699365997, 699126968, 698912048]
3153.5F98912048k38037k87933l24173l20511k90832k78397l14407l85895m38004m16717
3163.1F95617142l19443k04315j48087j83487k73132l45383l57284l22647k88239k77099
3172.8F92898026k72141k41623j84479j41678j60446k47879l59421m34570m44259m06647
3182.4F90004883l60565l21045k71454j95999j17340q9798j43509k46353l27530l52402
3192.1F87578888l56445m04282n09491o14548o49795o02799n17425m35028l56446k74810
3201.7F82857819k17438k32620l29743m56161n45502n81131n92499n99136n83725n29938
3211.4F78189926m71954m67758n30014o01883o22177o01197o04782o67877p43866p57828
3221F72120590o97021o21262n83343n65339n11856m10308l16773k95868l50036m31290
$$ y = [698912048, 698674011, 698386078, 698061905, 697741394, 697450562, 697172165, 696857758, 696471863, 696033859, 695617142, 695297699, 695093384, 694945297, 694761810, 694488678, 694143295, 693786011, 693463364, 693175125, 692898026, 692625885, 692384262, 692199783, 692058105, 691897659, 691649780, 691290359, 690855789, 690411530, 690004883, 689644318, 689323273, 689051819, 688855820, 688738480, 688648682, 688505173, 688258820, 687931290, 687578888, 687222443, 686818161, 686308670, 685694122, 685044327, 684441528, 683924103, 683489075, 683132629, 682857819, 682640381, 682407761, 682078018, 681621857, 681076355, 680495224, 679902725, 679303589, 678719864, 678189926, 677717972, 677250214, 676720200, 676118317, 675496140, 674894943, 674290161, 673622284, 672878418, 672120590, 671423569, 670802307, 670218964, 669653625, 669141769, 668731461, 668414688, 668118820, 667768784, 667337494]
3230.7F67337494n02777n71442o49414p06100o85654n69229m06494k77481k26975k47345
3240.3F62494583l10821l97644m87366n43823n35279m74548m21143m25338m73633n04379
3249.9F57920609m77295m24576m16870m88739n94406o48880o00358m71420l40652k85340
3259.6F53172073l34320m48150n42221n42069m44107l26080k87934l67813n06592o05392
3269.2F48767395o10046n48554m89654m77753n12161n70603o31942o79627o90613o54297
3278.9F42902145n91049n45196n46341n79071o01426n95512n86433o14968o89964p76024
3288.5F36776161q30307q42247q35762q40530q60787q77762q76350q60825q53195q71505
3298.2F28226891r12095r55581r81789r92088j009026j052093j109314j135941j093178
$$ y = [667337494, 666834717, 666263275, 665613861, 664907761, 664222107, 663652878, 663246384, 662968903, 662741928, 662494583, 662183762, 661786118, 661298752, 660754929, 660219650, 659745102, 659323959, 658898621, 658424988, 657920609, 657443314, 657018738, 656601868, 656113129, 655518723, 654869843, 654269485, 653798065, 653457413, 653172073, 652837753, 652389603, 651847382, 651305313, 650861206, 650535126, 650247192, 649879379, 649372787, 648767395, 648157349, 647608795, 647119141, 646641388, 646129227, 645558624, 644926682, 644247055, 643556442, 642902145, 642311096, 641765900, 641219559, 640640488, 640039062, 639443550, 638857117, 638242149, 637552185, 636776161, 635945854, 635103607, 634267845, 633427315, 632566528, 631688766, 630812416, 629951591, 629098396, 628226891, 627314796, 626359215, 625377426, 624385338, 623376312, 622324219, 621214905, 620078964, 618985786]
3306.8F18985786r95864r17626r37042j061859j213494j287422j244735j140061j068497
3315.5F09119186j075134j123848j140213j084442r82246q97789q82759r42879j040459
3324.2E99949417j115951j115952j019134q46406o46667m61426k98309j33171N7297
3332.9E94369698K66532M56505N79148O07376N49469M46663L51638K98615K84500K76871
3342.5E98487015K53448K29187K43035L04145L63656L49540K39182Q9226j9074o2599
3352.2F00476761r1400j60103k53639l05062k82631k39601k64396l79334n11436n67932
3361.8E97421227n27573m53758m19693m43039m92478n38215n78843o24351o74667p20253
3371.4E91948357p54624p72285p60193p12319o50825o21223o48270o99997p14378o61355
$$ y = [618985786, 617989922, 617072296, 616135254, 615073395, 613859901, 612572479, 611327744, 610187683, 609119186, 608044052, 606920204, 605779991, 604695549, 603713303, 602815514, 601932755, 600989876, 599949417, 598833466, 597717514, 596698380, 595851974, 595205307, 594743881, 594445572, 594312401, 594369698, 594636230, 595092735, 595671883, 596279259, 596828728, 597275391, 597627029, 597925644, 598210144, 598487015, 598740463, 598969650, 599212685, 599516830, 599880486, 600230026, 600469208, 600558434, 600539360, 600476761, 600385361, 600225258, 599971619, 599666557, 599383926, 599144325, 598879929, 598500595, 597989159, 597421227, 596893654, 596439896, 596020203, 595577164, 595084686, 594546471, 593967628, 593343277, 592668610, 591948357, 591193733, 590421448, 589661255, 588948936, 588298111, 587676888, 587028618, 586328621, 585614243, 584952888]
3381.1E84952888n77697n26352n30663n57708n60875n30358m98428n03159n55000o31790
3390.7E79480858o86760o75697n87655m71725m21028m99497o73484q20656q27904o93855
3400.4E73122597n29785m60358n16548o25305o84433o45867n29861l94631k96859k75917
3410E68163033l43247m71077o00166o75125o81115o45599o03027n65834n32799n05447
3419.7E62539597m87366m59442l86391k64282j51558j30959k22397l44085l79181k78092
3429.3E59435844r7618O3439J47896J55220J06697J9989p1793j15433p8544N035O5384
3439.9E59636116P5264Q4114J49422K42119K59666J41029m0702j35689o4621J03683
3449.6E60450401K27280K33498J73187J50413K16294L38821M45404M80690M27895L12271
$$ y = [584952888, 584375191, 583848839, 583318176, 582760468, 582199593, 581669235, 581170807, 580667648, 580112648, 579480858, 578794098, 578118401, 577530746, 577059021, 576637993, 576138496, 575465012, 574644356, 573816452, 573122597, 572592812, 572132454, 571615906, 570990601, 570306168, 569660301, 569130440, 568735809, 568438950, 568163033, 567819786, 567348709, 566748543, 566073418, 565392303, 564746704, 564143677, 563577843, 563045044, 562539597, 562052231, 561592789, 561206398, 560942116, 560790558, 560659599, 560437202, 560093117, 559713936, 559435844, 559338226, 559401665, 559549561, 559704781, 559811478, 559831467, 559759674, 559644241, 559565697, 559570732, 559636116, 559711380, 559795494, 559944916, 560187035, 560446701, 560587730, 560547028, 560411339, 560346718, 560450401, 560677681, 560911179, 561084366, 561234779, 561451073, 561789894, 562235298, 562715988, 563143883, 563456154]
3459.2E63456154K00500J75782K80418M62418O00013O01006M82750L56445L20778L82118
3468.8E67318382M72870N33753N54809N45273M91562L80554K56195K20299L43017N68924
3478.5E71685638P39708P28684N61218L86467L34740M06799M97513N18417M77562M47808
3488.1E76784554M77790N46608O00129O08978N85251N52597N14717M61159L97338L57323
3497.8E81886444L79372M67338N71480O23894N92766N16128M75922N31502O66732Q00972
3507.4E87512550Q46138P68547O10352M59404M01077M65164O01311P06177O97937N92384
3517.1E93661041N00145N29289O74477Q07724P98340O44798M76837M27094N04379O05354
3526.7E99629478O39496O20575O27251O98166P81631P97348P18270N88760M78325M38194
$$ y = [563456154, 563656654, 563832436, 564112854, 564575272, 565175285, 565776291, 566259041, 566615486, 566936264, 567318382, 567791252, 568325005, 568879814, 569425087, 569916649, 570297203, 570553398, 570773697, 571116714, 571685638, 572425346, 573154030, 573715248, 574101715, 574436455, 574843254, 575340767, 575859184, 576336746, 576784554, 577262344, 577808952, 578409081, 579018059, 579603310, 580155907, 580670624, 581131783, 581529121, 581886444, 582265816, 582733154, 583304634, 583928528, 584521294, 585037422, 585513344, 586044846, 586711578, 587512550, 588358688, 589127235, 589737587, 590196991, 590598068, 591063232, 591664543, 592370720, 593068657, 593661041, 594161186, 594690475, 595364952, 596172676, 596971016, 597615814, 598092651, 598519745, 599024124, 599629478, 600268974, 600889549, 601516800, 602214966, 602996597, 603793945, 604512215, 605100975, 605579300, 606017494]
3536.4F06017494M92935O39649Q32443R87854J040306R91173Q96416P89070O52694
3545F13340034M89045L86009M68368P40471J022301J086426Q81843N94826M64897N60456
3554.7F20034676P49473Q68454Q74787Q21304P51495O84433O92558Q96187J307946
3563.4F27681313J694374J697158J163598L58085k08511j98975K85950Q47397J157341
3572F34477730J176758J063881R49592Q54569P79838P77054Q86765J041259J115723
3580.7F43123169J088791J095276J258163J475754J454544J013260L43475r0255M5394
3589.4F50807571O45829J263885J502533J315613R63898P34634P23114Q40073R51767
3598.1F59748917R86557R41925Q57010Q05053Q76236J106339J396103J532821J360703
$$ y = [606017494, 606510429, 607150078, 607982521, 608970375, 610010681, 611001854, 611898270, 612687340, 613340034, 613829079, 614215088, 614683456, 615423927, 616446228, 617532654, 618414497, 619009323, 619474220, 620034676, 620784149, 621652603, 622527390, 623348694, 624100189, 624784622, 625477180, 626373367, 627681313, 629375687, 631072845, 632236443, 632594528, 632386017, 632187042, 632472992, 633320389, 634477730, 635654488, 636718369, 637667961, 638522530, 639302368, 640079422, 640966187, 642007446, 643123169, 644211960, 645307236, 646565399, 648041153, 649495697, 650508957, 650852432, 650762177, 650807571, 651453400, 652717285, 654219818, 655535431, 656499329, 657233963, 657957077, 658797150, 659748917, 660735474, 661677399, 662534409, 663339462, 664215698, 665322037, 666718140, 668250961, 669611664]
3606.8F69611664R71069O80084P52030J105575J346970J160507O63452L13187M17709
3615.4F77022247P91550R65424P14874K87323Q0795J93939M13971N94483Q51135J279144
3625.1F83194885J597595J320649L60183o77948r72213k83051Q12912J502533J476669
3633.8F88332214J061936P44629O97555P69654P75299O77795N48706M71268N20401
3642.4F94599457P49740J118546J444092J480179J066513K36358p51266j456986j435470
3651.1F97051163n64881P12662J585236J489410O10504k88772n73273k46964K18964
3659.8F99994049M40903M01382K78626K13775L11280O57806J130295J255264N81055
3668.5G05264435o62842j478500r97086M76074J548615J082611n95856j986923j919632
$$ y = [669611664, 670582733, 671262817, 672014847, 673120422, 674467392, 675627899, 676291351, 676604538, 677022247, 677813797, 678779221, 679494095, 679781418, 679862213, 680056152, 680470123, 681064606, 681915741, 683194885, 684792480, 686113129, 686473312, 685795364, 684823151, 684540100, 685353012, 686855545, 688332214, 689394150, 690138779, 690836334, 691605988, 692381287, 693059082, 693607788, 694079056, 694599457, 695349197, 696467743, 697911835, 699392014, 700458527, 700694885, 699943619, 698486633, 697051163, 696486282, 697198944, 698784180, 700273590, 700884094, 700595322, 700022049, 699775085, 699994049, 700434952, 700836334, 701114960, 701328735, 701640015, 702297821, 703428116, 704683380, 705264435, 704601593, 703123093, 702126007, 702602081, 704150696, 705233307, 704637451, 702650528, 700730896]
3677.1G00730896o33621O42929J005096N99442J67541J76850N10940Q27255R29108
3685.8G04956436P69043L09372m14276j127853j406022j027145k25830M70657O73752
3694.5G02978134M19693P5455n188K22854M77143M12750l8223n52979o77643k44216
3704.1G03067780M67224R88769J069412P90787L47061j69754p02972j065750j014786
3712.8G03777771n32684N6152L63922L10440J48163J20392J96380J84708K0065j69601
3722.5G04475708k63519k98157l60031m08936l08151k1820K97012M52729L82766J50223
3732.1G04097824j77154n56107q84552r78928p02972r3536O60781J326981J664887
3740.8G04357224J436309N62592o25610j390687j088867K02103J586227K028046J211243
$$ y = [700730896, 700097275, 700740204, 701745300, 702344742, 702512283, 702689133, 703200073, 704027328, 704956436, 705725479, 706034851, 705620575, 704492722, 703086700, 702059555, 701833725, 702304382, 702978134, 703397827, 703473282, 703468094, 703690948, 704168091, 704580841, 704542618, 703989639, 703311996, 703067780, 703535004, 704523773, 705593185, 706383972, 706731033, 706561279, 705858307, 704792557, 703777771, 703245087, 703301239, 703665161, 703975601, 704123764, 704244156, 704440536, 704625244, 704645309, 704475708, 704212189, 703914032, 703554001, 703145065, 702836914, 702815094, 703112106, 703564835, 703947601, 704097824, 703920670, 703364563, 702480011, 701501083, 700798111, 700704575, 701365356, 702692337, 704357224, 705793533, 706356125, 705730515, 704339828, 703250961, 703453064, 705039291, 707067337, 708278580]
3749.5G08278580k38724j360855j631317j186905m60739K23159O86570P62558L49731
3758.2G05422058l48892q15354o29119Q3694P09839P36008K45285k25067k86637p9346
3767.8G04812469k3574k87400o03866o04935k25220K79389O36825P63550O78787L61329
3777.4G05787354j82267p42569r51614o12335L4256M58603L16696k19650o28891n41153
3787.1G02718430q2856K74353K14386j02081k31781J8921L34320K54974k07214m77371
3796.7G02714081q7433O28509P50733j65024j382294j613693m22516J186676J745148
3805.4G03354187Q18253o39267j372757j027680j86386N01938Q67996R59473O72073
3814.1G03947830j9302o58112n81588K28195Q64639L94897r89227k013168j645584
$$ y = [708278580, 708039856, 706679001, 705047684, 703860779, 703400040, 703623199, 704309769, 705072327, 705422058, 705073166, 704257812, 703628693, 703712387, 704422226, 705158234, 705403519, 705178452, 704891815, 704812469, 704788895, 704501495, 703897629, 703292694, 703067474, 703346863, 703983688, 704747238, 705426025, 705787354, 705605087, 704862518, 703910904, 703298569, 703332825, 703791428, 704108124, 703888474, 703259583, 702718430, 702635574, 702909927, 703124313, 703022232, 702790451, 702809372, 703143692, 703398666, 703191452, 702714081, 702626648, 703255157, 704005890, 703840866, 702458572, 700844879, 700422363, 701609039, 703354187, 704172440, 703533173, 702160416, 701132736, 700946350, 701448288, 702316284, 703275757, 703947830, 703928528, 703270416, 702688828, 702917023, 703781662, 704176559, 703187332, 701174164, 699528580]
3822.8F99528580k23847R26209R12399J14365m10691j34964M93317P11517L06702k48260
3832.4G01975327l84446j4343M48151N16662N4398o43234j103135j035919n39703M578
3842.1F99278336K48947J37253j10169k15149l9673L68729Q16421J012345O69937k65350
3851.7G01901627j427613k144699j910782q41751L61252R79157Q69827M95682L65066
3860.4F98647766M84696M20303r7351p34101q40606k10343N67933O61163r5749r57413
3870F97846298j047592l21274L95279L68042j94244m19693J39999R08508R29719K3498
3879.7F98628540r21249r06983L8834Q62808O31943m51660j282807j034622K670P86591
3889.3F96354065O07605k69547r79156r23309k32239N00488P89719N69305J06659k47726
$$ y = [699528580, 699304733, 700230942, 701143341, 701257706, 700847015, 700712051, 701205368, 701916885, 702223587, 701975327, 701590881, 701576538, 702024689, 702541351, 702595749, 701952515, 700849380, 699813461, 699273758, 699278336, 699527283, 699664536, 699554367, 699339218, 699299545, 699668274, 700484695, 701497040, 702166977, 701901627, 700474014, 698329315, 696418533, 695576782, 695938034, 696917191, 697787018, 698282700, 698647766, 699132462, 699552765, 699455414, 698721313, 697880707, 697670364, 698238297, 698899460, 698803711, 697846298, 696798706, 696477432, 696872711, 697240753, 697046509, 696626816, 696766815, 697675323, 698605042, 698628540, 697707291, 696800308, 696839142, 697701950, 698333893, 697882233, 696599426, 695564804, 695567474, 696354065, 696961670, 696692123, 695712967, 694789658, 694557419, 695057907, 695847626, 696416931, 696523590, 696275864]
3898.9F96275864k69928J4953L24707K98615j82877q21304j111679p97730j22299M03900
3908.6F94012222M73481K12173k7237l4409J18180K18658J35803j09024l95279n77774
3918.2F94026794n48172k94494O3095L26157L49197J38702j52054l31115k87400n6610
3927.9F93234100J95847K86484J46026j17492l10669l15628j78757m5090j5030o8664
3937.5F92811127j03302m5929O5918J00174l9749k80381l97339k36587Q0566K40631
3947.2F92195129P6600k24839l35846j81656j7013p5226k57645k84271q8119R4909
3956.8F90902023N6229j21384k28347k33689k71149l56674l24249j05591R9182P8736
3966.5F89495087q0185j25962m3411p9727l25928n15365m14887k24914k92435n27344
$$ y = [696275864, 696005936, 696020889, 696345596, 696644211, 696461334, 695640030, 694528351, 693730621, 693608322, 694012222, 694485703, 694697876, 694670639, 694636230, 694754410, 694973068, 695108871, 694999847, 694604568, 694026794, 693478622, 693184128, 693247223, 693573380, 693922577, 694061279, 693909225, 693578110, 693290710, 693234100, 693429947, 693716431, 693862457, 693744965, 693434296, 693118668, 692939911, 692894821, 692879791, 692811127, 692707825, 692661896, 692727814, 692827988, 692788239, 692507858, 692110519, 691873932, 691954498, 692195129, 692271729, 692046890, 691711044, 691529388, 691512375, 691437149, 691179504, 690895233, 690807114, 690902023, 690958252, 690836868, 690608521, 690374832, 690103683, 689747009, 689422760, 689317169, 689416351, 689495087, 689414902, 689288940, 689245529, 689165802, 688839874, 688324509, 687909622, 687684708, 687392273, 686864929]
3976.1F86864929m69818l2120K33918j02692o31180o32706k08129k19727r23386j364898
3985.7F82514191p62558L3416m61578j942062k280808p56912o714k713013o629562
3994.4F66994400o093292j145706l536606k8592835p7407913j28257370
4000.2D21960678
$$ y = [686864929, 686395111, 686362991, 686596909, 686494217, 685863037, 685230331, 685022202, 684802475, 683879089, 682514191, 681751633, 681785049, 681323471, 679381409, 677100601, 676343689, 676336975, 673623962, 666994400, 660901108, 659755402, 656218796, 627625961, 550218048, 421960678]
##END=$$ End of the data block
