##TITLE=$$ Begin of the data block
##JCAMP-DX=5.00 $$ ACD/SpecManager v 10.08
##SPECTROMETER/DATA SYSTEM=Varian
##DATE=30 Apr 2013 09:44:00
##DATA TYPE=INFRARED SPECTRUM
##DATA CLASS=XYDATA
##ORIGIN=
##OWNER=
##NPOINTS=3735
##FIRSTX=399.26403809
##LASTX=4000.35498047
##MAXX=4000.35498047
##MINX=399.26403809
##MAXY=73.85605621
##MINY=6.52321386
##XFACTOR=1.0000000000
##YFACTOR=0.000000100000000
##FIRSTY=44.83059692
##DELTAX=0.96440572
##XUNITS=1/CM
##YUNITS=TRANSMITTANCE
##XYDATA=(X++(Y..Y))
399.3D48305969J43161812Q0330772K4930192J299819J175614L882980P91550k725372
$$ 448305969 591467781 671798553 696728745 698028564 699204178 703087158 703878708 701153336
407G01153336j422043K149505L220673J550827M1351j16424p9117n60455q29392k25601
$$ 701153336 699731293 701880798 705101471 706652298 706693649 706577225 706498108 705937653 705108261 704882660
416.6G04882660R90143K304077L260498L092041J246185j387787k776565j830292L71018
$$ 704882660 705872803 708176880 711437378 714529419 715775604 714387817 711611252 709780960 710151978
425.3G10151978J852264J704864L99933j176147k266388k246475j001892O30416J460953
$$ 710151978 712004242 713709106 714109039 712932892 710666504 708420029 707418137 708048553 709509506
434G09509506J170426M85000N6305k72293q38547j364135j290512o25687M6844K73362
$$ 709509506 710679932 711164932 711221237 710948944 710110397 708746262 707455750 706830063 706876907 707150269
443.6G07150269J373p47070j930695l089142l383407k389756o59790P49054J158447
$$ 707150269 707151642 706404572 704473877 701384735 698001328 695611572 694951782 695700836 696859283
452.3F96859283N28565q74481k646866m142227m690934m224853l553619l780594n369873
$$ 696859283 697387848 696513367 693866501 689724274 685033340 680808487 677254868 673474274 668104401
461F68104401p773590r860306j0644036r730606p300682l814239K22778M253922P599983
$$ 668104401 660330811 650470505 639826469 630095863 622795181 618980942 619203720 623457642 631057625
469.7F31057625R623604J0085525R275360P715531N792923L718872J694259j09863
$$ 631057625 640681229 650766754 660042114 667757645 673550568 677269440 678963699 678853836
477.4F78853836j687775l055725l866729l420868j371689J561508L842239M279175
$$ 678853836 677166061 674110336 670243607 666822739 665451050 667012558 670854797 675133972
485.1F75133972K968064J056823l46985r68170j181183j319732j377335j306610j312332
$$ 675133972 678102036 679158859 678811874 677843704 676662521 675342789 673965454 672658844 671346512
493.8F71346512j651764k287293k983398l728409m790573o324463q286743j0936127
$$ 671346512 669694748 667407455 664424057 660695648 655905075 649580612 641293869 630357742
501.5F30357742j4857292j9616852k2344665j8808060p208786Q853264K2013740K6562043
$$ 630357742 615500450 595883598 573538933 554730873 547522087 556375351 578389091 604951134
509.2F04951134K2548523J4733390P970963L877411J372223p67060k569351l562851
$$ 604951134 627499657 642233047 650204010 654081421 655453644 654686584 652117233 648554382
516.9F48554382l835525m027100m607315n538902o607132p795334r248276j1001014
$$ 648554382 644718857 640691757 636084442 630545540 623938408 616143074 606894798 595893784
524.6E95893784j2877083j4640007j6172600j7460251j8349991j8285827j6343232
$$ 595893784 583016701 568376694 552204094 534743843 516393852 498108025 481764793
531.4D81764793j1729316m479561M245720J2625236J9072533K2844734K4001160K3014335
$$ 481764793 470035477 465555916 469801636 482426872 501499405 524344139 548345299 571359634
539.1E71359634K0506401J7191849J3784294J0791550Q393936O533051N070038L858566
$$ 571359634 591866035 609057884 622842178 633633728 642027664 648560715 653630753 657489319
546.8F57489319K792587J896896J331330J182098J240387J093903N15213l06854r66645
$$ 657489319 660281906 662178802 663510132 664692230 665932617 667026520 667541733 667234879 666268234
555.5F66268234j233673j199722j104965j117020j260147j461945j617431j663132
$$ 666268234 665034561 663834839 662729874 661612854 660352707 658890762 657273331 655610199
563.2F55610199j635895j632156j683579j712036j645660j559143j645127k025451
$$ 655610199 653974304 652342148 650658569 648946533 647300873 645741730 644096603 642071152
570.9F42071152k594757l047181l077087k624435j975479j592293j759568k363319
$$ 642071152 639476395 636429214 633352127 630727692 628752213 627159920 625400352 623037033
578.6F23037033l031807l497391l790779m095382m470978m773407m851914m794006
$$ 623037033 620005226 616507835 612717056 608621674 604150696 599377289 594525375 589731369
586.4E89731369m928818n520553o437264p211113p537193p673683q211479r435654
$$ 589731369 584802551 579281998 572844734 565633621 558096428 550422745 542211266 532775612
594.1E32775612j1060181j2611351j3835411j4558716j4356956j2649231r051819l409996
$$ 532775612 521715431 509104080 495268669 480709953 466352997 453703766 444651947 441241951
601.8D41241951M274635J3336754K1802559K7047691K7742424K4736329J9350929J1362877
$$ 441241951 445516586 458853340 480655899 507703590 535446014 560182343 579533272 590896149
609.5E90896149K00004j1468544j7089119j1353454L659324J8740425K4923287K0525894
$$ 590896149 591096153 579627609 562538490 551185036 554844360 573584785 598508072 619033966
617.2F19033966J0985260K800179j552773l627624n843125q968925j1753693j2060699
$$ 619033966 630019226 632819405 631266632 627639008 621795883 612826958 601073265 589012566
624.9E89012566q694268k920150J846275K594528o80809n154076p975349q583603q272591
$$ 589012566 580318298 577398148 579244423 581838951 581158142 576004066 568028717 559445114 551172523
633.6E51172523q208198q490448q840828r352913j0247230j1322937j2083588j2302246
$$ 551172523 542964325 534473877 525633049 516280136 506032906 494709969 482626381 470324135
641.3D70324135j2178765j1962623j1657295j1142502j0415917r607086q805961p909356
$$ 470324135 458145370 446182747 434525452 423382950 412967033 403359947 394553986 386644630
649C86644630o535835m044113J78871O116371J2638588J7807389K0069580J9408836
$$ 386644630 380108795 376064682 376243553 382359924 394998512 412805901 432875481 452284317
656.8D52284317J7245445J5059014J3210640J1291198R345703Q027268P229957N339699
$$ 452284317 469529762 484588776 497799416 509090614 518436317 526463585 533693542 539033241
664.5E39033241R66187m423828o706124k985305M844055J1244774J2062568Q027420
$$ 539033241 539999428 535575600 528869476 525884171 530728226 541973000 554035568 562062988
672.2E62062988L181877N19295k72140j298638l947220q378028j4714089k3396606
$$ 562062988 565244865 565764160 565492020 564193382 560246162 551868134 537154045 513757439
679.9E13757439l3575287m1344872m0585136k6959572k257385K5004501M4205742M9279900
$$ 513757439 480182152 438837280 398252144 371292572 369035187 394039688 438245430 487525330
687.6D87525330M1986541K9296036J7778435J0094795N627937K964898J192283l66821
$$ 487525330 529511871 558807907 576586342 586681137 592309074 595273972 596466255 596099434
695.3E96099434k465210n624504r913101j5071183k0246048k3257942k0845070j0913963
$$ 596099434 593634224 588009720 578096619 563025436 542779388 519521446 498676376 487762413
703.1D87762413M791527K0614471L0354691L1348800K5693970J7885628J1418648P227058
$$ 487762413 492553940 513168411 543523102 574871902 600565872 618451500 629870148 637097206
710.8F37097206M516182K396164O69250m89807j129608j630096k302551l021470l347320
$$ 637097206 641613388 644009552 644678802 644188995 643059387 641429291 639126740 636105270 632757950
719.5F32757950l034134k383080k034454k397118l315391m296570n004463n495796
$$ 632757950 629723816 627340736 625306282 622909164 619593773 615297203 610292740 604796944
727.2F04796944o059914o956902q298225j0036163j2001877j4071045j6427422j9602928
$$ 604796944 598737030 591780128 583481903 573445740 561443863 547372818 530945396 511342468
734.9E11342468k4130554l0142479l7246628m4328155m8891449m6857243l4566841
$$ 511342468 487211914 457069435 419822807 375494652 326603203 279745960 245179119
741.6B45179119j2740326J1362858K7458305K9999733K3155938J7352676K0011444
$$ 245179119 232438793 243801651 271259956 301259689 324415627 341768303 361779747
748.4C61779747K9385300L7246666L6973152K8678131J7334747P469025K55928n382881
$$ 361779747 391165047 428411713 465384865 494062996 511397743 518866768 519122696 513739815
756.1E13739815j0530167j5507202k0215378k4002456k5077591k0936318j0288963
$$ 513739815 503209648 487702446 467487068 443484612 418407021 397470703 387181740
762.8C87181740N072174K0471535L0835914L3593979K9783859K2748680J5740014J0326500
$$ 387181740 392253914 412725449 443561363 477155342 506939201 529687881 545427895 555754395
770.6E55754395O455879L500633J088028q19206k222061l231125l974419m529991m979134
$$ 555754395 562210274 565710907 566798935 565979729 563757668 560526543 556552124 552022133 547042999
779.2E47042999n454216o074638o857796p714920q525200r201317r717178j0111351
$$ 547042999 541588783 535514145 528656349 520941429 512416229 503214912 493497734 483386383
787D83386383j0453834j0779496j1038589j1116409j0903016j0323143r320373p852211
$$ 483386383 472932549 462153053 451114464 439998055 429095039 418771896 409451523 401599312
794.7D01599312n934563l680038j250649J247940L817292O488571R183769J1663628
$$ 401599312 395664749 391984711 390734062 391982002 395799294 402287865 411471634 423135262
802.4D23135262J3640289J4963875J5702705J6032906J6049461J5691986J4847221
$$ 423135262 436775551 451739426 467442131 483475037 499524498 515216484 530063705
809.1E30063705J3509751J1836052J0044136Q231048O221962L608895J12915l827515
$$ 530063705 543573456 555409508 565453644 573684692 579906654 583515549 583628464 579800949
816.9E79800949o757965o790810k982406L558883R986763J3418847J2602424Q163147
$$ 579800949 573042984 566252174 563269768 566828651 576815414 590234261 602836685 610999832
824.6F10999832J574326n757790j2408562j6506919j6188317j0951996k544822N780220
$$ 610999832 612574158 606816368 594407806 577900887 561712570 550760574 548215752 553995972
832.3E53995972J1165580J2615738J0999222P937012M658890J540794j680908n432053
$$ 553995972 565161552 577777290 588776512 596713524 601372414 602913208 601232300 595800247
840E95800247j0015983j5676995k2629013l0421142l6778145l7317200k7593117o811294
$$ 595800247 585784264 570107269 547478256 517057114 480278969 442961769 415368652 408557358
847.7D08557358J9889259M3352318N5737648N5096245M5540886L3395576K3049317
$$ 408557358 428446617 471798935 527536583 582632828 628173714 661569290 684618607
854.5F84618607J5639953J0441132O646957L952866K209854J163940N75333L40042
$$ 684618607 700258560 710699692 717346649 721299515 723509369 724673309 725248642 725588684
862.2G25588684L76816N02777M99191K72827j05438m95148p85446r21020q84705o84891
$$ 725588684 725965500 726468277 726967468 727240295 727134857 726639709 725854263 724933243 724048538 723363647
871.8G23363647l74298q1634R537k20566o96182j163559j370011j238479q91877n60989
$$ 723363647 722989349 722907715 722917252 722696686 722000504 720836945 719466934 718228455 717336578 716775589
881.5G16775589m75922p40203j212922j557006j526032j215057r35593q56628q92945
$$ 716775589 716299667 715559464 714346542 712789536 711263504 710048447 709112854 708256226 707363281
890.2G07363281r58862j132050j464462j840362k228775k886734l996354n294418o659393
$$ 707363281 706404419 705272369 703807907 701967545 699738770 696852036 692855682 687561264 680901871
898.8F80901871r070282j3924942k0383797k3829880j8697319m093933J3712998K5524597
$$ 680901871 671831589 657906647 637522850 613692970 594995651 590901718 604614716 630139313
906.5F30139313K6503296J9335632J0612564M918976K529373J560364Q12607K99224
$$ 630139313 656642609 675978241 686590805 691509781 694039154 695599518 696412125 696711349
914.3F96711349J55106Q1787j92795n32608o80008o38732n98450o53839p59507q80737
$$ 696711349 696866455 696948242 696755447 696222839 695542831 694904099 694305649 693651810 692892303 692011566
923.9F92011566j045227j263504j492157j675415j770477j749573j637497j554565
$$ 692011566 690966339 689702835 688210678 686535263 684764786 683015213 681377716 679823151
931.6F79823151j659089k001342k436829k720261k732162k638550k783737l374405
$$ 679823151 678164062 676162720 673725891 671005630 668273468 665634918 662851181 659476776
939.3F59476776m332428n565491p262497r552230j1740685j2409286j0969086r039002
$$ 659476776 655144348 649578857 642316360 632764130 621023445 608614159 597645073 588606071
947.1E88606071r256820j1892624j3084831p765999M892120J9368286K7898827K6941719
$$ 588606071 579349251 567456627 554371796 546605797 551497917 570866203 598765030 625706749
954.8F25706749J9483986J1324463N814743K390976p12204l543320m509888k642440
$$ 625706749 645190735 656515198 662329941 664720917 664008713 660465393 655955505 653313065
962.5F53313065R51767L935852M706192L437423J484986M8751o05621q92868j191711
$$ 653313065 654264832 658200684 662906876 666344299 667829285 667878036 667272415 666379547 665187836
971.2F65187836j481552j570969j475754j454925j726456k219772k606812k548523
$$ 665187836 663706284 662135315 660659561 659204636 657478180 655258408 652651596 650103073
978.9F50103073j971893j195297p44935r30862j570206k194748k526207k652778k759285
$$ 650103073 648131180 646935883 646190948 645260086 643689880 641495132 638968925 636316147 633556862
987.6F33556862k888222l053856l384781l963127m705810n671692p292099r771958
$$ 633556862 630668640 627614784 624230003 620266876 615561066 609889374 602597275 592825317
995.3E92825317j2249260j3245925j2422066j1426087j2398986j6048470k2081490
$$ 592825317 580576057 567330132 554908066 543481979 531082993 515034523 492953033
1002D92953033l0983390m3071480n4248161n4378186l3745022O436272N0762558P9280129
$$ 492953033 461969643 418898163 364650002 310271816 276526794 282963066 333725624 413005753
1009.7D13005753Q2024765O4825630M1946487K4271317J4080238Q384552M389267J400909
$$ 413005753 495030518 559856148 601802635 626073952 640154190 648538742 652928009 654328918
1017.5F54328918m86221j623916k582551l527450m249954m703980n381851p040825
$$ 654328918 653842697 652218781 649636230 646108780 641858826 637154846 631772995 624732170
1025.2F24732170r718170j1806870j0588417m552993M479179J2044868J4446679J1620864
$$ 624732170 615014000 603207130 592618713 588065720 592544899 604589767 619036446 630657310
1032.9F30657310O619072K558632L93486o80313j512642k184143k485122k502938k524147
$$ 630657310 637276382 639835014 640228500 639548187 638035545 635851402 633366280 630863342 628339195
1041.6F28339195k662620k838936l039856l404007m011078m687958n107155n091819
$$ 628339195 625676575 622837639 619797783 616393776 612382698 607694740 602587585 597495766
1049.3E97495766m820023m721069n176850o293830p903481r724884j1595688j3704986
$$ 597495766 592675743 587954674 582777824 576483994 568580513 558855629 547259941 533554955
1057E33554955j6555596k0281410k3572464k3502884j7347717n412216P943115J6773300
$$ 533554955 516999359 496717949 473145485 449642601 432294884 426882668 434825783 451599083
1064.7D51599083J7673263J1775361K987403n362815j2226067j8083115k3453712k8183937
$$ 451599083 469272346 481047707 484035110 478672295 466446228 448363113 424909401 396725464
1072.4C96725464l1407547l1653214k7332706j7859306m530621R955540K3041115L3295002
$$ 396725464 365317917 333664703 306331997 288472691 283942070 293897610 316938725 350233727
1080.1C50233727M0020675M2508316M0261307L3945923K5612640J7608681J1264076
$$ 350233727 390254402 432762718 473024025 506969948 532582588 550191269 561455345
1086.9E61455345O628418L206024O41136j231803k617073l763962m809189n777588
$$ 561455345 568083763 571289787 571930923 570699120 568082047 564318085 559508896 553731308
1094.6E53731308o724701p777901r024849j0454368j2015724j3634186j5121269j6190262
$$ 553731308 547006607 539228706 530203857 519749489 507733765 494099579 478978310 462788048
1102.3D62788048j6718979j7028618j7782364j9496765k2107353k4971886k7179260
$$ 462788048 446069069 429040451 411258087 391761322 369653969 344682083 317502823
1109.1C17502823k7728787k5430793j8921624p272682Q922596K6858387M2145367N0745926
$$ 317502823 289774036 264343243 245421619 238148937 247071533 273929920 316075287 366821213
1116.8C66821213N1006164M4314347L3964653K3227081J4051895O984329J784363k012710
$$ 366821213 417827377 462141724 496106377 519333458 533385353 540369682 542154045 540141335
1124.5E40141335m849434p060891q832931j0246239j1374626j2315407j3134727j3850212
$$ 540141335 535291901 528231010 519398079 509151840 497777214 485461807 472327080 458476868
1132.2D58476868j4490128j5126762j5824509j6607933j7515869j8634949k0003433
$$ 458476868 443986740 428859978 413035469 396427536 378911667 360276718 340273285
1139C40273285k1476040k2706909k3238945k2598419k0407448j6572342j1419449n588646
$$ 340273285 318797245 296090336 272851391 250252972 229845524 213273182 201853733 196265087
1146.7A96265087K37599N534782J0084686J4235554J8937530K4854184L0803451L3354798
$$ 196265087 196502686 202037468 212122154 226357708 245295238 270149422 300952873 334307671
1154.4C34307671K9136734J8496360O731415P53174L724136J2710343K1492653K5550613
$$ 334307671 363444405 381940765 388672180 389425354 393149490 405859833 427352486 452903099
1162.1D52903099K4560623K0953598J7026863J3581620J0520477P828064N720215M216308
$$ 452903099 477463722 498417320 515444183 529025803 539546280 547374344 553094559 557310867
1169.8E57310867K950554J484947k72102j995773l288155m139786n113220p080040
$$ 557310867 560261421 561746368 561474266 559478493 556190338 552050552 546937332 539857292
1177.5E39857292j0691757j5914078k1820717k6709900k8574523k5865975j8200874
$$ 539857292 529165535 513251457 491430740 464720840 436146317 410280342 392079468
1184.3C92079468o563835P059402K0224915L0460434L5759430L5339202L0215187K2834778
$$ 392079468 385515633 392575035 412799950 443260384 479019814 514359016 544574203 567408981
1192E67408981J5753022J0361175O673966M079093K098885N50156o54106j591835k272759
$$ 567408981 583162003 593523178 600197144 604276237 606375122 606925278 606271172 604679337 602406578
1200.7F02406578k684479k933922l232994l689575m180145m491882m548684m440498
$$ 602406578 599722099 596788177 593555183 589865608 585685463 581193581 576644897 572204399
1208.4E72204399m267311m036789l729629l405076l191871l197251l444328l862686
$$ 572204399 567937088 563900299 560170670 556765594 553573723 550376472 546932144 543069458
1216.1E43069458m287872m479714m219475l470649k457505j549835j024093r03740
$$ 543069458 538781586 534301872 530082397 526611748 524154243 522604408 521580315 520676575
1223.8E20676575j011734j157837j280251j438446j705971k086525k518081k939797
$$ 520676575 519664841 518507004 517226753 515788307 514082336 511995811 509477730 506537933
1231.5E06537933l355293l839760m490814n353889o371041p385063q214722q775520
$$ 506537933 503182640 499342880 494852066 489498177 483127136 475742073 467527351 458751831
1239.3D58751831r174080r665794j0417824j1233101j1546440j0854187r303246p866058
$$ 458751831 449577751 439911957 429494133 418261032 406714592 395860405 386557159 378691101
1247C78691101p815094r861755j3693276j8282890k2616844k6156025k8712425l0006695
$$ 378691101 370876007 361014252 347320976 329038086 306421242 280265217 251552792 221546097
1254.7B21546097k9406910k6068535j9329948r103890L872595J7982969L0962219M0495453
$$ 221546097 192139187 166070652 146740704 137636814 141509409 159492378 190454597 230950050
1262.4B30950050M5043831M4470215M0021973L3633728K7016945K1116981J6153374
$$ 230950050 275993881 320464096 360486069 394119797 421136742 442253723 458407097
1269.2D58407097J1985512Q428573N366555K760772O56624q13179j483803j262970
$$ 458407097 470392609 478821182 484187737 486948509 487605133 486791954 485308151 484045181
1276.9D84045181k32010J316567K934265M160156M686699M445458L561554K238578
$$ 484045181 483813171 485129738 488064003 492224159 496910858 501356316 504917870 507156448
1284.6E07156448O67916r88846k593041m039573n279007o323204p228318q075027q958015
$$ 507156448 507824364 506835518 504242477 500202904 494923897 488600693 481372375 473297348 464339333
1293.3D64339333r976540j1207390j2659035j4224739j5668869j6637993j6643180
$$ 464339333 454362793 443155403 430496368 416271629 400602760 383964767 367321587
1300C67321587j5038758j1167679m821548L191528J0937500J6102906J7240715J4568367
$$ 367321587 352282829 341115150 336293602 339485130 350422630 366525536 383766251 398334618
1307.7C98334618R663620M379921p6142l316269n418586o627350p301903p895279q781013
$$ 398334618 407998238 412378159 412302017 408985748 403567162 396939812 389637909 381742630 372961617
1316.4C72961617j0072175j1613426j3076629j3999253j3827762j2175236r240990
$$ 372961617 362889442 351276016 338199387 324200134 310372372 298197136 288956146
1323.2B88956146n966320l601208k940254l878689n646247p421151q755626r568024
$$ 288956146 282989826 279388618 276448364 272569675 266923428 259502277 250746651 241178627
1330.9B41178627r923077r891986r520264q796673p625866n946522l982448k372227
$$ 241178627 231255550 221363564 211843300 203046627 195420761 189474239 185491791 183119564
1338.6A83119564j903820k938614m996414o937180p687797o929350n167246l178148
$$ 183119564 181215744 178277130 173280716 166343536 158655739 151726389 146559143 143380995
1346.3A43380995j391764K64931K072267M201241O648683R324322J2084580J4727077
$$ 143380995 141989231 142254162 144326429 148527670 155176353 164500675 176585255 191312332
1354A91312332J7062092J9019699K0649090K2022381K3206119K4315949K5457268K6491584
$$ 191312332 208374424 227394123 248043213 270065594 293271713 317587662 343044930 369536514
1361.7C69536514K6923371K6186256K4135971K1230507J8177605J5424270J2965279
$$ 369536514 396459885 422646141 446782112 468012619 486190224 501614494 514579773
1368.5E14579773J0559311Q058967N586129L506469K223854J885415K205696K623214
$$ 514579773 525139084 533198051 538784180 542290649 544514503 546399918 548605614 551228828
1376.2E51228828K691155K328453J695480R16100j7929j141739k470703m071808o043739
$$ 551228828 553919983 556248436 557943916 558860016 558842087 557700348 555229645 551157837 545114098
1384.9E45114098q330841j0655442j2768326j4713058j6619301j8132896j8254700
$$ 545114098 536783257 526127815 513359489 498646431 482027130 463894234 445639534
1391.6D45639534j6086731j1895828p269440l892059j953812J95160M603462J1698494
$$ 445639534 429552803 417656975 410387535 406495476 404541664 404736824 409340286 421038780
1399.3D21038780J9543305K5082016K6274833K3310395J8074951J2640571Q149338
$$ 421038780 440582085 465664101 491938934 515249329 533324280 545964851 554114189
1406.1E54114189M774170K329903P36351o333o4544J71814K95410J02997l86544j067886
$$ 554114189 558888359 561218262 561954613 561948280 561883736 562055550 562350960 562453957 562067413 560999527
1415.7E60999527j808128k389031k546158k227745j803474j840439k549858l528023
$$ 560999527 559191399 556802368 554256210 552028465 550224991 548384552 545834694 542306671
1423.4E42306671m165535m288521m274482m539566n066986n497056n538787n178109
$$ 542306671 538141136 533852615 529578133 525038567 519971581 514474525 508935738 503757629
1431.2E03757629m611702m159622m157753m675216n312310n555420n459022n714264
$$ 503757629 499145927 494986305 490828552 486153336 480841026 475285606 469826584 464112320
1438.9D64112320o804581q368416r811897j1327476j3457909j5266266j3763199o435127
$$ 464112320 457307739 448939323 439127426 427799950 414342041 399075775 385312576 378877449
1446.6C78877449N284081J5851326J9796867J6225357R008942K806816o33278k479401
$$ 378877449 384161530 400012856 419809723 436035080 445044022 447850838 447217560 444738159
1454.3D44738159m248428o061058p153397p206459o745109o552735p063980q224525
$$ 444738159 440489731 434428673 427275276 420068817 413323708 406770973 399706993 391482468
1462C91482468r624787j0718651j1103324j0722809r850426q968544q702431r633846
$$ 391482468 381857681 371139030 360035706 349312897 339462471 330493927 321791496 312157650
1469.7C12157650j1827888j4499455j6474876j7212162j7231293j7304173j7289810
$$ 312157650 300329762 285830307 269355431 252143269 234911976 217607803 200317993
1476.5B00317993j5983906j2131271n475426L042412J1735935J8757973K2685261K3022918
$$ 200317993 184334087 172202816 166727390 169769802 181505737 200263710 222948971 245971889
1484.2B45971889K0213089J5052968Q242759O24180o542625j2234192j6621704k0542431
$$ 245971889 266184978 281237946 289480705 290104885 283562260 271328068 254706364 234163933
1491.9B34163933k3394184k2143116j3708306J090317J6519165K5660916K5485038
$$ 234163933 210769749 188626633 174918327 176008644 192527809 218188725 243673763
1498.7B43673763J8432465R566212K637615j548958m162445o567497r172230j1279431
$$ 243673763 262106228 271672440 274310055 272761097 268598652 262031155 252858925 241579494
1506.4B41579494j1846752j0643501q721867p531757p565689q135548q495273q749409
$$ 241579494 229732742 219089241 210367374 202835617 195269928 187134380 178639107 169889698
1514.1A69889698r374943j0201425j0426979r662342q478013p662448p235642o545963
$$ 169889698 160514755 150313330 139886351 130224009 121745996 114083548 106847906 100301943
1521.8A00301943n238438l772240k888937k794208l027096l034625k700796k287889
$$ 100301943 95063505 91291265 88402328 85608120 82581024 79546399 76845603 74557714
1529.5G4557714j968174j531124o14690Q14375K346979L610096M760246O264295Q116122
$$ 74557714 72589540 71058416 70443726 71258101 73605080 77215176 81975422 88239717 96355839
1538.2I6355839R474544R310351P387943M466152J570044p56912k513009l870182m962358
$$ 96355839 105830383 115140734 122528677 126994829 128564873 127807961 125294952 121424770 116462412
1546.9A16462412n896244o698694p208510p178869o560011n599051m613285l701315
$$ 116462412 110566168 103867474 96658964 89480095 82920084 77321033 72707748 69006433
1554.6F9006433k660522j113772J220517M172153P010885Q986897J0218925J1789275
$$ 69006433 66345911 65232139 66452656 70624809 77635694 86622591 96841516 108630791
1562.3A08630791J4484014J7381783J8226385J5687656J1176262Q000069Q530407J2276439
$$ 108630791 123114805 140496588 158722973 174410629 185586891 193586960 202117367 214393806
1570B14393806J6688004J9519405K0247689J9558658J8045807J5624619J1860962O434936
$$ 214393806 231081810 250601215 270848904 290407562 308453369 324077988 335938950 342373886
1577.7C42373886p85980r783058k0082760l0230274l7681141l9610214l4371071k2670040
$$ 342373886 341587906 331804848 311722088 281491814 243810673 204200459 169829388 147159348
1585.5A47159348p584086O655235J6359492J9644680J6805877R893723J803646m773827
$$ 147159348 139575262 146230497 162589989 182234669 199040546 208934269 210737915 205964088
1593.2B05964088q175888q081302n312653j335716K341595M768638N941754O670379
$$ 205964088 197788200 189706898 184394245 183058529 185400124 190168762 196110516 202780895
1600.9B02780895P915135J0096283J2955913J5955677J8672619K0835266K2210026
$$ 202780895 210696030 220792313 233748226 249703903 268376522 289211788 311421814
1607.6C11421814K2622719K2000923K0221901J7018661J2407647P412681M098168M333572
$$ 311421814 334044533 356045456 376267357 393286018 405693665 413106346 417204514 421538086
1615.4D21538086Q174477J3484497J7369690J8207817J6492386J3951606J1987496
$$ 421538086 429712563 443197060 460566750 478774567 495266953 509218559 521206055
1622.1E21206055J0842971R950142Q809128P482872O385308N771522N513649N298462
$$ 521206055 532049026 541999168 550808296 558291168 564676476 570447998 575961647 581260109
1629.8E81260109M886208M133110K940139J416550O7558m66385p4462N40924M78820
$$ 581260109 586146317 590279427 593219566 594636116 594703674 594237289 594162827 594703751 595182571
1638.5E95182571m51660j610298k318878k547531k710953l001823l159218k806778
$$ 595182571 594730911 593120613 590801735 588254204 585543251 582541428 579382210 576575432
1646.2E76575432j817703m58146N26886M0513k601471o664162j0096893j1258431j0662918
$$ 576575432 574757729 574299583 574826469 574866982 572265511 565601349 555504456 544246025 533583107
1654.9E33583107j0614548j2894363j7118302k1598396k5432663k9105491l2992974
$$ 533583107 522968559 510074196 492955894 471357498 445924835 416819344 383826370
1661.6C83826370l5944252l5915432l1895427k4740372j6006394o383781M311943J5718346
$$ 383826370 347882118 311966686 280071259 255330887 239324493 232940712 237252655 252971001
1669.4B52971001K6088047L3353481L6998100L8438225L9273644L9416389L7426949
$$ 252971001 279059048 312412529 349410629 387848854 427122498 466538887 503965836
1676.1E03965836L2707405K6768646K1859398J8642273J5896301J2575722R438209
$$ 503965836 536673241 563441887 585301285 603943558 619839859 632415581 641853790
1682.9F41853790Q080139Q708268R611435Q984146O762695M367065K985001K520828
$$ 641853790 649933929 658642197 668253632 677237778 684000473 688367538 691352539 693873367
1690.6F93873367K090073J100540k37579j183396j101760k4796J303329K079010K227250
$$ 693873367 695963440 697063980 696826401 695643005 694541245 694516449 695819778 697898788 700126038
1699.3G00126038K376175K940902L477173L232117K204742J268463J154023J632537
$$ 700126038 702502213 705443115 708920288 712152405 714357147 715625610 716779633 718412170
1707G18412170J902848J551895Q51364K26669k25601o39572j071472j442414j630706
$$ 718412170 720315018 721866913 722718277 722944946 722719345 722079773 721008301 719565887 717935181
1715.6G17935181j477814q19778K80532J361389J824036J465378O97021J57242J28403
$$ 717935181 716457367 715637589 715918121 717279510 719103546 720568924 721265945 721423187 721551590
1724.3G21551590L41186L26462p5454n51377o80084m56009l50418p34024j297150j281051
$$ 721551590 721892776 722219238 722143784 721592407 720912323 720456314 720105896 719371872 718074722 716793671
1734G16793671l92914P07397J067505N28183r6741M3488R58405J985931K590561K729873
$$ 716793671 716400757 717108154 718175659 718703842 718607101 718650589 719608994 721594925 724185486 726915359
1743.6G26915359K549286K088776J419601Q11310N23682N18875N72510O19201P60193
$$ 726915359 729464645 731553421 732973022 733784332 734308014 734826889 735399399 736018600 736778793
1752.3G36778793R19037P55768J06964o50177r43298p23114n84564j040802j825257
$$ 736778793 737697830 738453598 738560562 737910385 736967087 736243973 735659409 734618607 732793350
1761G32793350k159042j687622r28879o66122j049729j500320j476136j087112q17032
$$ 732793350 730634308 728946686 728017807 727351685 726301956 724801636 723325500 722238388 721421356
1769.7G21421356p93304o07910J04370J105957J745605J626053R28955J09406n35889
$$ 721421356 720628052 720020142 720124512 721230469 722976074 724602127 725531082 725640488 725104599
1778.3G25104599r33075j049881q79440n86396m59976o05850p78580o55899k63519
$$ 725104599 724171524 723121643 722242203 721655807 721195831 720589981 719811401 719155502 718891983
1787G18891983l509k16675p85981j234893j189194o95648j08795K56500L40271K74429
$$ 718891983 718888474 718671799 717885818 716650925 715461731 714766083 714657288 714913788 715254059 715528488
1796.7G15528488J92032J31683R1477J12304K60392N27954P95059R25446Q95919P88651
$$ 715528488 715720520 715852203 715943680 716055984 716316376 716844330 717639389 718564835 719460754 720249405
1806.3G20249405O55136M44107J09482k36969l80783k41547j0376K0294k50549o54526
$$ 720249405 720904541 721348648 721458130 721221161 720840378 720598831 720588455 720608749 720358200 719703674
1815.9G19703674r56802j066361j020431q61511o21491l94897k92130k84805k04315
$$ 719703674 718746872 717680511 716660080 715798569 715177078 714782181 714490051 714205246 714000931
1824.6G14000931J0147J44348n5313m70734o13632j60294N99366J004562P15714M1504
$$ 714000931 714011078 714155426 714100113 713629379 713015747 712855453 713454819 714459381 715175095 715216599
1834.3G15216599m59290n51148m08782k61078j70136j67160l82156q60596j336517
$$ 715216599 714757309 714206161 713797379 713536301 713366165 713199005 712816849 711956253 710619736
1842.9G10619736j386261q72422j32217L44925L70026J32217j01852k48490l70178
$$ 710619736 709233475 708361053 708228836 708573761 708943787 709076004 708974152 708725662 708355484
1851.6G08355484n05447o21796p02896p98264r60617j171646j349258j403275j276550
$$ 708355484 707850037 707228241 706525345 705727081 704766464 703594818 702245560 700842285 699565735
1860.3F99565735r57794n00489l2882K80533L23333J12000j87226l44619k21787J05133
$$ 699565735 698607941 698107452 698074570 698355103 698678436 698790436 698603210 698258591 698036804 698141937
1869.9F98141937L73001L19672j06812p08618j203003j427536j393890j189804q79746
$$ 698141937 698514938 698834610 698727798 698019180 696816177 695388641 693994751 692804947 691925201
1878.6F91925201n20324k15988q2322j26342k04773j58387l662N5237j59912n80292
$$ 691925201 691404877 691188889 691106567 690980225 690775452 690617065 690613403 690668640 690508728 689928436
1888.3F89928436r26056r81826q09632o50482o27212n94483l21121K08588P31277R49936
$$ 689928436 689002380 688020554 687210922 686560440 685933228 685338745 685017624 685226212 685957489 686907425
1897.9F86907425Q10013N04226K51923J23825P0877M0512K976r1019k90298n55649
$$ 686907425 687717438 688221664 688473587 688597412 688668289 688708801 688711777 688620758 688330460 687774811
1907.6F87774811p42951p27462n27649k79770j10855q3466k39563o03790j091080j481933
$$ 687774811 687031860 686304398 685776749 685496979 685386124 685302658 685063095 684459305 683368225 681886292
1917.2F81886292j587220j447677j291657j254425j206436r29565m32282R613J51520
$$ 681886292 680299072 678851395 677559738 676305313 675098877 674169312 673737030 673746643 673898163
1925.9F73898163M7684m5014J7014J21841P5150j68610m96216p95440j032105j166000
$$ 673898163 673945847 673900833 673917847 674039688 674114838 673946228 673450012 672654572 671622467 670456467
1935.5F70456467j082688o92672r0790M49676O82602N78690L08227M6769j71814m27170
$$ 670456467 669373779 668681107 668590317 669039993 669722595 670301285 670609512 670656281 670484467 670057297
1945.2F70057297p69577j130371j361542j351318j110077p63169m60281k61078r4147
$$ 670057297 669287720 668157349 666795807 665444489 664334412 663571243 663110962 662849884 662755737
1953.8F62755737J72196N99212J109009J545181J791306J831589J713104J479034J157303
$$ 662755737 662927933 663527145 664636154 666181335 667972641 669804230 671517334 672996368 674153671
1962.5F74153671P83386M14277J13296p0267j13372m0894O2943R4604J0071j38474
$$ 674153671 674937057 675351334 675464630 675394363 675280991 675240097 675303040 675397644 675407715 675269241
1972.2F75269241k61001l23334l62015m10995m41056m00695k97470k07062j89972k28500
$$ 675269241 675008240 674684906 674322891 673911896 673470840 673070145 672772675 672565613 672375641 672147141
1981.8F72147141k58561k56653k60009l03650l63159l87116l72238l73306m23050m67758
$$ 672147141 671888580 671631927 671371918 671068268 670705109 670317993 669945755 669572449 669149399 668681641
1991.5F68681641m20838k79388j60141j87912l60794n49164o29578n97839n43823n42679
$$ 668681641 668260803 667981415 667821274 667633362 667272568 666723404 666093826 665495987 664952164 664409485
2001.1F64409485n92575o48651o70395o36063n31921l69187j98440q7204p5379j52511
$$ 664409485 663816910 663168259 662497864 661861801 661329880 660960693 660762253 660675049 660599670 660447159
2010.7F60447159k71759l74680m03518l25776j66244J755J09787J42669J24741P4310
$$ 660447159 660175400 659800720 659397202 659071426 658905182 658906937 659016724 659159393 659284134 659358444
2020.4F59358444k365p7362j00098n3024J1444K2049k6474p2174p0724n5008q3390
$$ 659358444 659356079 659278717 659178619 659125595 659137039 659159088 659132614 659060440 658989716 658934708 658851318
2031F58851318j53198k02331j96305j76849k06757k90298l75061m18930m22669l94363
$$ 658851318 658698120 658495789 658299484 658122635 657915878 657625580 657250519 656831589 656408920 656014557
2040.6F56014557l19367k00119j02081j17264k65503m54025n57022n31006m37851l68118
$$ 656014557 655695190 655495071 655392990 655275726 655010223 654556198 653999176 653468170 653030319 652662201
2050.3F52662201l61404m01459m54941m94843m95910m41895l48358k58179k07901j99508
$$ 652662201 652300797 651899338 651444397 650949554 650453644 650011749 649663391 649405212 649197311 648997803
2059.9F48997803k14386k45743k96783l55301l83530l51563k78244k26135k50320l47367
$$ 648997803 648783417 648537674 648240891 647885590 647502060 647150497 646872253 646646118 646395798 646048431
2069.6F46048431m54406n00946m65241l89938l41034l50571l94211m25338m21753m00238
$$ 646048431 645594025 645093079 644627838 644237900 643896866 643546295 643152084 642726746 642304993 641904755
2079.2F41904755l87650l88107l78952l30582k32086j07269o638K2812j8921p5378
$$ 641904755 641517105 641128998 640750046 640419464 640187378 640080109 640073471 640096283 640077362 640001984
2088.9F40001984p7668o179R3078J56784J59683J18561N9357n188o5308j02615j06125
$$ 640001984 639924316 639918137 640011215 640167999 640327682 640446243 640505600 640500412 640435104 640332489 640226364
2099.5F40226364r2010r5597j42173k24839l06053l37334k81906j40190M1275J92795
$$ 640226364 640134354 640038757 639896584 639671745 639365692 639028358 638746452 638606262 638647537 638840332
2109.1F38840332K68631K73018K36397J76506R3269L8o4659p0915l8643k9030q7280
$$ 638840332 639108963 639381981 639618378 639794884 639888153 639888191 639823532 639752617 639713974 639684944 639597664
2119.7F39597664j98250l01742l43819l13111k35786j51710r8458j04751j81275l04069
$$ 639597664 639399414 639097672 638753853 638440742 638204956 638053246 637954788 637850037 637668762 637364693
2129.4F37364693m15840m53568l98254k94915k22473k24838k75345l08189k86560k35367
$$ 637364693 636948853 636495285 636097031 635802116 635579643 635354805 635079460 634771271 634484711 634249344
2139F34249344k02370k00805k04392j93329j94473k54631l78342n01785n37682m48875
$$ 634249344 634046974 633846169 633641777 633448448 633253975 632999344 632621002 632119217 631581535 631132660
2148.6F31132660k84233j38474q0528j05553j53427j67923j42173j13411j14861j43471
$$ 631132660 630848427 630709953 630629425 630523872 630370445 630202522 630060349 629946938 629832077 629688606
2158.3F29688606j67770j66435j52703j61514k17743l14941m17862m86260n02281m84352
$$ 629688606 629520836 629354401 629201698 629040184 628822441 628507500 628089638 627603378 627101097 626616745
2167.9F26616745m68674m77180m98810n04608m77715m19998l38707k40021j45721r9258
$$ 626616745 626148071 625670891 625172081 624667473 624189758 623769760 623431053 623191032 623045311 622946053
2177.6F22946053j29052k07977k66609k63672k35291k52990l39661m42657m94767m89769
$$ 622946053 622817001 622609024 622342415 622078743 621843452 621590462 621250801 620808144 620313377 619823608
2187.2F19823608m77218m94423n25093n29900n07240n02358n58929o69174p75147q17833
$$ 619823608 619346390 618851967 618326874 617796974 617289734 616787376 616228447 615559273 614784126 613966293
2196.9F13966293p80029o88820n80978m71344l53508k25678j04789n723Q1635J85738
$$ 613966293 613186264 612497444 611916466 611445122 611091614 610865936 610761147 610755424 610837059 611022797
2206.5F11022797L14216M30718M80880M38805L28827K04239J17302J00097J50681K27890
$$ 611022797 611337013 611767731 612248611 612687416 613016243 613220482 613337784 613437881 613588562 613816452
2216.1F13816452K70348K42233J67122J03798Q6822R9526J07040J02882J10741J44577
$$ 613816452 614086800 614329033 614496155 614599953 614686775 614786301 614893341 614996223 615106964 615251541
2225.8F15251541J85394J98403J59645O3820p5302k20909l19519l38364l01933k81525
$$ 615251541 615436935 615635338 615794983 615858803 615783501 615562592 615243073 614904709 614602776 614321251
2235.4F14321251l31650m40216n41611n76362n26810m17824k96135k15034k13165k83242
$$ 614321251 613989601 613549385 613007774 612431412 611904602 611486778 611190643 610975609 610762444 610479202
2245.1F10479202l68576m03595l68347k94571k27623j89781j86272k21481k92625l68042
$$ 610479202 610110626 609707031 609338684 609044113 608816490 608626709 608440437 608218956 607926331 607558289
2254.7F07558289l96653l46908k35939j18027n4512q6784k14882l82004m94652m88129
$$ 607558289 607161636 606814728 606578789 606460762 606406250 606319466 606104584 605722580 605227928 604739799
2264.4F04739799l89518l01972l11927m15802n37301o03256n90477n14335m03290k90489
$$ 604739799 604350281 604048309 603736382 603320580 602783279 602180023 601589546 601075211 600671921 600381432
2274F00381432k07177j63192j42708j29547j26801j38893j47324j35231j35421k22435
$$ 600381432 600174255 600011063 599868355 599738808 599612007 599473114 599325790 599190559 599055138 598832703
2283.7E98832703m27933o81954q70056r46197r62868r87816j025123j041832j049462
$$ 598832703 598404770 597722816 596852760 595906563 594943695 593955879 592930756 591888924 590839462
2292.3E90839462j106682j230049j340637j331100j184388r90829q45795p60574o99501
$$ 590839462 589732780 588502731 587162094 585830994 584646606 583655777 582809982 582049408 581349907
2301E81349907o79512p89147j079597j468391j787949j932373j937256j907425j898270
$$ 581349907 580670395 579881248 578801651 577333260 575545311 573612938 571675682 569768257 567869987
2309.7E67869987j885604j833420j750984j691819j726608j922264k296257k763176
$$ 567869987 565984383 564150963 562399979 560708160 558981552 557059288 554763031 551999855
2317.4E51999855l147049l287163l142814k784539k320594j869278j576271j551400
$$ 551999855 548852806 545565643 542422829 539638290 537317696 535448418 533872147 532320747
2325.1E32320747j745910j949539j982995j861038j697998j500206j175575p65801
$$ 532320747 530574837 528625298 526642303 524781265 523083267 521583061 520407486 519641685
2332.8E19641685n17196o03676q65135r83124q88824q30002r74083j118164r18045
$$ 519641685 519124489 518520813 517655678 516672554 515783730 514953728 513979645 512861481 511943436
2341.5E11943436k77787O77338J924515L498268M985771N354386L703498K94304l383865
$$ 511943436 511665649 512342987 514267502 517765770 522751541 528105927 531809425 532103729 528719864
2350.2E28719864n760536o391297o012115n565148n349121n066414m413871l434639
$$ 528719864 522959328 516568031 510555916 504990768 499641647 494575233 490161362 486726723
2357.9D86726723k379914j424369n87197J71318Q76732J552963K238083K957688L681183
$$ 486726723 484346809 482922440 482335243 482506561 483383293 484936256 487174339 490132027 493813210
2366.6D93813210M321670M782257N020752N083313N073319N074920N093689N067177
$$ 493813210 498134880 502917137 507937889 513021202 518094521 523169441 528263130 533330307
2374.3E33330307M927940M664460M337730M050140L883210L839988L837433L768273
$$ 533330307 538258247 542922707 547260437 551310577 555193787 559033775 562871208 566639481
2382E66639481L572425L249245K814865K275238J657334J042862N41381K21672P9880
$$ 566639481 570211906 573461151 576276016 578551254 580208588 581251450 581792831 582014503 582094383
2390.7E82094383O0654R4299J10855N5657p9346k45628l71590m21829m06685l54958
$$ 582094383 582155037 582249336 582360191 582415848 582336502 582090874 581719284 581297455 580890770 580535812
2400.3E80535812k91023k39525k32162k78855l42140l57055k87285j60561m5242O027
$$ 580535812 580244789 580005264 579773102 579494247 579152107 578795052 578507767 578347206 578301964 578307991
2410E78307991p858m9401q3389j06239j33591j62353j55716p9308M1237J16806O8893
$$ 578307991 578300133 578250732 578167343 578061104 577927513 577765160 577609444 577530136 577571373 577688179 577757072
2420.6E77757072q9874k53067l11317k44980j31760p0076r8343j80359k55889k94877
$$ 577757072 577667198 577414131 577102814 576857834 576726074 576655998 576557655 576377296 576121407 575826530
2430.2E75826530l04756k98767k70691k10075j35956r7008j30157k19422l10173l56559
$$ 575826530 575521774 575223007 574952316 574742241 574606285 574509277 574379120 574159698 573849525 573492966
2439.9E73492966l53623l19938k70272k13318j69258j66740k15492k90947l50991l69224
$$ 573492966 573139343 572819405 572549133 572335815 572166557 571999817 571784325 571493378 571142387 570773163
2449.5E70773163l48206l09868k81486k81830l13148l57476l90777l97950l74145l12881
$$ 570773163 570424957 570115089 569833603 569551773 569238625 568881149 568490372 568092422 567718277 567405396
2459.2E67405396k11907r4032j3504j7128r3308j72920j87836j31912n5733j2855j6022
$$ 567405396 567193489 567099457 567085953 567068825 566975517 566802597 566614761 566482849 566427116 566414261 566398239
2469.8E66398239m6882q9303j41525j99280k40974k45056k15988j86501j81656j88560
$$ 566398239 566351357 566262054 566120529 565921249 565680275 565435219 565219231 565032730 564851074 564662514
2479.4E64662514j68610j04065k2278L2006M5547M2687M5700M8065L0899k67j7204
$$ 564662514 564493904 564389839 564367561 564399567 564445114 564487801 564533501 564581566 564612465 564612198 564594994
2490E64594994m082K2812L6583L4675L9330P1144J19553J45301J08834J2130q6975
$$ 564594994 564590912 564613724 564650307 564684982 564724312 564795456 564915009 565060310 565169144 565181274 565094299
2500.6E65094299j11084l9177N7564P2174k9068j66855k27165j76315q4953m7455r1934
$$ 565094299 564983215 564944038 565001602 565073776 565044708 564877853 564650688 564474373 564389420 564341965 564250031
2511.2E64250031j73111k31286k40631k09083j55258r6207m6692j8730k0294n0125
$$ 564250031 564076920 563845634 563605003 563395920 563240662 563144455 563097763 563079033 563058739 563008614
2520.9E63008614r8114j45112j74446j86729k00996k38991l02429l66517l95355l69758
$$ 563008614 562910500 562765388 562590942 562404213 562203217 561964226 561661797 561295280 560899925 560530167
2530.5E60530167l07656k56042k53334k91100l13759k76069j99356j60599k16713l42331
$$ 560530167 560222511 559966469 559713135 559422035 559108276 558832207 558632851 558472252 558255539 557913208
2540.2E57913208m52080m82902m44298l92990l70331l73535l77579l69606l55415l47252
$$ 557913208 557461128 556978226 556533928 556140938 555770607 555397072 555019493 554649887 554294472 553947220
2549.8E53947220l48435l51486l41720l06435k49977k04277k10800k79961l64456l89633
$$ 553947220 553598785 553247299 552905579 552599144 552349167 552144890 551934090 551654129 551289673 550900040
2559.5E50900040l26844k30293j86920k23007k81716k99224k93351l48701n04036o82564
$$ 550900040 550573196 550342903 550155983 549932976 549651260 549352036 549058685 548709984 548205948 547523384
2569.1E47523384p56683o81687n46341m78668n13725n66406n30587l91311k33917j54229
$$ 547523384 546766701 546085014 545538673 545060005 544546280 543979874 543449287 543057976 542824059 542669830
2578.7E42669830j70974k23313k41966k11144j66854j42327j33362j09710n2452K8381
$$ 542669830 542498856 542275543 542033577 541822433 541655579 541513252 541379890 541270180 541217728 541246109
2588.4E41246109J15547K03743K97814L89213M51050M57039M08630L37639K82173K60239
$$ 541246109 541361656 541565399 541863213 542252426 542703476 543160515 543569145 543906784 544188957 544449196
2598E44449196K56386K32124J53389K5291r4490j28708m4174J03607K08245K01835
$$ 544449196 544705582 544937706 545091095 545116386 545021896 544893188 544849014 544952621 545160866 545362701
2607.7E45362701J11733K3308p019M196P629j8348n5314q2054r8190j13831j30043
$$ 545362701 545474434 545497742 545490723 545494919 545502548 545484200 545428886 545346832 545248642 545134811 545004768
2618.3E45004768j43165j53618j62850j63421j48659j28975j24321j40381j65176j91994
$$ 545004768 544861603 544707985 544545135 544381714 544233055 544104080 543979759 543839378 543674202 543482208
2627.9E43482208k28348k71644k89116k49596j76658j42289j92413k89917l51562l38097
$$ 543482208 543253860 542982216 542693100 542443504 542266846 542124557 541932144 541642227 541290665 540952568
2637.6E40952568k92778k78778l03612l14445k67868j86158j36070j60599k34222k91100
$$ 540952568 540659790 540381012 540077400 539762955 539495087 539308929 539172859 539012260 538778038 538486938
2647.2E38486938k88162k45132k23503k65045l54386m33464m55818m22287l70636l40729
$$ 538486938 538198776 537953644 537730141 537465096 537110710 536677246 536221428 535799141 535428505 535087776
2656.9E35087776l47938l78075l99475l84026l29132k65693k30828k26669k14195j58272
$$ 535087776 534739838 534361763 533962288 533578262 533249130 532983437 532752609 532525940 532311745 532153473
2666.5E32153473q0452m5700q9874j67351j86577j00555M0588J36909J30349N2108
$$ 532153473 532073021 532027321 531937447 531770096 531583519 531482964 531523552 531660461 531790810 531842918
2676.1E31842918j9798m1542m4632r5138k14882l46604l96766l25013j84478p9575
$$ 531842918 531823120 531781578 531736946 531641808 531426926 531080322 530683556 530358543 530174065 530094490
2685.8E30094490p9384j70402k83013l51677l54156l08724k47535j92299j44310r2659
$$ 530094490 530015106 529844704 529561691 529210014 528855858 528547134 528299599 528107300 527962990 527870331
2695.4E27870331l6621J411p171o3324j28365j55907j37291j11427j27335j94397k72178
$$ 527870331 527833710 527835121 527827950 527764626 527636261 527480354 527343063 527231636 527104301 526909904 526637726
2706E26637726l06893k79655k25945j99241k15645k37541k18544j63880j29394j52931
$$ 526637726 526330833 526051178 525825233 525625992 525410347 525172806 524954262 524790382 524660988 524508057
2715.7E24508057k03438k16942j79939j50719j83144k52342k83317k46849j99471k09923
$$ 524508057 524304619 524087677 523907738 523757019 523573875 523321533 523038216 522791367 522591896 522381973
2725.3E22381973k72369l18604l08570k82021l03040l74412m30145m12674l37487k74276
$$ 522381973 522109604 521791000 521482430 521200409 520897369 520522957 520092812 519680138 519342651 519068375
2735E19068375k75612l35732m08020m46357m29268l59269k57301j52550p0381k3613
$$ 519068375 518792763 518457031 518049011 517602654 517173386 516814117 516556816 516404266 516333885 516310272
2744.6E16310272j8768o1302j46485k40020k90451k72217k18430j93519k31514l04566
$$ 516310272 516291504 516230202 516083717 515843697 515553246 515281029 515062599 514869080 514637566 514333000
2754.3E14333000l58887l67698l44773l12919k83547k66685k86369l61748m74587n64956
$$ 514333000 513974113 513606415 513261642 512948723 512665176 512398491 512112122 511750374 511275787 510710831
2763.9E10710831n73235m89540l67165k83889k83623l42064l90663l85361l53508l70598
$$ 510710831 510137596 509648056 509280891 508997002 508713379 508371315 507980652 507595291 507241783 506871185
2773.5E06871185m74930o11267o69899n86090l94592j90735m6005K6741M6120K7122
$$ 506871185 506396255 505784988 505115089 504528999 504134407 503943672 503897667 503924408 503970528 503997650
2783.2E03997650j8310o4660q0184n8976l0861l7612r0905j63154k12860k19193j98440
$$ 503997650 503979340 503914680 503834496 503775520 503744659 503707047 503616142 503452988 503240128 503020935 502822495
2793.8E02822495j87302k10953k64435l20129l54195l64418l63731l63197l65105l70560
$$ 502822495 502635193 502424240 502159805 501839676 501485481 501121063 500757332 500394135 500029030 499658470
2803.4D99658470l84788m07944m23431m06762l51982k86865k52266k66266l08075l41797
$$ 499658470 499273682 498865738 498442307 498035545 497683563 497396698 497144432 496878166 496570091 496228294
2813.1D96228294l54271l62167l84636m13704m24957m09431l88222l88260m10843m34113
$$ 496228294 495874023 495511856 495127220 494713516 494288559 493879128 493490906 493102646 492691803 492257690
2822.7D92257690m34913m06647l59497l16963l12691l68805m62265n31425n33181m98123
$$ 492257690 491822777 491416130 491056633 490739670 490426979 490058174 489595909 489064484 488531303 488033180
2832.4D88033180n02052n77889o74362p17811o99540o74858o79512o82716o32057n25475
$$ 488033180 487531128 486953239 486278877 485561066 484861526 484186668 483507156 482824440 482192383 481666908
2842D81666908m05273k96517j84173o9313j2322q5716k78168m72068n39322m53110
$$ 481666908 481261635 480965118 480780945 480711632 480699310 480613594 480335426 479863358 479324036 478870926
2851.7D78870926l07007k17895k24228k73247k97051k82516k72904l09791l89175m66881
$$ 478870926 478563919 478346024 478121796 477848549 477551498 477268982 476996078 476686287 476297112 475830231
2861.3D75830231n00565m80652m33120l99895m09470m53300m83818m55170l74222l11355
$$ 475830231 475329666 474849014 474415894 474015999 473606529 473153229 472669411 472214241 471840019 471528664
2870.9D71528664l41683m68483o09474o68411o18057n19066m55857m61197m97131n05905
$$ 471528664 471186981 470718498 470109024 469440613 468822556 468303490 467847633 467386436 466889305 466383400
2880.6D66383400m74777m52004m91447n84412o53267o28433n26466m42505m52881n42755
$$ 466383400 465908623 465456619 464965172 464380760 463727493 463099060 462572594 462130089 461677208 461134453
2890.2D61134453o31561o63033o45866o12030n70488n21202n01252n68542p30705r06487
$$ 461134453 460502892 459839859 459193993 458581963 458011475 457490273 456989021 456420479 455689774 454783287
2899.9D54783287r90066r52034q61092q08868q31833r06945r99260j085014j138153
$$ 454783287 453793221 452841187 451980095 451171227 450339394 449432449 448433189 447348175 446210022
2908.6D46210022j133537j079521j031800j048240j132432j234054j308746j355553
$$ 446210022 445076485 443996964 442965164 441916924 440784492 439550438 438241692 436886139
2916.3D36886139j393280j421318j417885j365318j250725j053696p67746m46357j93024
$$ 436886139 435492859 434071541 432653656 431288338 430037613 428983917 428216171 427769814 427576790
2925D27576790p1564l2959L0556J50871K34299J65863n3825l05329m70695n31273n41306
$$ 427576790 427505226 427472267 427502823 427653694 427887993 428053856 428000031 427694702 427224007 426692734 426151428
2935.6D26151428n48134n64613n96046o47126o98852p09191o65702o20385o50558p79190
$$ 426151428 425603294 425038681 424442635 423795509 423096657 422387466 421721764 421101379 420450821 419671631
2945.2D19671631r54170j102600j191597j232262j243286j234970j222191j228943
$$ 419671631 418717461 417614861 416423264 415191002 413947716 412712746 411490555 410261612
2952.9D10261612j268997j326180j367187j375275j364784j367531j399384j449165
$$ 410261612 408992615 407666435 406299248 404923973 403559189 402191658 400792274 399343109
2960.6C99343109j492119j518631j545028j589775j639138j641578j552086j385956
$$ 399343109 397850990 396332359 394787331 393197556 391558418 389916840 388364754 386978798
2968.3C86978798j229553j179200j262054j413994j535110j574059j558952j555672
$$ 386978798 385749245 384570045 383307991 381893997 380358887 378784828 377225876 375670204
2976.1C75670204j602707j687317j776085j852340j909981j929016j877175j747817
$$ 375670204 374067497 372380180 370604095 368751755 366841774 364912758 363035583 361287766
2983.8C61287766j584206j450119j372948j324844j256066j135482r57489p31011m83208
$$ 361287766 359703560 358253441 356880493 355555649 354299583 353164101 352206612 351475601 350992393
2992.5C50992393k70233j61895j99967l77006o59943j025238j455917j908074k297745
$$ 350992393 350722160 350560265 350360298 349983292 349323349 348298111 346842194 344934120 342636375
3001.1C42636375k537460k594185k505073k341385k154999j957054j743851j530762
$$ 342636375 340098915 337504730 334999657 332658272 330503273 328546219 326802368 325271606
3008.8C25271606j357231j251335j197357j143951j049958r15699p71084o50939o05145
$$ 325271606 323914375 322663040 321465683 320321732 319271774 318356075 317584991 316934052 316328907
3017.5C16328907p28836j143360j913052k956657m047337m910545n339852n254726
$$ 316328907 315600071 314456711 312543659 309587002 305539665 300629120 295289268 290034542
3025.2B90034542m684296l710975k404118p80010J164417L342858N481262P155361
$$ 290034542 285350246 281639271 279235153 278455143 279619560 282962418 288443680 295599041
3033B95599041P985744P853184O955967N669823M342613L182297K273788J640282J271019
$$ 295599041 303584785 311437969 318393936 324063759 328406372 331588669 333862457 335502739 336773758
3041.6C36773758J121025J119347J201439J329498J485519J654244J820297J978569
$$ 336773758 337894783 339014130 340215569 341545067 343030586 344684830 346505127 348483696
3049.4C48483696K129173K248688K275810K145043J853065J496277J227798J164284
$$ 348483696 350612869 352861557 355137367 357282410 359135475 360631752 361859550 363023834
3057.1C63023834J312523J572609J798592J866417J718025J379165R44825N33065K33346
$$ 363023834 364336357 365908966 367707558 369573975 371292000 372671165 373615990 374149055 374382401
3065.7C74382401R0065J27296L70750Q23784J424904K042389K527351K771912K735672
$$ 374382401 374472466 374599762 374970512 375794296 377219200 379261589 381788940 384560852 387296524
3074.4C87296524K444191J982346J475105J047020P80792P17201Q76198J246796J738510
$$ 387296524 389740715 391723061 393198166 394245186 395025978 395743179 396619377 397866173 399604683
3083.1C99604683K177467K402535K394600K297134K288208K422714K595101K645073
$$ 399604683 401782150 404184685 406579285 408876419 411164627 413587341 416182442 418827515
3090.8D18827515K490234K170754J799583J481247J264267J137199J055680R77630
$$ 418827515 421317749 423488503 425288086 426769333 428033600 429170799 430226479 431204109
3098.5D31204109Q79326P54089O03714M40903K94075J93596J40343Q9760j6022j91231
$$ 431204109 432083435 432837524 433441238 433882141 434176216 434369812 434510155 434599915 434583893 434392662
3108.2D34392662l85246n16434n33485m49372l35769k90947l88489o20613q77571j013184
$$ 434392662 434007416 433490982 432957497 432508125 432172356 431881409 431492920 430872307 429994736 428981552
3117.8D28981552r65729q20274p24411p36656p73392p16171n44396l37562j61629j488
$$ 428981552 428015823 427195549 426471138 425734482 424961090 424244919 423700523 423362961 423201332 423199844
3127.5D23199844J83335L71055M95644N38368N66521O54106P86514Q69408Q31642O99654
$$ 423199844 423383179 423754234 424249878 424788246 425354767 426008873 426795387 427664795 428496437 429196091
3137.1D29196091N63087M80576M34189L75251K99683K57416K83508L35121L18794J88714
$$ 429196091 429759178 430239754 430673943 431049194 431348877 431606293 431889801 432224922 432543716 432732430
3146.8D32732430J525j38626j81579j66588j64223k04162k67296l26500l68309l86849
$$ 432732430 432733955 432595329 432413750 432247162 432082939 431878777 431611481 431284981 430916672 430529823
3156.4D30529823l75976l39318k94075k54554k19384j81388j47820j45836k02484l13835
$$ 430529823 430153847 429814529 429520454 429265900 429046516 428865128 428717308 428571472 428368988 428055153
3166D28055153m29115m66881l73039j75972K3231J35613J58004J55831J74141J91154
$$ 428055153 427626038 427159157 426786118 426610146 426633377 426768990 426926994 427082825 427256966 427448120
3175.7D27448120J66626J12152Q8921J36604K26097K86331K65198J65253L6888n1155
$$ 427448120 427614746 427726898 427815819 427952423 428178520 428464851 428730049 428895302 428932190 428881035
3185.3D28881035n2147K1057R8190J00403K213j53199k92320l64341l68805l47519
$$ 428881035 428828888 428849945 428948135 429048538 429050751 428897552 428605232 428240891 427872086 427524567
3195D27524567l50304l89709m25873m06609l38440k98004l53088m78974n72929n64194
$$ 427524567 427174263 426784554 426358681 425952072 425613632 425315628 424962540 424483566 423910637 423346443
3204.6D23346443m90532m53529n10445o29692p43522q18863q67157r05724r34563r48791
$$ 423346443 422855911 422402382 421891937 421262245 420518723 419699860 418832703 417926979 416992416 416043625
3214.3D16043625r51271r48792r44748r43718r54208r75113r84421r54094q86650q19587
$$ 416043625 415092354 414143562 413198814 412255096 411300888 410325775 409341354 408387260 407500610 406681023
3223.9D06681023p88308p89413p96013p98759q20504q77037r47227r99603j037827
$$ 406681023 405892715 405103302 404307289 403508530 402688026 401810989 400863762 399864159 398826332
3232.6C98826332j093254j165123j195831j126023r63592p72476n94330m14353k16407
$$ 398826332 397733078 396567955 395372124 394246101 393282509 392510033 391915703 391501350 391284943
3241.3C91284943m4213K6360k6817j41755k37159k89650l32222l98331m91371n97077
$$ 391284943 391240730 391267090 391240273 391098518 390861359 390571709 390239487 389841156 389349785 388752708
3250.9C88752708o97555p66831p81059p50465p29256p64084q40034q95348q95080q71506
$$ 388752708 388055153 387288322 386507263 385756798 385027542 384263458 383423424 382528076 381632996 380761490
3260.5C80761490q77953r21173r61151r72176r75799j005249j056938j094284j096611
$$ 380761490 379883537 378962364 378001213 377029037 376053238 375047989 373991051 372896767 371800156
3269.2C71800156j081314j079941j099587j120186j122055j107101j092835j093139
$$ 371800156 370718842 369638901 368539314 367419128 366297073 365189972 364097137 363003998
3276.9C63003998j104813j108017j084289j041451j018028j060639j176223j314545
$$ 363003998 361899185 360791168 359706879 358665428 357647400 356586761 355410538 354095993
3284.7C54095993j399612j389313j307716j223908j199036j249847j350861j464386
$$ 354095993 352696381 351307068 349999352 348775444 347576408 346326561 344975700 343511314
3292.4C43511314j570167j670838j770515j846809j850510j746826j566353j408920
$$ 343511314 341941147 340270309 338499794 336652985 334802475 333055649 331489296 330080376
3300.1C30080376j377373j495400j683349j820679j837921j757431j654568j586838
$$ 330080376 328703003 327207603 325524254 323703575 321865654 320108223 318453655 316866817
3307.8C16866817j558055j540757j519489j510162j534844j588020j634903j645203
$$ 316866817 315308762 313768005 312248516 310738354 309203510 307615490 305980587 304335384
3315.5C04335384j625671j607189j608505j621380j635781j660404j697769j704559
$$ 304335384 302709713 301102524 299494019 297872639 296236858 294576454 292878685 291174126
3323.2B91174126j603203j347580r74655n73197k09369J11007M14029P12661R99146
$$ 291174126 289570923 288223343 287248688 286675491 286466122 286577129 286991158 287703819 288702965
3331.9B88702965J263904J504650J721859J913834K079468K217712K327729K416000
$$ 288702965 289966869 291471519 293193378 295107212 297186680 299404392 301732121 304148121
3339.6C04148121K500267K593021K684880K757492K819900K911396L046456L176307
$$ 304148121 306648388 309241409 311926289 314683781 317503681 320415077 323461533 326637840
3347.3C26637840L224945L168564L053360K936402K828750K719040K622376K570648
$$ 326637840 329862785 333031349 336084709 339021111 341849861 344568901 347191277 349761925
3355.1C49761925K555275K514534K394523K209626K024536J884651J781769J681518
$$ 349761925 352317200 354831734 357226257 359435883 361460419 363345070 365126839 366808357
3362.8C66808357J565819J444511J339798J263924J203690J129150J026878R24721
$$ 366808357 368374176 369818687 371158485 372422409 373626099 374755249 375782127 376706848
3370.5C76706848Q62847Q32710P67479O20804M40673L34626L49846M19158M39072L83721
$$ 376706848 377569695 378402405 379169884 379790688 380231361 380565987 380915833 381334991 381774063 382157784
3380.1C82157784L07121K53334K02751J20277K6055j6632K6016J14403J67198J29814
$$ 382157784 382464905 382718239 382920990 383041267 383067322 383050690 383076706 383191109 383358307 383488121
3389.8C83488121J0300j27068k06947j99471j41296r8648r5673r8190p2823m8523q7890
$$ 383488121 383498421 383371353 383164406 382964935 382823639 382724991 382629318 382531128 382458305 382409782 382321892
3400.4C82321892j99661l08533l27873k52915j61362j32370j81274k71797l64342m36172
$$ 382321892 382122231 381813698 381485825 381232910 381071548 380939178 380757904 380486107 380121765 379685593
3410C79685593m68560m43229l61023k61231k08397k51121l80669n23414n84298n19790
$$ 379685593 379217033 378773804 378412781 378151550 377943153 377692032 377311363 376787949 376203651 375683861
3419.7C75683861l73306k40593j87302k02751k30026k30752k13966k09350k33613k83317
$$ 375683861 375310555 375069962 374882660 374679909 374449883 374219131 374005165 373795815 373562202 373278885
3429.3C73278885l42293l79906l52401k34375o2638P0572Q9417M310j03683j71585
$$ 373278885 372936592 372556686 372204285 371969910 371907272 371977844 372067261 372071571 371967888 371796303
3439C71796303k09999k61116l21656l39393k87476k07290j53122j11237j9340J35459
$$ 371796303 371586304 371325188 371003532 370664139 370376663 370169373 370016251 369905014 369885674 370021133
3448.6C70021133K66304K73133J61056M2115J8959Q6555J57471J55525P5836l1395
$$ 370021133 370287437 370560570 370721626 370763741 370782700 370869255 371026726 371182251 371258087 371226692
3458.2C71226692j01127q9188J53J08032J54762J07727J1063n6649m7035L5744J60294
$$ 371226692 371125565 371036377 371036530 371144562 371299324 371407051 371418114 371361465 371314430 371350174 371510468
3468.8C71510468K84385L54157L24745K09961R4871P4234J60599K72904L13224K50206
$$ 371510468 371794853 372149010 372473755 372683716 372778587 372852821 373013420 373286324 373599548 373849754
3478.5C73849754J32141M4785N9586J94740L85742M99840M34074K25525M3831L5973
$$ 373849754 373981895 374026680 374086266 374281006 374666748 375166588 375600662 375826187 375870018 375905991
3488.1C75905991J77536L07960L10478K24114J62353J62926J70403J55830J84059L21045
$$ 375905991 376083527 376391487 376701965 376926079 377088432 377251358 377421761 377577591 377761650 378082695
3497.8C78082695N02892N57785L76281M6883j98402j71662J17836M72222O58721N88723
$$ 378082695 378585587 379143372 379519653 379566536 379368134 379196472 379314308 379786530 380445251 381033974
3507.4C81033974L76434K24533K35863L39088L96729L65143L13682L03803L10859K87552
$$ 381033974 381410408 381634941 381870804 382209892 382606621 382971764 383285446 383589249 383900108 384187660
3517.1C84187660K55738K74200L30734L35617K47536J52397J62735K67105L38860L01513
$$ 384187660 384443398 384717598 385048332 385383949 385631485 385783882 385946617 386213722 386552582 386854095
3526.7C86854095K27128K42424L75289N38025O34308O31867N36499L64189J71661O8474
$$ 386854095 387081223 387323647 387698936 388236961 388871269 389503136 390039635 390403824 390575485 390643959
3536.4C90643959J26305K83279L88451L64227K84996K70958L30963L63197L04070K27509
$$ 390643959 390770264 391053543 391441994 391806221 392091217 392362175 392693138 393056335 393360405 393587914
3546C93587914K68707M58526O68335P23000N71937L41950K26288L09219M94461O08788
$$ 393587914 393856621 394315147 394983482 395706482 396278419 396620369 396846657 397155876 397650337 398259125
3555.6C98259125N70030M42924L37525K95906K98881L37105M06151M28772K76260o5574
$$ 398259125 398829155 399272079 399609604 399905510 400204391 400541496 400947647 401376419 401652679 401587105
3565.3D01587105l80249l59497J00746P69501J267509J373673J151084Q19245N58014
$$ 401587105 401206856 400847359 400948105 401717606 402985115 404358788 405509872 406329117 406887131
3574D06887131M23965L95241M38080N17463N76211N53817M64363M27781N50231P39022
$$ 406887131 407311096 407706337 408144417 408661880 409238091 409791908 410256271 410684052 411234283 411973305
3583.6D11973305P06634K66381l68729o84776l48969M33312J096420J232567Q97827
$$ 411973305 412679939 412946320 412577591 411892815 411543846 411977158 413073578 414306145 415203972
3592.3D15203972M45022J74637J66931L44773N72777P15217P00150N86090N28908O39495
$$ 415203972 415648994 415823631 415990562 416335335 416908112 417623329 418323479 418909569 419438477 420077972
3601.9D20077972Q71277J048622J001892O96526K83814K8343J16424M64936P42836
$$ 420077972 420949249 421997871 422999763 423696289 423980103 424008446 424124870 424589806 425332642
3610.6D25332642O62994K86980j870J10512N14603P55844N04112o6147m15344j80473
$$ 425332642 425995636 426282616 426280746 426391258 426905861 427661705 428165817 428099670 427684326 427503853
3620.3D27503853M54674R80682J113014J000900Q53920N41230j87493j106071j442413
$$ 427503853 427958527 428939209 430052223 431053123 431907043 432448273 432260780 431154709 429712296
3628.9D29712296o55404Q21801J889610J875343J139069N22690M19807N73959O26832
$$ 429712296 429056892 429878693 431768303 433643646 434782715 435305405 435725212 436299171 436926003
3637.6D36926003N42984M54864L79868K80532K45667L78952N33180L67203k56844j057663
$$ 436926003 437468987 437923851 438303719 438584251 438829918 439208870 439742050 440109253 439852409 438794746
3647.3D38794746j571769j510964q53386K44980J437035K167587J969109R43260j58119
$$ 438794746 437222977 435712013 434858627 435103607 436540642 438708229 440677338 441620598 441462479
3655.9D41462479n38140q2397N95817Q41942N80483K13394N8288Q3886J56822K69012
$$ 441462479 440924339 440841942 441437759 442279701 442860184 443073578 443131866 443215752 443372574 443641586
3665.6D43641586L52288Q7051p33261j620255j587677k89611J223526J368866j92032
$$ 443641586 443993874 444080925 443347664 441727409 440139732 439850121 441073647 442442513 442250481
3674.3D42250481j987992k246513p86629R27277J520080J044350M79546L80058M72755
$$ 442250481 440262489 438015976 437229347 438156624 439676704 440721054 441200600 441580658 442053413
3682.9D42053413L88832K11831J25923o2599o66008j511040j949005j531334m83093
$$ 442053413 442442245 442654076 442779999 442717400 442051392 440540352 438591347 437060013 436576920
3691.6D36576920N57365J101150J068383O87561K96631J36337J51024K2926m44717
$$ 436576920 437134285 438235435 439303818 439991379 440288010 440424347 440575371 440598297 440153580
3700.3D40153580r82094j055260m76227L25089P28416N36461N1537l72277o67915r21097
$$ 440153580 439171486 438116226 437639999 437965088 438693504 439229965 439281502 438909225 438241310 437320213
3709.9D37320213j055488q17757r3193Q36296J428909J332283P05491N3596k85644
$$ 437320213 436264725 435446968 435353775 436190071 437618980 438951263 439656754 439710350 439424706
3718.6D39424706m27094o47964r19075r32351o12220l32985m25682o34385l86161L96080
$$ 439424706 438997612 438349648 437430573 436498222 435886002 435553017 435127335 434492950 434106789 434502869
3728.3D34502869J071281J011810L09906m57344r53598j238479j308174r28078p7210
$$ 434502869 435574150 436585960 436895866 436438522 435484924 434246445 432938271 432010193 431932983
3736.9D31932983P99866J268196J401711J463279J261330L32604j130486k038498j512184
$$ 431932983 432732849 434001045 435402756 436866035 438127365 438459969 437329483 435290985 433778801
3745.6D33778801m4937Q84857M00581q78257j621247j174774J3886J104545J633759
$$ 433778801 433733864 434618721 435019302 434141045 432519798 431345024 431358910 432463455 434097214
3754.3D34097214J609878J194039N29251j87989o58607o18744q2397N53856P46116
$$ 434097214 435707092 436901131 437430382 437242393 436583786 435965042 435882645 436436501 437182617
3763D37182617K99835l63235n92804k42119J36604k5787n62897p55119k46887M98161
$$ 437182617 437482452 437119217 436526413 436284294 436420898 436395111 435832214 435077095 434830208 435328369
3772.6D35328369P91931N28488J49842n9242k69242o38962q90197o36368l662M02336
$$ 435328369 436120300 436648788 436798630 436739388 436470146 435831184 434940987 434304619 434300957 434703293
3782.3D34703293K08816k75306m46930j06888L88412N85747L75023j8425k97508l06778
$$ 434703293 434912109 434636803 434189873 434082985 434471397 435057144 435432167 435413742 435116234 434809456
3791.9D34809456j33209p7973l90091q92257j009331m22402L37830L04375p30820j707077
$$ 434809456 434676247 434598274 434208183 433315926 432306595 431884193 432222023 432526398 431795578 430088501
3801.5D30088501j368217J89895J461868J207314j24741r90638n82581M02794Q68187
$$ 430088501 428720284 428910179 430372047 431579361 431454620 430463982 429881401 430284195 431152382
3810.2D31152382O54869L77998K72370j14365r53331j482735q84170L97873Q76961
$$ 431152382 431807251 432185249 432457619 432343254 431389923 429907188 429023018 429420891 430297852
3818.9D30297852k08512j778412k017555m73404J400528J901360R03244k51923m47311
$$ 430297852 430089340 428310928 426293373 425819969 427220497 429121857 430025101 429773178 429325867
3827.6D29325867Q3427L61862k4986n63202o08635j71051J98631O2676n21088j134262
$$ 429325867 429409294 429771156 429746170 429182968 428574333 428403282 428601913 428664589 428143501 427009239
3837.2D27009239j332741r17968r7390N98755P33376L93028R1972J74828M38957M75083
$$ 427009239 425676498 424758530 424661140 425259895 425993271 426386299 426478271 426653099 427092056 427567139
3846.9D27567139K32238j0452k07405p26623j753960k718811k671662j302528O20422
$$ 427567139 427799377 427788925 427581520 426854897 425100937 422382126 419710464 418407936 419028358
3855.6D19028358J939888K126809J548957Q88596M76036J64375l10134r09005j207657
$$ 419028358 420968246 423095055 424644012 425532608 426008644 426173019 425862885 424953880 423746223
3864.2D23746223p83233K06871R20906N69611o44570j559677j261635j31645O07719
$$ 423746223 422962990 423169861 424090767 424660378 424015808 422456131 421194496 421062851 421670570
3872.9D21670570L73612j29013O6414Q27217J032867N1041j326523j710396p09953
$$ 421670570 422044182 421915169 421981583 422808800 423841667 423892708 422566185 420855789 420145836
3881.6D20145836O09131R13925L1967r46693q98819J64947J185456J195106K60925
$$ 420145836 420754967 421668892 421700859 420754166 419855347 420020294 421205750 422400856 422661781
3890.3D22661781o91909q74138l32070K93045N06096L29247M4288j86538l64075m92897
$$ 422661781 421969872 421095734 420763664 421056709 421562805 421892052 421936340 421749802 421385727 420892830
3899.9D20892830n54581n99861p04002p99790o70471j89552M77066R66072J007347
$$ 420892830 420338249 419738388 419034386 418234596 417564125 417374573 417851639 418817711 419825058
3908.6D19825058O22330R2086k50396k62490j03721p5455l04756o08864p07092n18112
$$ 419825058 420447388 420539474 420289078 420026588 419922867 419847412 419542656 418933792 418226700 417708588
3918.2D17708588j79367J50451L79753M03633J35537k95372n29557l24287J37825M22859
$$ 417708588 417529221 417679672 418059425 418463058 418598595 418303223 417773666 417449379 417587204 418010063
3927.9D18010063L07770n0812l81470n56793n58662l73001n5619K00730K27394Q7929
$$ 418010063 418317833 418267021 417885551 417328758 416770096 416397095 416341476 416542206 416769600 416857529
3937.5D16857529o066J7701Q697j69449m20875n03655k93426P5187L03612J76048k25944
$$ 416857529 416851463 416869164 416877861 416708412 416287537 415783882 415490456 415565643 415869255 416045303 415819359
3948.1D15819359n47486m83245j05133K11143K12555J9455j08261j16348j36986k20909
$$ 415819359 415271873 414788628 414683495 414894638 415107193 415126648 415018387 414902039 414765053 414544144
3957.8D14544144k85912l04756l47290m01688l36227j15585R8686J59912J10092M0703
$$ 414544144 414258232 413953476 413606186 413204498 412868271 412752686 412851372 413011284 413121376 413162079
3967.4D13162079o2752k04773k62833j80511j43814l18222n14794m26521j34239j0681
$$ 413162079 413099327 412894554 412631721 412451210 412307396 411989174 411474380 411047859 410913620 410902939
3977.1D10902939j16387j29394J5564o5689m87404p12967l94173q8577m16031q98437
$$ 410902939 410786552 410657158 410672722 410607033 410119629 409406662 409012489 408923912 408507881 407609444
3986.7D07609444o54679n1803l12767j286774j306839j73798l41034l010444m759140
$$ 407609444 406954765 406902962 406590195 405303421 403996582 403822784 403481750 400471306 395712166
3995.4C95712166k217789o69746j2844773m4143638q0508900
$$ 395712166 393494377 392824631 379979858 335836220 255327320
4000.2B55327320
$$ 255327320
##END=$$ End of the data block
