##TITLE=$$ Begin of the data block
##JCAMP-DX=5.00 $$ ACD/SpecManager v 10.08
##SPECTROMETER/DATA SYSTEM=16PC
##DATE=Mon Sep 16 14:21:19 2013
##DATA TYPE=INFRARED SPECTRUM
##DATA CLASS=XYDATA
##ORIGIN=
##OWNER=
##NPOINTS=3601
##FIRSTX=400.00000000
##LASTX=4000.00000000
##MAXX=4000.00000000
##MINX=400.00000000
##MAXY=42.38415146
##MINY=8.56482983
##XFACTOR=1.0000000000
##YFACTOR=0.000000100000000
##FIRSTY=23.73433113
##DELTAX=1.00000000
##XUNITS=1/CM
##YUNITS=TRANSMITTANCE
##XYDATA=(X++(Y..Y))
400 237343311 299243603 347289886 376999702 389534760 390109634 385045395 379153976 374657745
408 374657745 371750755 369948235 369128723 369675140 371911430 375512733 379466820 382640457 384505081
417 384505081 385467758 386565933 388748932 392230034 396305122 399696465 401168289 400060196 396513748
426 396513748 391374207 385886345 381319122 378610420 378100319 379433746 381704292 383825226 384986267
435 384986267 384967422 384139061 383156281 382549667 382472649 382748833 383141403 383614311 384380264 385704956
445 385704956 387631264 389846573 391801872 392999725 393246574 392700348 391705093 390555649 389367676
454 389367676 388124962 386832199 385626488 384753838 384438362 384760170 385643997 386961746 388650970
463 388650970 390739479 393243828 396020470 398697586 400765686 401792564 401637535 400533371 398991890
472 398991890 397592125 396773262 396730042 397431145 398709984 400357170 402172966 403989220 405685730
481 405685730 407215462 408617821 409993210 411431427 412929802 414358902 415514145 416235085 416526184
490 416526184 416596680 416784630 417396774 418552246 420116119 421757317 423091660 423827438 423841515 423166275
500 423166275 421925507 420277519 418400879 416510162 414857903 413690796 413167305 413286057 413873138
509 413873138 414646416 415315285 415660286 415548592 414899750 413650742 411767883 409306870 406468506
518 406468506 403584595 401010170 398967056 397432022 396149445 394773254 393062248 391012039 388845634
527 388845634 386871033 385295753 384109497 383100548 381981277 380538635 378719063 376608315 374339752
536 374339752 372005043 369629173 367221451 364856300 362718353 361066666 360127182 359968643 360436363
545 360436363 361186867 361817856 362035294 361776695 361232071 360751839 360690308 361260338 362465019 364127350
555 364127350 365987015 367801933 369403000 370686951 371577568 371998711 371892433 371272240 370274620
564 370274620 369165154 368280945 367928238 368279305 369312897 370822754 372487488 373977661 375062828
573 375062828 375688629 375995712 376272278 376847191 377958755 379650955 381748123 383925743 385853729
582 385853729 387341728 388419571 389309883 390313110 391667099 393453102 395586548 397881279 400137444
591 400137444 402202568 403983917 405429115 406506729 407211304 407585487 407734718 407808952 407951241 408239212
601 408239212 408655891 409108238 409482613 409704971 409767303 409710274 409578018 409379044 409081383 408645020
611 408645020 408068123 407416306 406812859 406394234 406255760 406416550 406821213 407373238 407980957 408591499
621 408591499 409201431 409841499 410546646 411325264 412137909 412897453 413491249 413822975 413855476 413635025
631 413635025 413275452 412904167 412593269 412319527 411981964 411475334 410778923 409998703 409330292 408953896
641 408953896 408928146 409150581 409415474 409530525 409413376 409099274 408661919 408110237 407350388 406248055
651 406248055 404748344 402954216 401090851 399370308 397859192 396464310 395067863 393721428 392732658
660 392732658 392531700 393357010 394951591 396499252 396907959 395326767 391615982 386484756 381196823
669 381196823 376992111 374542122 373726082 373815384 373917694 373404503 372098732 370177994 367925110
678 367925110 365513649 362951279 360161285 357096825 353782539 350256424 346459160 342143478 336837349
687 336837349 329854240 320336304 307347736 290059662 268040466 241582432 211913433 181139126
695 181139126 151856909 126549282 106991014 93918591 87086191 85648298 88661680 95471983
703 95471983 105843287 119829378 137504816 158700342 182849350 208976879 235809269 261957760
711 261957760 286129322 307320766 324953461 338912201 349477272 357175255 362606125 366309242
719 366309242 368706779 370116844 370800858 370997353 370918694 370716667 370444756 370044136 369367676 368233719
729 368233719 366488838 364056053 360951080 357265930 353130188 348671455 343993111 339177589 334302216
738 334302216 329448204 324683495 320023270 315391541 310616550 305476456 299777832 293426762 286447830
747 286447830 278940086 270998268 262653790 253880672 244668179 235119762 225515728 216298409 207982712
756 207982712 201038666 195802746 192454243 191050739 191587067 194034462 198342056 204406910 212042160
765 212042160 220967522 230831280 241254978 251882305 262417412 272647781 282451839 291796322
773 291796322 300721302 309313049 317665730 325839424 333828316 341551590 348873062 355643539 361749001
782 361749001 367144203 371858215 375970306 379570007 382722893 385458603 387785530 389722328 391324310
791 391324310 392686920 393922081 395118179 396305161 397443695 398447075 399224205 399724846 399966431
800 399966431 400030632 400034714 400090561 400271912 400600891 401059151 401612129 402235184 402924919 403690987 404532394
811 404532394 405413055 406252480 406940994 407376976 407508202 407358589 407023773 406637306 406322823 406154594
821 406154594 406145592 406263695 406462593 406706734 406974907 407242966 407459755 407538605 407373886 406879234 406027641
832 406027641 404870224 403522224 402120819 400777664 399548225 398433075 397405014 396445312 395566864
841 395566864 394813080 394237213 393878326 393748360 393838196 394134560 394634285 395342598 396256027 397341270
851 397341270 398525047 399707031 400790100 401712303 402461853 403065186 403556938 403951721 404237289 404396973
861 404396973 404444923 404448738 404518585 404761009 405221443 405850525 406518250 407072906 407413521 407534637 407518272
872 407518272 407479591 407500381 407591248 407703552 407778816 407801476 407817802 407909851 408141479 408512497 408949318
883 408949318 409338837 409583206 409643593 409549866 409372444 409176941 408984642 408759117 408420868 407879524
893 407879524 407067184 405957947 404568138 402934761 401083183 398994293 396587639 393733215 390293694
902 390293694 386187668 381451225 376272354 370981369 365997429 361749802 358599892 356788521 356417465
911 356417465 357459297 359782753 363178558 367382965 372097893 377015610 381847076 386350403 390350609
920 390350609 393746033 396502457 398640327 400221367 401338234 402101440 402622757 402993774 403267937
929 403267937 403456039 403539925 403498268 403330040 403061218 402729530 402359161 401942177 401442680 400821342
939 400821342 400065231 399200439 398278389 397340393 396384010 395350761 394143524 392662392 390837173
948 390837173 388639069 386066780 383117447 379758453 375913200 371464996 366278725 360235443 353276291
957 353276291 345451164 336956291 328148193 319518852 311632423 305038261 300184937 297359276 296663055
966 296663055 298023396 301224174 305946331 311807919 318403625 325341721 332275581 338923874 345076904
975 345076904 350590057 355373802 359387016 362637100 365182419 367128906 368615456 369788132 370769577
984 370769577 371635742 372408066 373065796 373575325 373925362 374153481 374349365 374627304 375077362 375713234
994 375713234 376446266 377102699 377484245 377448158 376970253 376161270 375226936 374392128 373823280 373583946
1004 373583946 373636971 373884659 374219704 374560356 374856682 375072556 375161743 375056496 374678078 373964157
1014 373964157 372897034 371514015 369890594 368099632 366165085 364034119 361587296 358693657 355293388
1023 355293388 351480789 347550697 343983040 341359444 340230942 340975342 343688774 348148422 353858376
1032 353858376 360165062 366403732 372030029 376700478 380287781 382842598 384529114 385561409 386155853
1041 386155853 386500778 386735764 386937027 387111397 387208328 387150116 386872444 386357079 385639343 384788361
1051 384788361 383870621 382920761 381932640 380874786 379715652 378442879 377066765 375609856 374094353
1060 374094353 372535057 370942268 369328880 367717361 366144180 364663734 363351326 362302361 361621971
1069 361621971 361402626 361697121 362499428 363744049 365328255 367143288 369101143 371144066 373238411
1078 373238411 375363159 377504044 379655075 381819801 384003754 386194763 388343773 390362778 392147675
1087 392147675 393620453 394767952 395653419 396390724 397093086 397821960 398565369 399252396 399797668 400148430
1097 400148430 400313377 400360222 400387459 400486717 400710182 401055756 401469879 401866379 402155113 402270699
1107 402270699 402195587 401966438 401662254 401377373 401189651 401139145 401226616 401430702 401732330 402130699
1117 402130699 402641487 403278351 404030685 404852715 405672035 406413422 407026367 407499619 407856979 408138084
1127 408138084 408375320 408579102 408739014 408835068 408852844 408789597 408648453 408423996 408087463 407584190
1137 407584190 406847687 405827675 404518585 402970695 401273537 399511795 397711449 395805283 393638077
1146 393638077 391022186 387821198 384031067 379820595 375511398 371503677 368174820 365787964 364440193
1155 364440193 364061012 364454231 365362358 366530952 367756844 368908806 369924812 370790863 371516724
1164 371516724 372117271 372606850 373002701 373328018 373607979 373853378 374043388 374116859 373984528 373559914
1174 373559914 372795906 371709709 370385666 368955803 367571487 366377945 365501556 365044136 365075951
1183 365075951 365622787 366648293 368044586 369641724 371239319 372650566 373743057 374458733 374809837
1192 374809837 374854431 374666786 374315987 373858299 373341293 372812653 372323265 371924362 371658669 371550713
1202 371550713 371602402 371794891 372096138 372471161 372893410 373351974 373855324 374426422 375092010 375867233
1212 375867233 376741600 377675819 378610992 379490166 380280113 380984001 381634407 382270088 382908020 383526878
1222 383526878 384069405 384466553 384667664 384663162 384488831 384210472 383897667 383600540 383336868 383094368
1232 383094368 382844124 382558594 382226448 381859474 381488571 381153183 380886230 380704002 380605164 380577164
1242 380577164 380608025 380693474 380835495 381035652 381285782 381565094 381845818 382102127 382317505 382485313
1252 382485313 382602501 382662811 382651711 382549400 382337036 382005539 381563683 381043167 380500259 380009613
1262 380009613 379649429 379479332 379519463 379738655 380062256 380395546 380654449 380787964 380785103 380664330
1272 380664330 380457039 380193558 379898148 379590912 379290161 379011688 378763771 378543625 378336258 378118019
1282 378118019 377860489 377533875 377109528 376564178 375885239 375078011 374168243 373198891 372221031 371282349
1292 371282349 370416870 369638519 368936996 368278198 367609024 366870003 366014214 365027161 363936691 362806892
1302 362806892 361715660 360726776 359869080 359134521 358493652 357919388 357406273 356974678 356660042 356493721
1312 356493721 356484871 356612740 356830750 357081528 357314682 357500763 357635231 357732353 357812157 357887955 357960472
1323 357960472 358018227 358044357 358025627 357963638 357886658 357856216 357959595 358277817 358833542 359540672 360192108
1334 360192108 360512276 360266838 359382896 358009682 356475449 355147247 354265404 353842621 353684158
1343 353684158 353514061 353127632 352478905 351661987 350814171 350020409 349285660 348582649 347926483 347405052
1353 347405052 347133179 347160683 347401314 347641869 347634239 347219162 346410942 345398407 344468689 343898811
1363 343898811 343865166 344400139 345396957 346648407 347907944 348961258 349693642 350130386 350428200 350815315
1373 350815315 351506157 352632828 354228134 356255417 358652878 361348000 364229584 367105179 369697456
1382 369697456 371714592 372980614 373554993 373762131 374085808 374960136 376552353 378652077 380735130
1391 380735130 382185860 382576447 381871376 380452385 378951569 377973442 377844124 378509331 379621391
1400 379621391 380754776 381622696 382178688 382563972 382958870 383450890 384006348 384550896 385080032 385696373
1410 385696373 386525345 387555733 388521690 388930359 388255806 386209755 382939606 379034958 375319977
1419 375319977 372521896 370968819 370452232 370311775 369701195 367919579 364670410 360141029 354867706
1428 354867706 349446449 344220734 339100227 333614006 327182503 319475002 310655346 301367779 292455292
1437 292455292 284556808 277802734 271771965 265716896 258910313 250912666 241638165 231244087
1445 231244087 219987411 208189621 196344681 185270710 176151543 170376225 169217701 173499241
1453 173499241 183397694 198436718 217606983 239506073 262447853 284590569 304177113 319912586
1461 319912586 331357536 339111938 344599457 349462242 354816856 360755463 366375351 370342865
1469 370342865 371687698 370385742 367414131 364267807 362235680 361845741 362756233 364088936 364954834
1478 364954834 364853325 363752937 361867447 359302101 355772552 350525360 342489014 330615692 314337463
1487 314337463 294018631 271239281 248726711 229837170 217686710 214244900 219794846 233020668
1495 233020668 251662617 273364067 296239071 318902645 340087776 358274841 371750603 379187622
1503 379187622 380420456 376875801 371274986 366659584 365225258 367573547 372747078 378950310 384494667
1512 384494667 388449402 390738754 391789474 392059250 391755638 390849342 389271698 387111588 384687424
1521 384687424 382488441 381045113 380781822 381872101 384124336 386963196 389584503 391286659 391846046
1530 391846046 391705666 391792526 392982407 395480042 398490944 400447197 399733582 395553474 388461037
1539 388461037 380250626 373239899 369307137 369156837 372146645 376713562 381149025 384343643 386175308
1548 386175308 387400131 389124718 392108040 396209526 400250664 402401962 400978966 395319786 386326332
1557 386326332 376351662 368396263 364921722 366813927 373000031 380927658 387693443 391281433 391318665
1566 391318665 389008560 386325531 384923973 385327759 386783562 387789536 386957550 383730125 378597412
1575 378597412 372764931 367519493 363667831 361327820 360114059 359534454 359324074 359534302 360370636
1584 360370636 361929855 364022293 366180916 367831116 368500748 367950897 366174698 363292847 359423370
1593 359423370 354601440 348794212 342010345 334464455 326719780 319713383 314597225 312404289 313662643
1602 313662643 318149586 324946709 332808571 340670128 348011436 354866447 361478958 367842331 373451271
1611 373451271 377462158 379184227 378587151 376477661 374197159 372996750 373453369 375256119 377464142
1620 377464142 379051933 379421463 378625069 377251816 376117249 375951233 377195053 379899826 383670197
1629 383670197 387648506 390619240 391324768 388972130 383738823 376980476 370917664 367821121 369016533
1638 369016533 374198799 381454887 388069916 391772652 391804962 389241562 386344032 385253372 386713867
1647 386713867 389555359 391280136 389488144 383369293 374396362 365765991 360836792 361411171 366824303
1656 366824303 374358521 380732117 383796806 383475838 381464958 379973755 380338974 382353363 384636726
1665 384636726 385694923 384907722 382812729 380579681 379129753 378558044 378252220 377572479 376549683
1674 376549683 376047592 377224426 380630798 385561409 390137711 392145004 390169945 384395142 376601181
1683 376601181 369385529 365030174 364606743 367728577 372976189 378675156 383578873 387140121 389341011
1692 389341011 390303345 389989548 388189812 384775085 380010071 374677582 369889030 366654205 365442429
1701 365442429 365989037 367465553 368930664 369817924 370193443 370644684 371859207 374119568 376984673
1710 376984673 379332504 379765434 377200546 371384354 363095245 353929863 345745010 339981422 337157784
1719 337157784 336763344 337603683 338437157 338587227 338212547 338088722 339025764 341259155 344186172 346627731
1729 346627731 347486496 346421776 344131775 342055664 341647797 343634377 347674599 352607269 357118988
1738 357118988 360430336 362609673 364361725 366461563 369197884 372160721 374479179 375345993 374505272
1747 374505272 372430077 370107040 368572235 368460770 369792213 372063408 374548035 376619797 377942505
1756 377942505 378481216 378401070 377960014 377463951 377268105 377750244 379195786 381613579 384589577 387308655
1766 387308655 388804131 388357925 385862999 381948395 377772942 374575005 373191948 373778687 375838127
1775 375838127 378507004 380926514 382521095 383102837 382830124 382099380 381427689 381324692 382132378
1784 382132378 383852501 386046410 387913017 388580132 387509575 384812698 381277466 378051338 376115685
1793 376115685 375824127 376752815 377944031 378409576 377622566 375743752 373487053 371720543 371031380
1802 371031380 371471786 372592850 373712044 374255295 373998528 373108063 371993408 371076202 370606194
1811 370606194 370607719 370956039 371509895 372204742 373052597 374070015 375201874 376309929 377235794 377884903
1821 377884903 378260155 378414230 378363495 378044205 377367287 376343422 375179634 374250565 373934784 374411507
1831 374411507 375563126 377063179 378597565 380058784 381561852 383256111 385066452 386571083 387142525
1840 387142525 386298866 384050255 381006050 378147049 376376991 376110229 377126465 378757782 380274086
1849 380274086 381231346 381595535 381615524 381566544 381548958 381459465 381127815 380505981 379771118 379267120 379310684
1860 379310684 379971886 380957603 381678619 381488686 379989052 377250137 373829498 370563393 368222923
1869 368222923 367202797 367395020 368301125 369307365 369964905 370133362 369941101 369630089 369403114 369359055
1879 369359055 369518471 369872932 370395355 371006775 371549759 371827469 371708412 371229134 370611267 370159264
1889 370159264 370094910 370437698 371012650 371578941 371987228 372257538 372533264 372958794 373578186 374324188
1899 374324188 375089340 375804214 376455231 377034225 377479172 377679482 377561684 377195930 376829033 376791267
1909 376791267 377315865 378383331 379694862 380804787 381334801 381147041 380378723 379334641 378316612
1918 378316612 377494774 376883240 376408768 376006165 375674591 375465927 375428238 375549202 375738983 375859528
1928 375859528 375783615 375452538 374906044 374271469 373711548 373348961 373196602 373128281 372913284 372308960
1938 372308960 371176720 369561806 367695503 365912094 364517784 363676071 363363037 363407822 363589516
1947 363589516 363735085 363772354 363722801 363651924 363616524 363638115 363711510 363832855 364021072 364315224 364747353
1958 364747353 365308647 365931969 366506882 366922417 367119064 367122269 367038002 367011337 367165222 367550735 368130608
1969 368130608 368802795 369449539 369986572 370388718 370683479 370921326 371141777 371355095 371546936 371700668
1979 371700668 371820717 371940804 372110786 372365875 372696495 373037224 373285904 373347588 373185005 372849731
1989 372849731 372474937 372228355 372246780 372579803 373170319 373881035 374552193 375063057 375369263 375501289
1999 375501289 375531044 375526428 375519142 375499611 375438881 375320816 375166321 375032883 374988823 375075150 375274925
2010 375274925 375510101 375669136 375656853 375440636 375070992 374663277 374349709 374223747 374303970 374534607
2020 374534607 374817390 375057983 375201187 375242081 375211143 375149345 375086403 375034256 374992104 374956017 374924393
2031 374924393 374895401 374862289 374810562 374723015 374588776 374411316 374210434 374016151 373856621 373748665 373692970
2042 373692970 373676872 373682709 373696251 373711700 373730507 373755989 373786240 373808708 373802032 373742447 373615036 373423119
2054 373423119 373190689 372955589 372756004 372614937 372531624 372483406 372437515 372366295 372258110 372118721 371964035
2065 371964035 371809387 371662788 371524277 371390953 371262207 371141014 371031837 370937386 370858192 370795898
2075 370795898 370756378 370749397 370782242 370851402 370937958 371012115 371044922 371021996 370949821 370850716 370750351 370664139
2087 370664139 370592003 370524216 370451889 370376053 370306740 370255775 370225525 370204887 370173798 370114670 370022850 369910278
2099 369910278 369799271 369711189 369656105 369629898 369619370 369610863 369597244 369579010 369559250 369536514 369501877 369440956
2111 369440956 369342690 369207001 369049416 368896561 368777351 368711128 368701134 368733025 368780479 368812523 368802147
2122 368802147 368732147 368599701 368418732 368218651 368038483 367915382 367870865 367900734 367974892 368048706 368082886
2133 368082886 368060722 367995491 367922592 367879791 367885857 367928925 367969437 367957764 367856865 367661057 367400894
2144 367400894 367133560 366921654 366809502 366806526 366884842 366991615 367071571 367089882 367044220 366961632 366881332
2155 366881332 366832733 366820259 366822472 366806145 366745682 366638756 366508179 366390724 366319771 366309853 366352463 366420517
2167 366420517 366479797 366499519 366458282 366345978 366163673 365923271 365645523 365356598 365081062 364834671
2177 364834671 364618912 364423180 364232941 364040337 363850594 363680916 363552589 363479881 363463135 363488960
2187 363488960 363535805 363581924 363611526 363616943 363598976 363565598 363529396 363503876 363495903 363498650 363488922 363433189 363302231
2200 363302231 363087540 362810783 362519188 362266846 362092323 362002296 361970177 361949577 361892815 361767197 361559525
2211 361559525 361272659 360917740 360508385 360057602 359575653 359066429 358520355 357909241 357184601 356280403
2221 356280403 355116653 353598175 351607933 349001160 345611496 341280823 335913315 329540863 322376175
2230 322376175 314827881 307461796 300912685 295769634 292469292 291228275 292029877 294660759 298776798
2239 298776798 303972244 309833450 315971909 322043037 327761192 332915955 337387047 341148376 344253998
2248 344253998 346806755 348919144 350682487 352154427 353366508 354342575 355115585 355731850 356241341
2257 356241341 356683540 357076912 357419930 357702370 357919807 358081360 358206673 358316460 358422089 358523064
2267 358523064 358611488 358680992 358730049 358759079 358764038 358733788 358658371 358544540 358429451 358379440 358469849 358751945
2279 358751945 359225349 359830437 360467987 361035652 361463051 361729698 361859627 361902084 361908531 361919937 361962547
2290 361962547 362050323 362186165 362361908 362560081 362760239 362949333 363132172 363334618 363597145 363959656
2300 363959656 364442215 365026894 365647736 366193771 366530724 366542397 366182327 365515404 364727898 364088249
2310 364088249 363864517 364224777 365159073 366460228 367776680 368725014 369023743 368599396 367620506 366438217
2320 366438217 365447960 364919968 364874496 365065536 365094681 364612770 363508759 361983223 360458221 359367981
2330 359367981 358945618 359125595 359603996 359995613 359964752 359240227 357533493 354484520 349771233 343408051
2340 343408051 336089249 329325066 325166779 325531197 331385117 342187805 355908012 369654121
2348 369654121 380647659 387096024 388592720 385933456 380532112 373781090 366654053 359651985
2356 359651985 352985458 346791649 341232185 336452446 332489700 329237404 326506691 324138870 322086868
2365 322086868 320411682 319206600 318512497 318282490 318411121 318796902 319388275 320187302 321220322
2374 321220322 322506828 324050484 325851021 327916451 330255928 332852707 335636368 338476562 341206894
2383 341206894 343669624 345755806 347425385 348701134 349646072 350338020 350850143 351239586 351543083
2392 351543083 351776695 351940918 352030907 352047043 352001190 351916084 351816101 351718903 351631165 351552429 351482506
2403 351482506 351427155 351396866 351400566 351438484 351499748 351566696 351621780 351654243 351661034 351643982 351603851 351538506
2415 351538506 351443901 351318855 351169777 351012688 350869255 350760460 350698013 350679359 350688019 350700302 350694885
2426 350694885 350661621 350605583 350543747 350497246 350481071 350497704 350535507 350573578 350589714 350568962 350508995 350419922
2438 350419922 350319748 350226173 350148888 350085907 350024757 349949036 349846191 349712639 349554977 349385986 349219360
2449 349219360 349065895 348932648 348823433 348739815 348680305 348639145 348605652 348566933 348511162 348432198 348330345
2460 348330345 348209839 348075066 347927284 347765121 347588043 347400436 347213936 347046776 346919479 346848984
2470 346848984 346842461 346893005 346978455 347064400 347112885 347093315 346993980 346827240 346626854 346436386 346293755
2481 346293755 346217613 346202087 346220284 346234856 346211166 346128807 345987892 345809364 345628815 345484657 345404015
2492 345404015 345390053 345418091 345441818 345411072 345291252 345077171 344793854 344483719 344188232 343933182 343725166
2503 343725166 343559151 343430023 343339539 343294868 343299980 343346329 343410912 343462639 343473511 343428688 343329964 343192177
2515 343192177 343035545 342879524 342739754 342628517 342554855 342523193 342530251 342562714 342599640 342618523 342603569
2526 342603569 342551994 342474060 342387428 342309036 342247734 342204018 342173500 342153854 342148476 342165451 342211342 342283783
2538 342283783 342368050 342439308 342470627 342442360 342348671 342199097 342014542 341819992 341636848 341476631 341338158
2549 341338158 341208649 341070900 340913467 340740738 340577278 340460663 340425110 340480614 340602341 340734825
2559 340734825 340815239 340801926 340694847 340533638 340375786 340265846 340214653 340198975 340181770 340137901 340069122
2570 340069122 339999733 339956055 339946976 339955597 339950027 339903107 339808998 339685555 339563332 339467888 339408875 339379463
2582 339379463 339366302 339359093 339355011 339354897 339356689 339350967 339323578 339262199 339163551 339035110 338891258 338745804
2594 338745804 338604622 338464127 338313866 338143463 337950172 337744102 337548141 337392235 337303505 337296066
2604 337296066 337364006 337482300 337615013 337728043 337800026 337827759 337822380 337800369 337773361 337742462 337699890
2615 337699890 337635231 337544136 337433090 337318764 337221603 337156601 337125092 337111359 337086372 337017288 336880302
2626 336880302 336670532 336405754 336120796 335855293 335639763 335486031 335386887 335323524 335277138 335237579 335205841
2637 335205841 335188293 335188866 335201912 335212097 335201797 335159378 335088654 335009003 334950218 334940681 334995193 335106049
2649 335106049 335243187 335362587 335421448 335394783 335285912 335126038 334961472 334833908 334762726 334737167 334724236
2660 334724236 334687843 334608307 334492760 334370079 334274025 334224854 334220085 334238548 334254417 334252090 334231186 334201851
2672 334201851 334173965 334148636 334117966 334073257 334014587 333955574 333919945 333931236 334002380 334128609 334287720
2683 334287720 334446297 334568253 334624901 334602203 334504852 334353714 334178581 334006882 333855019 333725967
2693 333725967 333615074 333518639 333440590 333389969 333372040 333378639 333387070 333369675 333310051 333215218 333115082 333047447
2705 333047447 333036461 333078499 333142929 333187447 333179626 333111916 333003006 332885780 332790985 332735100 332716866 332722664
2717 332722664 332734947 332739372 332727966 332699203 332656250 332604713 332551384 332501564 332458305 332422028 332391815 332367668
2729 332367668 332351341 332346306 332356033 332381630 332421036 332468910 332517433 332557259 332578735 332572517 332532692 332459221
2741 332459221 332359123 332244987 332130013 332022667 331922379 331820946 331708984 331583061 331450768 331328506
2751 331328506 331233978 331175766 331147766 331130409 331100311 331042023 330956192 330858192 330768661 330700836 330651741 330603523
2763 330603523 330533028 330424347 330277405 330106735 329932556 329770203 329623795 329487801 329353409 329214363
2773 329214363 329069366 328918381 328758888 328585968 328396072 328192825 327988853 327800980 327641296 327509499
2783 327509499 327390862 327263336 327106857 326910782 326674194 326401291 326096001 325760956 325402031 325032959
2793 325032959 324676819 324359360 324098625 323896027 323734703 323586845 323424950 323231888 323003731 322745781
2803 322745781 322464523 322161140 321828766 321454926 321026344 320534668 319980125 319372234 318726654 318058319
2813 318058319 317373009 316661148 315898018 315051098 314091511 313003712 311785851 310440903 308962975
2822 308962975 307327099 305491447 303410358 301052265 298411465 295507278 292372589 289039211 285530128
2831 285530128 281862507 278057251 274146442 270173206 266183090 262212944 258287334 254423771 250644131
2840 250644131 246985531 243502560 240260811 237325592 234751167 232573719 230808582 229448814 228466587
2849 228466587 227818298 227455540 227341137 227461662 227830830 228476715 229420300 230654297 232134705 233791122
2859 233791122 235547314 237342758 239139862 240916443 242648849 244298172 245808773 247119598 248181267
2868 248181267 248968201 249480305 249735203 249756050 249562340 249164867 248566151 247760925 246738548 245486164
2878 245486164 243994865 242266941 240321980 238195858 235933132 233575020 231149368 228668213 226133041
2887 226133041 223545380 220914059 218255539 215586739 212914753 210231323 207514210 204736824 201879864
2896 201879864 198939419 195927658 192865276 189770203 186647434 183484783 180256500 176933403 173496513
2905 173496513 169947357 166313515 162643509 158996105 155426683 151977253 148674841 145537834 142585535
2914 142585535 139844313 137346611 135122967 133192463 131558914 130215406 129153795 128372822 127877998
2923 127877998 127672739 127747517 128074780 128615284 129333191 130210037 131248894 132465391 133871965 135466213
2933 135466213 137231197 139148798 141215696 143451710 145892773 148573217 151506672 154677200 158045692
2942 158045692 161565990 165201759 168935127 172764301 176694012 180725250 184849606 189048214 193294868
2951 193294868 197559376 201811600 206024780 210179710 214266357 218283653 222235298 226123466 229944115
2960 229944115 233685303 237328625 240852852 244235115 247450886 250473309 253274841 255831566 258129215
2969 258129215 260167770 261962109 263538418 264929314 266169186 267292995 268334942 269326382 270291519
2978 270291519 271240902 272167206 273045578 273839207 274508476 275019665 275349331 275483189 275410480 275115490
2988 275115490 274570122 273730545 272539234 270934601 268868351 266326046 263347607 260038452 256567993
2997 256567993 253151798 250021915 247391586 245424004 244209900 243759251 244004154 244811592 246001968
3006 246001968 247370014 248705540 249810791 250511055 250658073 250126705 248809128 246613770 243472252
3015 243472252 239357224 234306660 228447323 222008820 215321140 208793030 202872753 197998047 194543209
3024 194543209 192774086 192818146 194656105 198134403 202994976 208913555 215538502 222523727 229554443
3033 229554443 236365299 242753468 248584747 253792038 258362522 262316608 265682907 268478680 270702629
3042 270702629 272340851 273382282 273832359 273718624 273083305 271969414 270407066 268411045 265992508
3051 265992508 263183117 260061684 256772556 253525791 250575047 248178120 246549511 245821800 246026554
3060 246026554 247101974 248921318 251329708 254172325 257306023 260592899 263888340 267036057 269878235
3069 269878235 272278252 274141998 275427284 276134758 276289387 275927486 275101204 273900776 272481537
3078 272481537 271074600 269967632 269456234 269780254 271069431 273315144 276377029 280015736 283942261
3087 283942261 287868252 291549568 294815445 297580242 299833622 301614628 302977886 303966351 304604321
3096 304604321 304910679 304924965 304727325 304438019 304195442 304122238 304298000 304750748 305468044 306416340
3106 306416340 307556400 308846817 310239830 311677818 313097286 314440613 315667381 316758575 317711163
3115 317711163 318527832 319209957 319757748 320176659 320483398 320706863 320881500 321038170 321196594 321362915
3125 321362915 321531792 321692314 321833839 321951752 322051010 322145462 322252693 322383003 322529411 322664032
3135 322664032 322745476 322736893 322624741 322428970 322199059 321995544 321869583 321847382 321927376 322086678 322290306
3146 322290306 322499008 322674026 322781982 322802200 322734871 322603302 322447586 322309761 322217331 322174911 322168465
3157 322168465 322177887 322190323 322203979 322222862 322246513 322266579 322271919 322262001 322255440 322286148 322385750 322560921
3169 322560921 322781219 322985878 323110886 323120651 323028107 322889938 322779579 322750816 322811966 322924347 323023415
3180 323023415 323051682 322984581 322838211 322657623 322495995 322393761 322369423 322419128 322521553 322643433 322745018
3191 322745018 322787247 322743950 322614288 322429695 322247772 322132912 322130814 322249031 322453308 322682190 322871590
3202 322871590 322977791 322989769 322926369 322824364 322722168 322648277 322614632 322616844 322637634 322654381 322645798 322597809
3214 322597809 322505722 322372360 322205200 322014122 321813202 321622314 321466522 321370621 321348915 321396904 321490440
3225 321490440 321594582 321677513 321721916 321727104 321703491 321662903 321614418 321566772 321532326 321526718 321561317 321630936
3237 321630936 321709137 321755943 321737785 321647530 321511002 321374817 321281891 321248474 321259308 321279869 321279640 321247635
3249 321247635 321193008 321131859 321072693 321011276 320938530 320853310 320767899 320701294 320664406 320649872 320636253 320603981
3261 320603981 320553932 320511932 320515518 320588303 320719490 320862007 320951309 320934982 320796776 320562515 320286598
3272 320286598 320028572 319831448 319710178 319653149 319630470 319607258 319556007 319466171 319348316 319230061 319143219
3283 319143219 319107685 319118862 319148903 319160709 319127789 319049625 318950672 318865299 318816776 318804226 318805542 318793373
3295 318793373 318754005 318697510 318652725 318651047 318709354 318819675 318951435 319062157 319112282 319077663 318956680
3306 318956680 318770256 318555012 318351841 318193436 318096352 318059807 318073120 318124447 318206654 318314228 318434582
3317 318434582 318540058 318589039 318538189 318362370 318070545 317709274 317349949 317064800 316901512 316867046
3327 316867046 316926861 317018738 317076092 317051811 316934738 316752357 316559181 316414604 316359406 316400070 316508274
3338 316508274 316635075 316733074 316776848 316771870 316749191 316747818 316794224 316886597 316992550 317062378 317051964 316947231
3350 316947231 316776943 316605015 316503258 316516743 316639481 316814308 316960297 317011967 316949558 316803169
3360 316803169 316628876 316474285 316353378 316247139 316125221 315972118 315800304 315641537 315526981 315469437
3370 315469437 315462761 315493259 315553894 315647182 315774059 315919056 316044407 316102219 316057892 315911179 315700779
3381 315700779 315488338 315331650 315260563 315268059 315318298 315364552 315366516 315301304 315165443 314971867 314745712
3392 314745712 314518776 314323273 314184799 314115009 314108143 314143162 314191704 314229374 314244366 314240055 314229298 314224224
3404 314224224 314228134 314234104 314232845 314223156 314217319 314234104 314281445 314338512 314352169 314254513 313996983 313583584
3416 313583584 313082561 312607479 312274361 312155838 312255993 312514839 312837410 313129959 313326263 313397369
3426 313397369 313348179 313209457 313028431 312857018 312737236 312686405 312691517 312719555 312741222 312751694 312772808
3437 312772808 312828865 312910690 312955055 312860947 312543468 311995888 311320362 310701447 310329971 310316715 310643520
3448 310643520 311178169 311741772 312186546 312441730 312509708 312427788 312230549 311939430 311579628 311201344
3458 311201344 310878582 310679569 310628033 310684624 310766602 310795441 310740852 310633316 310538292 310513268 310578423
3469 310578423 310717049 310898399 311097813 311296730 311464844 311548462 311483212 311231060 310814476 310317745
3479 310317745 309847088 309472942 309196949 308968563 308740845 308521919 308379688 308391705 308577709 308868332
3489 308868332 309141388 309302940 309355679 309396877 309541187 309818516 310122814 310255432 310041275 309443264
3499 309443264 308596840 307739697 307080326 306689892 306484299 306300964 306015186 305620155 305224800 304981842
3509 304981842 304998970 305290318 305786953 306387005 307002716 307575684 308059158 308392525 308493366 308275928
3519 308275928 307684975 306724777 305470982 304063053 302684193 301533947 300790920 300567074 300862865
3528 300862865 301546726 302383099 303115578 303578053 303780346 303910751 304237309 304941883 305975285 307023125
3538 307023125 307623539 307390366 306228752 304417019 302497807 301028652 300327568 300355892 300798550
3547 300798550 301281166 301584167 301726665 301887417 302245998 302869530 303724060 304774513 306061230 307649956
3557 307649956 309464455 311125793 311961460 311252441 308623562 304355145 299404716 295082817 292530460
3566 292530460 292265224 294025612 296967545 300076656 302569942 304109955 304795609 305011978 305251160
3575 305251160 305962296 307422295 309610901 312124443 314214153 315014877 313919201 310928555 306769333
3584 306769333 302659035 299803524 298876038 299755135 301654873 303557205 304691277 304806232 304138355
3593 304138355 303162804 302325916 301911182 302057114 302827492 304223518 306110287 308137264 309762764
3602 309762764 310425282 309790783 307935982 305357037 302790661 300939083 300222206 300641518 301779041
3611 301779041 302913857 303242493 302181187 299683552 296434650 293752651 293121147 295474911 300569916
3620 300569916 306818981 311791897 313223915 310058365 302977791 294126816 286165314 281150780 279814072
3629 279814072 281530914 284888344 288451500 291319141 293279953 294650898 296010094 297970886 300998287
3638 300998287 305198517 310089149 314500790 316805954 315522823 310073032 301277103 291233234
3646 291233234 282542820 277241096 275987320 277937679 281329060 284408150 286188126 286686783 286643391
3655 286643391 286994209 288436375 291245708 295302277 300179024 305211811 309585819 312519360 313536434
3664 313536434 312688904 310545559 307885628 305247898 302622089 299515095 295383110 290165443 284569702
3673 284569702 279907246 277564850 278418007 282504139 289076881 296923504 304710159 311192532 315304317
3682 315304317 316254654 313728924 308131561 300679588 293179779 287494659 284918995 285767708 289370747
3691 289370747 294440098 299583130 303708038 306198559 306909409 306111202 304454060 302891884 302456150
3700 302456150 303851528 307023125 310963402 313970852 314336739 311163769 304892101 297229538 290490780
3709 290490780 286666012 286671734 290115814 295619850 301467800 306234703 309138279 310054703 309317684
3718 309317684 307481747 305171719 303029995 301692944 301714630 303409042 306652966 310748463 314457588
3727 314457588 316285591 314987965 310152416 302599354 294342003 287993469 285774326 288531628 295265160
3736 295265160 303467712 310188351 313319511 312448711 308827991 304497566 301085548 298983498 297358837
3745 297358837 294943123 291062183 286240921 282002888 280006466 281067848 284678364 289292221 293180046
3754 293180046 295320015 295813217 295638065 295958500 297426949 299866390 302440681 304139862 304276009
3763 304276009 302752762 300047207 296994705 294512100 293348961 293895626 296061058 299257641 302543354
3772 302543354 304924431 305727177 304869919 302882309 300638103 298933868 298139477 298112526 298405838
3781 298405838 298621540 298680077 298843346 299499912 300879250 302893257 305202637 307435436 309380474
3790 309380474 311008739 312318058 313143692 313113422 311819801 309110222 305284843 301037254 297146969
3799 297146969 294116364 291998520 290537701 289523792 289095459 289753361 292039032 296078205 301301231
3808 301301231 306550465 310536785 312377853 311902409 309565983 306082077 302042675 297777309 293497181
3817 293497181 289556007 286570644 285261612 286090755 288941517 293080463 297459106 301188545 303901691
3826 303901691 305785675 307278214 308634472 309647827 309706345 308151779 304719543 299789085 294293442
3835 294293442 289345551 285808029 284059753 284076710 285735798 289088516 294362926 301622639 310268745
3844 310268745 318735065 324688644 325791321 320742607 310090656 296342640 283213444 274288063
3852 274288063 271686802 275341377 283196564 292200832 299585228 303835316 304969978 304112511 302673817
3861 302673817 301599560 301025009 300426826 299106236 296704540 293484440 290260658 288047390 287613735
3870 287613735 289162674 292267361 296066284 299601192 302133121 303312664 303173523 302011757 300244732
3879 300244732 298313141 296622677 295485344 295039196 295181942 295591240 295875931 295813923 295544796 295573921
3889 295573921 296536903 298821697 302252426 306025963 308962708 309957638 308412189 304447689 298828812
3898 298828812 292673092 287103958 282987289 280810757 280683594 282401237 285530853 289500904 293692245
3907 293692245 297522945 300516129 302346134 302869606 302153473 300486317 298345222 296288662 294791641
3916 294791641 294088745 294112816 294575920 295153637 295660973 296107407 296598186 297158852 297620182 297663593
3926 297663593 297014484 295661583 293949566 292467766 291786308 292183666 293516998 295297623 296918583
3935 296918583 297911015 298105106 297639828 296843166 296058044 295496025 295174694 294954910 294651012 294156857
3945 294156857 293523312 292944107 292655487 292804203 293362122 294137535 294875164 295378666 295581284 295531788
3955 295531788 295324059 295033684 294705715 294385185 294143677 294061069 294170361 294415722 294668808 294802361
3965 294802361 294764977 294596825 294374352 294134026 293846798 293468113 293016167 292597942 292343254 292294807
3975 292294807 292353668 292345047 292164879 291883621 291704521 291789322 292093792 292364635 292327423 291918354 291344681
3986 291344681 290884361 290567188 290035095 288782425 286664810 284254608 282600307 282308369 282413654
3995 282413654 279845886 270124760 249229088 215797577 172443676
4000 172443676
##END=$$ End of the data block
