##TITLE=AAG $$ Begin of the data block
##JCAMP-DX=5.00 $$ ACD/SpecManager v 10.08
##DATE=14 Dec 2016 11:32:44
##DATA TYPE=INFRARED SPECTRUM
##DATA CLASS=XYDATA
##ORIGIN=Marcelo Quint
##OWNER=
##NPOINTS=1765
##FIRSTX=399.77209473
##LASTX=3997.72216797
##MAXX=3997.72216797
##MINX=399.77209473
##MAXY=0.79320604
##MINY=0.44534764
##XFACTOR=1.0000000000
##YFACTOR=1.000000000000000e-9
##FIRSTY=0.71340615
##DELTAX=2.03965425
##XUNITS=1/CM
##YUNITS=ARBITRARY UNITS
##XYDATA=(X++(Y..Y))
399.8G13406146k3604J84059K24591K3126l12865q51988n77629o29544j222253p94947
$$ 713406146 713382542 713566601 713791192 713814318 713501453 712649465 712071836 711442292 710220039 709425092
420.2G09425092l37422l66092n33223l84510l61740r44913j075983r76622o59287l62873
$$ 709425092 709087670 708721578 708188355 707803845 707442105 706497192 705421209 704444587 703785300 703422427
440.6G03422427n48303l23713j70707j67549k95639o47307o34253q38756n28455o9082
$$ 703422427 702874124 702550411 702379704 702212155 701916516 701269209 700634956 699796200 699267745 699198663
461F99198663l39985k33054k10166j52826J46389L73006Q55326P99120O92189R14991
$$ 699198663 698858678 698625624 698415458 698262632 698409021 698782027 699637353 700436473 701128662 702043653
481.4G02043653J006484J377999J406610J263857J299680J149594J116813O47425J82092
$$ 702043653 703050137 704428136 705834746 707098603 708398283 709547877 710664690 711312115 711494207
499.7G11494207K32578J92642K68876k9146m03226m26352p05003p06435o05464m34816
$$ 711494207 711726785 711919427 712188303 712159157 711755931 711329579 710624576 709918141 709312677 708877861
520.1G08877861j40488k87473l4153L58760M58121P18892O84380O28651N00738K98202
$$ 708877861 708737373 708449900 708415747 708774507 709232628 709951520 710635900 711264551 711765289 712063491
540.5G12063491L07620l8266j67966j53482l64721l66390n97059p05481o41406o63220
$$ 712063491 712371111 712332845 712164879 712011397 711646676 711280286 710683227 709977746 709336340 708673120
560.9G08673120m58956n26846o47187p57635r22262n04852n6922M17531R56177J067341
$$ 708673120 708214164 707687318 707040131 706282496 705360234 704855382 704798460 705215991 706172168 707239509
581.3G07239509J262366J326561J188755R73821N40197M28319L21448J18673J08063
$$ 707239509 708501875 709828436 711017191 711991012 712531209 712959528 713280976 713399649 713507712
599.7G13507712L3140K27809L52502K81274N62310O93620O50882N79060P16924J409233
$$ 713507712 713540852 713768661 714121163 714402437 714964747 715658367 716309249 716888309 717605233 719014466
620.1G19014466J799464J818776J703799J348019J138568Q45849N75960N99682N71430
$$ 719014466 720813930 722632706 724336505 725684524 726823092 727668941 728244901 728844583 729416013
638.4G29416013O33776N70536L87907M05371L41892M10676M26710K37047K29121J54376
$$ 729416013 730049789 730620325 731008232 731413603 731755495 732166171 732592881 732829928 733059049 733213425
658.8G33213425J88887L91066K69234j05143K05577J257300J443982J174212J180053
$$ 733213425 733402312 733793378 734062612 733957469 734163046 735420346 736864328 738038540 739218593
677.2G39218593J224696J195967J225234J027107Q64744P58231N97834N25415L21865
$$ 739218593 740443289 741639256 742864490 743891597 744756341 745514572 746112406 746637821 746959686
695.5G46959686K44081K48432P4864J03414K12192M35472P50244R27388J209855J324594
$$ 746959686 747203767 747452199 747527063 747630477 747842669 748278141 749028385 749955773 751165628 752490222
715.9G52490222J272619J296103J239956J296103J273572J102030J050055Q65341P56085
$$ 752490222 753762841 755058944 756298900 757595003 758868575 759970605 761020660 761886001 762642086
734.3G62642086P26401N54264M84049L06726J04368o1512l28184m13477n19216n89728
$$ 762642086 763368487 763922751 764406800 764713526 764817894 764756382 764428198 764014721 763495505 762905777
754.7G62905777m23849k99275L5465N05626Q49783J150489J125395R32217P03454M50850
$$ 762905777 762481928 762182653 762218118 762723744 763573527 764724016 765849411 766781628 767485082 767935932
775.1G67935932M00006L01302L21090M90606M50313M34280M26888M79817O15001N40435
$$ 767935932 768335938 768637240 768958330 769448936 769899249 770333529 770760417 771240234 771855235 772395670
795.5G72395670N95332P24315P52151P65384N47587M44651M95315M78983N39302M77970
$$ 772395670 772991002 773715317 774467468 775232852 775780439 776225090 776720405 777199388 777738690 778216660
815.9G78216660M66883N68569M96566L80218J31130j43230l60012o35147o40511n44965
$$ 778216660 778683543 779252112 779748678 780128896 780260026 780116796 779756784 779121637 778481126 777936161
836.3G77936161m90010l63767l48032k90394k76983l35514k18272j38998r3162r8646
$$ 777936161 777446151 777082384 776734352 776443958 776166975 775831461 775613189 775474191 775381029 775282383
856.7G75282383j39356K9147J60277L40760O19888O88136O26385L51190K5571j60337
$$ 775282383 775143027 775172174 775332451 775673211 776293099 776981235 777607620 777958810 777984381 777824044
877.1G77824044m04536n40853o84261r78530j216888j455665j579761j540840j363337
$$ 777824044 777419508 776878655 776194394 775215864 773998976 772543311 770963550 769422710 768059373
895.4G68059373r86338o95586n44965n06461n99563o87122r19104j205444j351416
$$ 768059373 767073035 766377449 765832484 765326023 764726460 764039338 763120234 761914790 760563374
913.8G60563374j442612j416802j365781j292527j068651q08001n05507k53796j31727
$$ 760563374 759120762 757703960 756338179 755045652 753977001 753169000 752663493 752409697 752277970
932.1G52277970l7312k7180k9087m1962j26063j93120l77535p05481j140594j709283
$$ 752277970 752240658 752213478 752184391 752142429 752016366 751823246 751445711 750740230 749599636 747890353
952.5G47890353k189100k513766k692640k738893k825856k896309k923965k996445
$$ 747890353 745701253 743187487 740494847 737755954 734930098 732033789 729109824 726113379
968.8G26113379l088593l245891l475725l765524m065990m239321m256844m075170
$$ 726113379 723024786 719778895 716303170 712537646 708471656 704232335 699975491 695900321
985.2F95900321l695309l223837k667486k086997j590550j222730j040518j042962
$$ 695900321 692205012 688981175 686313689 684226692 682636142 681413412 680372894 679329932
1001.5F79329932j244903j646399k132535k622784l018617l208101l175199k895355
$$ 679329932 678085029 676438630 674306095 671683311 668664694 665456593 662281394 659386039
1017.8F59386039k421856j851022j264871q17775n26667l19838k07723j61767j49548
$$ 659386039 656964183 655113161 653848290 653030515 652503848 652184010 651976287 651814520 651664972
1036.1F51664972j52349j54197j88351j63615k0206K27273O27935J088619J528501
$$ 651664972 651512623 651358426 651170075 651006460 650986254 651213527 651841462 652930081 654458582
1054.5F54458582J945019K297640K577901K706528K493381J770318N66244p51198j665830
$$ 654458582 656403601 658701241 661279142 663985670 666479051 668249369 668815613 668064415 666398585
1072.9F66398585j809955j187503k25783O49155J258611J542271J554906J387358J118242
$$ 666398585 664588630 663401127 663175344 663824499 665083110 666625381 668180287 669567645 670685887
1091.2F70685887P99299M00662J7703k28048l38673k80500j00314J52587M66228P71105
$$ 670685887 671485186 671885848 671903551 671675503 671336830 671056330 670956016 671108603 671574831 672345936
1111.6F72345936J101077J416325J569808J602232J600802J627863J738429J972318
$$ 672345936 673447013 674863338 676433146 678035378 679636180 681264043 683002472 684974790
1127.9F84974790K407848K694965K422690J793504J045406K72334m22299r85861j309633
$$ 684974790 687382638 690077603 692500293 694293797 695339203 695611537 695189238 694203377 692893744
1146.3F92893744j386643j275778j012981o35862q7082N54502J178324J763940K195000
$$ 692893744 691507101 690231323 689218342 688582480 688495398 689049900 690228224 691992164 694187164
1164.6F94187164K453387K536714K441228K261817J950145J572966J250327R41455
$$ 694187164 696640551 699177265 701618493 703880310 705830455 707403421 708653748 709595203
1181G09595203P14481N18859L02493J09375j19209k96057m31180n57780n58496m69267
$$ 709595203 710309684 710828543 711131036 711240411 711121202 710825145 710393965 709836185 709277689 708808422
1201.4G08808422k63929N901J99258L51965M04895M02867M04835L12567K22146J51754
$$ 708808422 708544493 708550394 708749652 709101617 709506512 709909379 710314214 710626781 710848927 711000681
1221.8G11000681J01268J11521Q0406Q7440J34826J68502K90752L97265M59849N45085
$$ 711000681 711101949 711213470 711293876 711381316 711516142 711684644 711975396 712372661 712832510 713377595
1242.2G13377595O06120P07626P89046Q10206Q29756P79570P25209O53565N72324O24299
$$ 713377595 713983715 714691341 715480387 716290593 717120349 717899919 718625128 719278693 719851017 720475316
1262.6G20475316O60777O53744O99401P72714R43482J095295J115859J094162J040578
$$ 720475316 721136093 721789837 722489238 723261952 724205434 725300729 726416588 727510750 728551328
1280.9G28551328J034141J032889R15706P88390O57917N33521M17053K53976J76430
$$ 728551328 729585469 730618358 731534064 732322454 732980371 733513892 733930945 734184921 734361351
1299.3G34361351J15335J4245l9816j62899k93851m05550n32866n40077n10693l88861
$$ 734361351 734476686 734490931 734451115 734288216 733994365 733588815 733055949 732515872 732005179 731616318
1319.7G31616318k08556k06769k31147k76506l28660k46823k10404k23815j47105K10941
$$ 731616318 731407762 731200993 730969846 730693340 730364680 730117857 729907453 729683638 729536533 729747474
1340.1G29747474O87063O76036L94285K15828N9366j8120r7036j74642k87890o66380
$$ 729747474 730434537 731110573 731504858 731720686 731780052 731761932 731664896 731490254 731202364 730535984
1360.5G30535984q84533o46949n69939p19190p95603q58664p07627l37839l60250r95040
$$ 730535984 729651451 729004502 728434563 727715373 726919770 726061106 725353479 725015640 724655390 723660350
1380.9G23660350j154125J47522J830756K285838J415551L09289j71483p7128N7220
$$ 723660350 722506225 722653747 724484503 726770341 728185892 728495181 728323698 728246570 728303790
1399.2G28303790J50561l7193j51992N365j6928j36912k16067l55363p09474o21795
$$ 728303790 728454351 728417158 728265166 728270531 728253603 728116691 727900624 727545261 726835787 726213992
1419.6G26213992O5148K10821K31028K81334K55286N71609N99265L53634Q38042J230240
$$ 726213992 726279140 726489961 726720989 727002323 727257609 727829218 728428483 728782117 729620159 730850399
1440G30850399R30547M41730l2186k26557r9361n8771m45842j095534j96814J306176
$$ 730850399 731780946 732222676 732190490 731963933 731864572 731805801 731359959 730264425 730067611 731373787
1460.4G31373787J202106Q62062J382113J961410J858771K104878K981842L283202
$$ 731373787 732575893 733437955 734820068 736781478 738640249 740745127 743726969 747010171
1476.7G47010171L052593K647161K311111J912653J272082R66490J386881J357674
$$ 747010171 750062764 752709925 755021036 756933689 758205771 759172261 760559142 761916816
1493G61916816N14865j56462J21057M23670j27554j540363k021432J13249Q66115L38852
$$ 761916816 762431681 762275219 762396276 762819946 762692392 761152029 759130597 759243846 760109961 760448813
1513.4G60448813J24693O43552J258731J850724K348840K187252J944780J579404R01342
$$ 760448813 760573506 761217058 762475789 764326513 766675353 768862605 770807385 772386789 773288131
1531.8G73288131O49392Q47817J53482p97212J53720J190305J149356P08997K34604
$$ 773288131 773937523 774785340 774938822 774141610 774295330 775485635 776634991 777343988 777578592
1550.1G77578592Q5533o1035o23703j316071R4652J316786N38111l27826r16302r29475
$$ 777578592 777664125 777603090 776979387 775663316 775757968 777074754 777612865 777285039 776368737 775439262
1570.5G75439262o07967j301646k108991j427591j240015j915634k264798k371013
$$ 775439262 774831295 773529649 771420658 769993067 768753052 766837418 764572620 762201607
1586.9G62201607k436578k428293k465248k518654k566099k741635k983868l074885
$$ 762201607 759765029 757336736 754871488 752352834 749786735 747045100 744061232 740986347
1603.2G40986347k868295k622544k549172k455651k619505l525794l879428k546549
$$ 740986347 738118052 735495508 732946336 730490685 727871180 724345386 720465958 717919409
1619.5G17919409k265095k834261k481043k041519j674771r39727n88715m2379J403272
$$ 717919409 715654314 712820053 710339010 708297491 706622720 705682993 705094278 705051899 706455171
1637.9G06455171J953960J757681J389682J270175K125502K226174J502692K501429
$$ 706455171 708409131 710166812 711556494 712826669 714952171 717178345 718681037 721182466
1654.2G21182466L432393K862155K308250K250313K547980K143085J527011J711905
$$ 721182466 724614859 727477014 729785264 732035577 734583557 736726642 738253653 739965558
1670.5G39965558J785040J361251J251459J035929L37779o82175q90553P6413p0095
$$ 739965558 741750598 743111849 744363308 745399237 745737016 745054841 744164288 744240701 744170606
1688.8G44170606o87957j238405k342463k801120k590239k430558j548827j734793
$$ 744170606 743482649 742244244 739901781 737100661 734510422 732079864 730531037 728796244
1705.2G28796244k095044j790702j831889k162338k652347k664387j317978m51386
$$ 728796244 726701200 724910498 723078609 720916271 718263924 715599537 714281559 713830173
1721.5G13830173p32183r45032q72731q75116r57012j005113K0564P21335N48184O99758
$$ 713830173 713097990 712152958 711280227 710405111 709448099 708442986 708463550 709184885 709733069 710432827
1741.9G10432827J050234J155317J191914J599610K405047K725006K648949K835214
$$ 710432827 711483061 712638378 713830292 715429902 717834949 720559955 723208904 726044118
1758.2G26044118L050328L481507L791690L607869L455758L388345L716231M024505
$$ 726044118 729094446 732575953 736367643 739975512 743431270 746819615 750535846 754560351
1774.5G54560351L583849K950191K603591K381027K151489J955628J502335J024008
$$ 754560351 758144200 761094391 763697982 766079009 768230498 770186126 771688461 772712469
1790.8G72712469J218975J587569J359880R59456R24290J152157J103759Q46386O46830
$$ 772712469 773931444 775519013 776878893 777838349 778762639 779914796 781018555 781864941 782511771
1809.2G82511771O81221Q18253P58469O31153N90623M56035K28584K51710L39329L37363
$$ 782511771 783192992 784011245 784769714 785400867 785991490 786447525 786676109 786927819 787267148 787604511
1829.6G87604511N95569O88970M21882L09348K93911n424j56045L22282O10232M64619
$$ 787604511 788200080 788889050 789310932 789620280 789914191 789908767 789752722 790075004 790685236 791149855
1850G91149855K93433J71006J14679R1374J30236J28687n424k27273k31266K31207
$$ 791149855 791443288 791614294 791728973 791820347 791950583 792079270 792073846 791846573 791615307 791846514
1870.4G91846514M71055K67804J13904P6473M9293L7134K1517j9252q4043L4035J37627
$$ 791846514 792317569 792585373 792699277 792775750 792825043 792862177 792883694 792864442 792780399 792814434 792952061
1892.8G92952061K7477M3333R9480N5075K8610j5259o4671m5776L8981P0811j10507
$$ 792952061 792979538 793022871 793122351 793177426 793206036 793190777 793126106 793080330 793119311 793190122 793079615
1915.2G93079615k36214o9499n602r895O7950N5074Q583m7981q1599r0420j18495j96695
$$ 793079615 792843401 792773902 792768300 792758405 792826355 792881429 792890012 792842031 792760432 792670012 792551517 792354822
1939.7G92354822k66135q0764Q5592o55m5002n4598p8141q2255j15335r2745m9531
$$ 792354822 792088687 792007923 792093515 792092860 792047858 791993260 791915119 791832864 791717529 791624784 791575253
1962.2G91575253p8201j24038q8334M411j728o5744q1540r0301p4505o1155q0347q9168
$$ 791575253 791497052 791373014 791284680 791289091 791287363 791221619 791140079 791049778 790975273 790914118 790833771 790744603
1986.6G90744603j39118j64747o1214L2962p75q4818j17600q5771o6638p1644q5414
$$ 790744603 790605485 790440738 790379524 790412486 790411711 790326893 790209293 790123522 790056884 789985240 789899826
2009.1G89899826j12712j21475j58250k01762k31862l83079p70449p98881R5129P36951
$$ 789899826 789787114 789665639 789507389 789305627 789073765 788690686 787920237 787121356 787216485 787953436
2029.5G87953436M16220N5134j9193m5061p4088q4341m3333l099k7001m4644r179O259
$$ 787953436 788369656 788424790 788405597 788360536 788286448 788202107 788158774 788155675 788128674 788084030 788074851 788081110
2053.9G88081110J0371K145j5139j4961k4140O914M8638J9908j1921j2636J2815L1054
$$ 788081110 788091481 788093626 788078487 788063526 788039386 788046300 788094938 788114846 788102925 788090289 788103104 788134158
2078.4G88134158J3351K0146N126j9252O974K2113L6359L3975j192r001j5258k3962
$$ 788134158 788147509 788167655 788172781 788153529 788160503 788182616 788218975 788252950 788251758 788242757 788227499 788203537
2102.9G88203537j6927j1623m053l3438m7863k5868m1366l0220j5497k9921j6213k5451
$$ 788203537 788186610 788174987 788170934 788137496 788089633 788063765 788022399 787992179 787976682 787946761 787930548 787905097
2127.4G87905097l1948j7881j0491J5855m77j4186n901j6808R417P213l934K4557K3067
$$ 787905097 787873149 787855268 787844777 787860632 787860155 787845969 787840068 787823260 787832677 787839890 787835956 787860513 787883580
2153.9G87883580L7849L2961R537M1544K4259m1663q0347M172J68741J59979P5221
$$ 787883580 787921429 787954390 787963927 788005471 788029730 787988067 787907720 787911892 788080633 788240612 788315833
2176.3G88315833O6042N0485M0114J3947j1086K5630L8445K2590M589j3947k682j9789
$$ 788315833 788381875 788432360 788472474 788486421 788475335 788500965 788539410 788562000 788566589 788552642 788549960 788530171
2200.8G88530171l0875k8432n1319l9518m6373n5134m3034p8500p3969n7280q1420
$$ 788530171 788499296 788470864 788419545 788380027 788333654 788278520 788235486 788156986 788083017 788025737 787944317
2223.2G87944317p3433q8275j15990j10746q7916n8055q0407j06156r9242r8765p8380
$$ 787944317 787870884 787782609 787666619 787555873 787467957 787409902 787329495 787223339 787124097 787025332 786946952
2245.7G86946952p9751j05619j04666j21415j29044j21235j24157j00136q1360p6056
$$ 786946952 786867201 786761582 786656916 786535501 786406457 786285222 786161065 786060929 785979569 785903513
2266.1G85903513q1360j07467j13666j19865j29044j14739j14262j15752j28627j68503
$$ 785903513 785822153 785714686 785601020 785481155 785352111 785237372 785123110 785007358 784878731 784710228
2286.5G84710228j69336j66357j96218k19345k39194k41578k23219k18809k37107k78771
$$ 784710228 784540892 784374535 784178317 783958972 783719778 783478200 783254981 783036172 782799065 782520294
2306.8G82520294l10123l09825l17871l38853l84986m16696l88265l83019l94821m01080
$$ 782520294 782210171 781900346 781582475 781243622 780858636 780441940 780053675 779670656 779275835 778874755
2327.2G78874755m13656l81768l92437m96626n41270m22835k04921K7120K90454K99453
$$ 778874755 778461099 778079331 777686894 777190268 776648998 776226163 776021242 776048362 776338816 776638269
2347.6G76638269q2850m93705o70374o31869n18143l78787k24173j02461L1531J65582
$$ 776638269 776555419 776061714 775391340 774759471 774241328 773862541 773638368 773535907 773567438 773733020
2368G73733020J77145J55747J64509J37448J00851M5598l5406j06334j82391k17735
$$ 773733020 773910165 774065912 774230421 774367869 774468720 774514318 774478912 774372578 774190187 773972452
2388.4G73972452k34306k84553k88665k79188l02017l16679l30329l15726l07202l34144
$$ 773972452 773738146 773453593 773164928 772885740 772583723 772267044 771936715 771620989 771313787 770979643
2408.8G70979643l29673l28064l39449l46243l70324l65913l62336l67165l49283l63589
$$ 770979643 770649970 770321906 769982457 769636214 769265890 768899977 768537641 768170476 767821193 767457604
2429.2G67457604l56614l36826l71516l76582l55780l44098l51727l96609m00841l71993
$$ 767457604 767100990 766764164 766392648 766016066 765660286 765316188 764964461 764567852 764167011 763795018
2449.6G63795018l62158l64065l76820l75927l85582m07160l96192l79681l59774l54230
$$ 763795018 763432860 763068795 762691975 762316048 761930466 761523306 761127114 760747433 760387659 760033429
2470G60033429l71278l61979l68237l79205l71456l78132l66151l73841l96967l82006
$$ 760033429 759662151 759300172 758931935 758552730 758181274 757803142 757436991 757063150 756666183 756284177
2490.4G56284177l81052l75152l56138l53574l42667l59595l81112l61622l47972l51488
$$ 756284177 755903125 755527973 755171835 754818261 754475594 754115999 753734887 753373265 753025293 752673805
2510.8G52673805l59416l40045l08096l05712l04819l26752l40820l09944l09467l08573
$$ 752673805 752314389 751974344 751666248 751360536 751055717 750728965 750388145 750078201 749768734 749460161
2531.2G49460161k93672k98143k83181k79844k79427k58326k51830k44379k53975k64168
$$ 749460161 749166489 748868346 748585165 748305321 748025894 747767568 747515738 747271359 747017384 746753216
2551.6G46753216k36988k29597k29061k31326k53379k43962k33590k22505j98900k21074
$$ 746753216 746516228 746286631 746057570 745826244 745572865 745328903 745095313 744872808 744673908 744452834
2572G44452834k49505k57194k52306k33293k48075k76863k79307k58804k31027k35081
$$ 744452834 744203329 743946135 743693829 743460536 743212461 742935598 742656291 742397487 742166460 741931379
2592.4G41931379k53380k79903l05891k85923k68400k68161k60175k64227k47121k29180
$$ 741931379 741677999 741398096 741092205 740806282 740537882 740269721 740009546 739745319 739498198 739269018
2612.8G39269018k47419k66492k80798k85446k69056k49803k38180k42770k40504k14637
$$ 739269018 739021599 738755107 738474309 738188863 737919807 737670004 737431824 737189054 736948550 736733913
2633.2G36733913k08318k13325k07186k07305k07603k12848k16841k05517j90497j66058
$$ 736733913 736525595 736312270 736105084 735897779 735690176 735477328 735260487 735054970 734864473 734698415
2653.6G34698415j67430j99139j84595j58310j60992j70649j92642j99318j86324j80661
$$ 734698415 734530985 734331846 734147251 733988941 733827949 733657300 733464658 733265340 733079016 732898355
2674G32898355j89543k09630k26795k51711k65121k54512k46585k23398k21371k54393
$$ 732898355 732708812 732499182 732272387 732020676 731755555 731501043 731254458 731031060 730809689 730555296
2694.4G30555296k71082k96593l07440l03388l24607l23296l18169l21984l08037l04282
$$ 730555296 730284214 729987621 729680181 729376793 729052186 728728890 728410721 728088737 727780700 727476418
2714.8G27476418l01599l02852l13103l06308l03030l12746l35991l41296l11435k87532
$$ 727476418 727174819 726871967 726558864 726252556 725949526 725636780 725300789 724959493 724648058 724360526
2735.2G24360526k64407k59876k91884k90692k38239j92821k29538l25620l48806l05832
$$ 724360526 724096119 723836243 723544359 723253667 723015428 722822607 722593069 722267449 721918643 721612811
2755.6G21612811k97189l01718l08097l10361k90275k93612l22223l34382l20196l53337
$$ 721612811 721315622 721013904 720705807 720395446 720105171 719811559 719489336 719154954 718834758 718481421
2775.9G18481421m15504m18603m20272m17888l55721l20911m18365n45502n31793m66704
$$ 718481421 718065917 717647314 717227042 716809154 716453433 716132522 715714157 715168655 714636862 714170158
2796.3G14170158m98712n77867o25193o33538o06835n79953o08981o79672p02619o72758
$$ 714170158 713671446 713093579 712468386 711834848 711228013 710648060 710039079 709359407 708656788 707984030
2816.7G07984030o38008o11603o52492p34270p40051o90818o88076p60794q11159p85411
$$ 707984030 707346022 706734419 706081927 705347657 704607606 703916788 703228712 702467918 701656759 700871348
2837.1G00871348q84711j130760j266420j292586j337648j334250j154184q85487o95288
$$ 700871348 699986637 698855877 697589457 696296871 694959223 693624973 692470789 691585302 690890014
2855.5F90890014n81086n74171o86646p97510q78989r58980r45389q42690r00984j103997
$$ 690890014 690308928 689734757 689048111 688250601 687371612 686412632 685467243 684624553 683723569 682619572
2875.9F82619572j099170r30845q48353p90835p08937o71387o56009n72860m42624
$$ 682619572 681520402 680589557 679741204 678950369 678241432 677570045 676914036 676341176 675898552
2894.2F75898552m32372n23448n15163m11868l84093m62293n23806n68449p13289r65536
$$ 675898552 675466180 674942732 674427569 674015701 673631608 673169315 672645509 672077060 671363771 670398235
2914.6F70398235j185238j219749j089752q45492n45859k63632n1021j8895l0458J07527
$$ 670398235 669212997 667993248 666903496 666058004 665512145 665248513 665197492 665178597 665148139 665255666
2935F65255666K62558L83735N86092P59781P44581N71251M74155N44250M99129L86298
$$ 665255666 665518224 665901959 666488051 667247832 667992413 668563664 669037819 669582069 670081198 670467496
2955.4F70467496M33087N14984N29945M81248M47512M63009M59432M99010N63205N90265
$$ 670467496 670900583 671415567 671945512 672426760 672874272 673337281 673796713 674295723 674858928 675449193
2975.8F75449193O95943Q08061P29918N90563N94675O43969O83427O46293L92497J93595
$$ 675449193 676145136 676953197 677683115 678273678 678868353 679512322 680195749 680842042 681234539 681428134
2996.2F81428134J17600k1457o2049l6418m8399M4167J67370J10388j45019l91483
$$ 681428134 681545734 681524277 681462228 681425810 681377411 681421578 681588948 681699336 681554317 681162834
3016.6F81162834m47750m07338l60251l64303m30346l85582k76089k57611l92616n70834
$$ 681162834 680715084 680307746 679947495 679583192 679152846 678767264 678491175 678233564 677840948 677270114
3037F77270114m83155l01778m08292o64294p50720o15239n37336o35326o96004p23958
$$ 677270114 676786959 676485181 676076889 675412595 674661875 674046636 673509300 672873974 672177970 671454012
3057.4F71454012p67529p05719n71310m90785o01470q08180q35836o96659n04136m45306
$$ 671454012 670686483 669980764 669409454 668918669 668317199 667509019 666673183 665976524 665472388 665027082
3077.8F65027082o45638q13722q20339q50856q53360q18431r01878r67086q39650o86228
$$ 665027082 664381444 663567722 662747383 661896527 661043167 660224736 659322858 658355772 657516122 656829894
3098.2F56829894p40886r18210r30369p62522p31349r20713r08017o43015o04749q57412
$$ 656829894 656089008 655170798 654240429 653477907 652746558 651825845 650917828 650274813 649670064 648812652
3118.6F48812652j162351j339018j264036j049995r46701j039624j131594j053035
$$ 648812652 647650301 646311283 645047247 643997252 643050551 642010927 640879333 639826298
3134.9F39826298q92043q94606j137197j292706j209915j105725r86755q91447j097560
$$ 639826298 638934255 638039649 636902452 635609746 634399831 633294106 632307351 631415904 630318344
3153.3F30318344j410663j429379j303792j247347j222193j220822j248599j278877
$$ 630318344 628907681 627478302 626174510 624927163 623704970 622484148 621235549 619956672
3169.6F19956672j295805j296222j291096j279950j277745j335681j399934j379490
$$ 619956672 618660867 617364645 616073549 614793599 613515854 612180173 610780239 609400749
3185.9F09400749j331448j336873j384079j440823j482368j449227j360536j338482
$$ 609400749 608069301 606732428 605348349 603907526 602425158 600975931 599615395 598276913
3202.2E98276913j391470j435995j431823j386106j368165j383007j383483j394987
$$ 598276913 596885443 595449448 594017625 592631519 591263354 589880347 588496864 587101877
3218.5E87101877j405716j389802j387000j384079j315356j160085j090348j319944
$$ 587101877 585696161 584306359 582919359 581535280 580219924 579059839 577969491 576649547
3234.8E76649547j552284j478732j337588j243710j118720j112044j270711j323402
$$ 576649547 575097263 573618531 572280943 571037233 569918513 568806469 567535758 566212356
3251.2E66212356j202106j134932j183808j196027j143277j121759j092136r61423
$$ 566212356 565010250 563875318 562691510 561495483 560352206 559230447 558138311 557176888
3267.5E57176888q29279r45092j187324j279891j278996j234234j171827j148224j154840
$$ 557176888 556347609 555402517 554215193 552935302 551656306 550422072 549250245 548102021 546947181
3285.8E46947181j126349j010060r90510j146674j290024j389920j403511j202702
$$ 546947181 545820832 544810772 543820262 542673588 541383564 539993644 538590133 537387431
3302.1E37387431r85146j125872j542926j804769j787841j687527j630127j577318
$$ 537387431 536402285 535276413 533733487 531928718 530140877 528453350 526823223 525245905
3318.5E25245905j562119j571953j565158j711428j918793j930177j836598j715541
$$ 525245905 523683786 522111833 520546675 518835247 516916454 514986277 513149679 511434138
3334.8E11434138j584232j685500j924634j979232j976371j914978j725674j797765
$$ 511434138 509849906 508164406 506239772 504260540 502284169 500369191 498643517 496845752
3351.1D96845752k104133k168030j972288j819402j837760j812309j591682j477212
$$ 496845752 494741619 492573589 490601301 488781899 486944139 485131830 483540148 482062936
3367.4D82062936j718551k077997k093106j796455j607149j578927j593322j554072
$$ 482062936 480344385 478266388 476173282 474376827 472769678 471190751 469597429 468043357
3383.7D68043357j406610j185834r61930j036346j373678j370907r52989p66694j126856
$$ 468043357 466636747 465450913 464488983 463452637 462078959 460708052 459755063 458988369 457861513
3402.1D57861513j468986j295507r84043q93623r13352r89347j008660q40992o84321
$$ 457861513 456392527 455097020 454112977 453219354 452306002 451316655 450307995 449467003 448782682
3420.4D48782682o13987m88579l31968k68698l27438k70725r8288j53482l59892l57390
$$ 448782682 448168695 447680116 447348148 447079450 446752012 446481287 446382999 446229517 445869625 445512235
3440.8D45512235j64598K7865J68294K08437K26468L25382M30882N13941N72532N30690
$$ 445512235 445347637 445375502 445543796 445752233 445978701 446304083 446734965 447248906 447821438 448352128
3461.2D48352128N89401Q70317R86993O81073L55273M58956P41333R18686R39638Q06152
$$ 448352128 448941529 449811846 450798839 451479912 451835185 452294141 453035474 453954160 454893798 455699950
3481.6D55699950P86454R32395R86934R71347J020402J079857J112134J094639J085818
$$ 455699950 456486404 457418799 458405733 459377080 460397482 461477339 462589473 463684112 464769930
3500D64769930J143872J100809R72062J061052J305342J428276J346171J181603J142859
$$ 464769930 465913802 467014611 467986673 469047725 470353067 471781343 473127514 474309117 475451976
3518.3D75451976J273871J462876J438469J290768J379401J527339J545102J646071
$$ 475451976 476725847 478188723 479627192 480917960 482297361 483824700 485369802 487015873
3534.7D87015873J697004J534164J504987J666129J757443J671583J551538J610100
$$ 487015873 488712877 490247041 491752028 493418157 495175600 496847183 498398721 500008821
3551E00008821J775325J812994J788855J859009J825631J521885J545072K385497K828419
$$ 500008821 501784146 503597140 505385995 507245004 509070635 510592520 512137592 514523089 517351508
3569.3E17351508K329171K014577K157748K345502K478600K475023K201617K139568
$$ 517351508 519680679 521695256 523853004 526198506 528677106 531152129 533353746 535493314
3585.6E35493314K708912K909899K408385K366841K735555K857924K845645K776086
$$ 535493314 538202226 541112125 543520510 545887351 548622906 551480830 554326475 557102561
3602E57102561K411485K168417K564072K885938K835453K741992K413154K750873L527105
$$ 557102561 559514046 561682463 564246535 567132473 569967926 572709918 575123072 577873945 581401050
3620.3E81401050K965212J743257J326978K770007L913522K860963K343833K329231
$$ 581401050 584366262 586109519 587436497 590206504 594120026 596980989 599324822 601654053
3636.6F01654053K163827K080858J710355J020193J065433K738834L637552K092123
$$ 601654053 603817880 605898738 607609093 608629286 609694719 612433553 616071105 618163228
3653F18163228J440108K282739K210497J443863J115978P28905L42846J002014J446843
$$ 618163228 619603336 621886075 624096572 625540435 626656413 627385318 627728164 628730178 630177021
3671.3F30177021O66320J441002K286077J374244Q73149N16534J01149O43372J721144
$$ 630177021 630843341 632284343 634570420 635944664 636817813 637334347 637435496 638078868 639800012
3689.7F39800012J561344Q33690M91023K64347L13580Q63194Q64506K5093m36544J73152
$$ 639800012 641361356 642195046 642686069 642950416 643263996 644127190 644991696 645016789 644580245 644753397
3710.1F44753397J338243J123071R8467k42234j26183n364J26839K90095j22487p56383
$$ 644753397 646091640 647214711 647313178 647070944 646944761 646939397 647066236 647356331 647233844 646477461
3730.5F46477461n65350N42462J462459O52373j034021j037598Q74579P24316l41237
$$ 646477461 645912111 646454573 647917032 648569405 647535384 646497786 647372365 648096681 647755444
3748.8F47755444R04977J587928L41057k58862L14116N52118m6551k24531k9028L28958
$$ 647755444 648660421 650248349 650589406 650330544 650644660 651196778 651150227 650925696 650896668 651225626
3769.2F51225626O38187K17438l04460k38479K65539K51055j25885K7120J83642K9862
$$ 651225626 651863813 652081251 651776791 651538312 651803851 652054906 651929021 651956141 652139783 652169645
3789.6F52169645k44141n16534m10080m56571m04954N52535L87847k5630O34373J79708
$$ 652169645 651925504 651408970 650998890 650542319 650137365 650689900 651077747 651052117 651686490 651866198
3810F51866198q85010q81970j5140j51038j25766Q90315L72946k83181k98203l83079
$$ 651866198 650981188 650099218 650084078 649933040 649807274 650697589 651070535 650787354 650489151 650106072
3830.4F50106072l45170m35472k22325L96729L73959K19703K70963l33131j458883
$$ 650106072 649760902 649325430 649103105 649499834 649873793 650093496 650364459 650031328 648572445
3848.7F48572445j880944K47836K473831P02799p84040q44657l73721k2710m10676
$$ 648572445 646691501 646939337 649413168 650115967 649331927 648487270 648113549 648090839 647680163
3867.1F47680163j71125N74589L63171j2099n13196m67718P1704l4690K61844J22010
$$ 647680163 647509038 648083627 648446798 648434699 647921503 647453785 647525489 647490799 647752643 647874653
3887.5F47874653n21779K2054K34842o58154r94027m86851J53423P06255P17879P0750
$$ 647874653 647352874 647374928 647609770 646951616 645957589 645470738 645624161 646330416 647048295 647119045
3907.9F47119045l22044m08888n47289l48330J05679O1691k56360j41382J4126k73048
$$ 647119045 646797001 646388113 645840824 645492494 645598173 645659864 645403504 645262122 645276248 645003200
3928.3F45003200k91408J79947K28643k15947m82738m05848q8275j6570k09033p9930
$$ 645003200 644711792 644891739 645120382 644904435 644421697 644015849 643927574 643911004 643701971 643622041
3948.7F43622041Q2850o2763j84060j85251k03967j82092j34587j45972j38939j19269
$$ 643622041 643704891 643642128 643458068 643272817 643068850 642886758 642752171 642606199 642467260 642347991
3969.1F42347991j24394j40429j60694j66118j49489j01328o9916j47998k44916k22563
$$ 642347991 642223597 642083168 641922474 641756356 641606867 641505539 641435623 641287625 641042709 640820146
3989.5F40820146j61410j46866j18136r0241
$$ 640820146 640658736 640511870 640393734 640303493
3997.6F40303493
$$ 640303493
##END=$$ End of the data block
