##TITLE=$$ Begin of the data block
##JCAMP-DX=5.00 $$ ACD/SpecManager v 10.08
##SPECTROMETER/DATA SYSTEM=Alpha
##DATE=27 Jun 2014 15:13:00
##DATA TYPE=INFRARED SPECTRUM
##DATA CLASS=XYDATA
##ORIGIN=
##OWNER=
##NPOINTS=1667
##FIRSTX=599.63549805
##LASTX=3997.56909180
##MAXX=3997.56909180
##MINX=599.63549805
##MAXY=1.12522602
##MINY=0.11102586
##XFACTOR=1.0000000000
##YFACTOR=0.000000010000000
##FIRSTY=1.03957117
##DELTAX=2.03957605
##XUNITS=1/CM
##YUNITS=ARBITRARY UNITS
##XYDATA=(X++(Y..Y))
599.6A03957117k7275J85978K65944K28310J69503J86563K49350K38883J37604N7101
620A05649078O9713J13321J06025O0963K2555q583m8590r2149j01066q8524p3803m6825
644.5A05562115n5766r1601p7879o8009j26612j72270k01940k73979l18968k42853
664.9A03932238j80745l38245m11630l78871m25732m46319m15325l73185l52812l57807
685.3A00251567l52955l51339l54225l54319l75206m41986n89937q09508j140815j603485
705.7I3877792j982700j976061j588869j196146j033050r18353n23722K21956J027590
724H5908437J538723J636559J482517J343560J308537J286649J212692J099748R93282
742.4I7810704Q78804P28578N85359N07414M66443L80992K68412K09093K00856K20227
$$ y = [103957117, 103929842, 104115820, 104381764, 104610074, 104779577, 104966140, 105215490, 105454373, 105591977, 105649078, 105718791, 105832112, 105938137, 105999100, 106021655, 106013072, 105964482, 105872333, 105771267, 105682743, 105608940, 105562115, 105506349, 105414748, 105336869, 105268860, 105142248, 104969978, 104768038, 104494059, 104175091, 103932238, 103751493, 103413248, 103001618, 102622747, 102197015, 101750696, 101335371, 100962186, 100609374, 100251567, 99898612, 99547273, 99193048, 98838729, 98463523, 98021537, 97431600, 96622092, 95481277, 93877792, 91895092, 89919031, 88330162, 87134016, 86100966, 85182613, 84658891, 84880847, 85908437, 87447160, 89083719, 90566236, 91909796, 93218333, 94504982, 95717674, 96817422, 97810704, 98689508, 99418086, 100003445, 100510859, 100977302, 101358294, 101626706, 101835799, 102036655, 102256882]
762.8A02256882K38717J81579J03712J04762J58858K08771K01833J63067J63352J80114
783.2A03961647J81114J73259J39332Q2660L3021Q666J442l3855j16885k02989k39802
805.6A03987610k08103j42181j41144j93584j81854j35290j16361o0927K9945L6502
826A02874613p0369k01321k78199k73812j98173j06132p2587j01483j14870o3502K3698
848.5A01417863J09113J53863J13750L6096o628m6635j19197j85752k29180k73466
868.9A00969827l10123k95603j90795k6679R8169J35935J39165J64818J81794J41109
889.3A01007617M4679j24526l96442n35500l02029m703Q7261J01418N6696n7960j20753
911.7I9755758r0730l0625r799q7070k61629l84903k77036K9534L28147M07839K18308
$$ y = [102256882, 102495599, 102677178, 102780890, 102885652, 103044510, 103253281, 103455114, 103618181, 103781533, 103961647, 104142761, 104316020, 104455352, 104538012, 104571033, 104579699, 104581141, 104547286, 104430401, 104227412, 103987610, 103779507, 103637326, 103496182, 103302598, 103120744, 102985454, 102869093, 102808166, 102838111, 102874613, 102804244, 102602923, 102324724, 102050912, 101852739, 101746607, 101674020, 101572537, 101457667, 101394165, 101417863, 101526976, 101680839, 101794589, 101830685, 101824057, 101777422, 101658225, 101472473, 101243293, 100969827, 100659704, 100364101, 100173306, 100146627, 100244796, 100380731, 100519896, 100684714, 100866508, 101007617, 101052296, 100927770, 100531328, 99995828, 99693799, 99689096, 99776357, 99877775, 99934471, 99876511, 99755758, 99665028, 99634403, 99624604, 99537534, 99275905, 98891002, 98613966, 98643500, 98971647, 99379486, 99597794]
934.1I9597794k5368q1807L3039J27291J12325L4273o3974j66327k53999k95186k57963
956.6I8760098j46758k6197N1499O4021P504o4879j22077k01123k89327k53827n6880
979I7722054R4431J03903J25974K12568K65289K16788J02895K2483j1188o8044j63007
1001.4I8624146k50989l22557l95983l67159j16098J24431M7874k09498l36951k76423
1021.8I6520793j85376j57851j17534n311P5382o157k72388p12180j206612j312191
1042.2I2620575p31235L3450L94147M56793M61739L94326K63155J56587J10603J04034
1062.6I4264174Q3678J4258q4555j93203l40169n55784q27020j112038j318634j377952
1083H8552755j346314j316470j310885j299607j246727j100033q11714m09246N961
$$ y = [99597794, 99572426, 99490619, 99523658, 99650949, 99763274, 99797547, 99733573, 99567246, 99313247, 99018061, 98760098, 98613340, 98587143, 98638642, 98702663, 98710167, 98645288, 98523211, 98322088, 98032761, 97778934, 97722054, 97816485, 97920388, 98046362, 98258930, 98524219, 98741007, 98843902, 98866385, 98855197, 98787153, 98624146, 98373157, 98050600, 97654617, 97287458, 97171360, 97295791, 97343665, 97134167, 96797216, 96520793, 96335417, 96177566, 96060032, 96054721, 96130103, 96123946, 95851558, 95139378, 93932766, 92620575, 91889340, 91922790, 92316937, 92773730, 93235469, 93629795, 93892950, 94049537, 94160140, 94264174, 94347852, 94362110, 94277555, 94084352, 93744183, 93188399, 92361379, 91249341, 89930707, 88552755, 87206441, 85889971, 84579086, 83279479, 82032752, 80932719, 80121005, 79711759, 79717720]
1101.4G9717720L24750M73731M16881J51062k23684n09972n44148k68233K28667P16293
1121.8H0483067R21571O45972m9413p87455j352173j927614k525878k820170k652299
1140.1F9935608k212608j780438j493824j360136j346034j385146j386196j277911
1156.4E7693315j044941p20901l77071q9192J31893L12019M89032P50589J107800J408184
1176.8E9660727J604867J781392J880884J824039J665366J483083J309156J157880
1193.1G2367394J057911J038915J061547J028871Q96180O91533M69118K88904J84363
1211.5G9084736J38664J21200Q4305k1988j85567l52174m61298m70585m07207l53640
1231.9G7176446l41672l10326j89608K0731K68942N05972O91580P83968P57897O43844
$$ y = [79717720, 80042470, 80516201, 80933082, 81084144, 80860460, 80350488, 79806340, 79538107, 79766774, 80483067, 81404638, 82050610, 82001197, 81213742, 79861569, 77933955, 75408077, 72587907, 69935608, 67723000, 65942562, 64448738, 63088602, 61742568, 60357422, 58971226, 57693315, 56648374, 55927473, 55550402, 55461210, 55593103, 55905122, 56394154, 57144743, 58252543, 59660727, 61265594, 63046986, 64927870, 66751909, 68417275, 69900358, 71209514, 72367394, 73425305, 74464220, 75525767, 76554638, 77450818, 78142351, 78611469, 78900373, 79084736, 79223400, 79344600, 79428905, 79406917, 79221350, 78869176, 78407878, 77937293, 77530086, 77176446, 76834774, 76524448, 76334840, 76355571, 76624513, 77130485, 77822065, 78606033, 79363930, 80007774]
1252.3H0007774N14441M31770M03673L88795L46804K90852K66690K84183L10218L05897
1272.7H3551097K74527K31379K00022K59333M50272O54286P00772N78183M07964K78008
1293.1H7585843J98108J35052P8219R5391K16568L45391L77559L41714L25286K98321
1313.5H9997452K08658J17374J07294J84083K85137L39675L14087K09397M3279j40208
1333.9I1666228k93673m06241m46427l53044k37250k21306k56467k63846k32256k05385
1354.3H8750333j82170j06877k176O259q6624j44565j50943k08109n46682j141948
1374.7H6186498j150059j20646J148337J769835J762938J589769J251865Q02743M94111
1393I3735391L31962L38072N10460P13831Q27104P29280K61188m28325j126981j489395
$$ y = [80007774, 80522215, 80953985, 81357658, 81746453, 82093257, 82384109, 82650799, 82934982, 83245200, 83551097, 83825624, 84057003, 84257025, 84516358, 84966630, 85620916, 86321688, 86899871, 87307835, 87585843, 87783951, 87919003, 87997222, 88092613, 88309181, 88654572, 89032131, 89373845, 89699131, 89997452, 90206110, 90323484, 90430778, 90614861, 90899998, 91239673, 91553760, 91763157, 91806436, 91666228, 91372555, 90966314, 90519887, 90166843, 89929593, 89708287, 89451820, 89187974, 88955718, 88750333, 88568163, 88461286, 88459110, 88465369, 88378745, 88234180, 88083237, 87875128, 87328446, 86186498, 85036439, 84915793, 86064130, 87833965, 89596903, 91186672, 92438537, 93241280, 93735391, 94067353, 94405425, 94915885, 95629716, 96456820, 97186100, 97447288, 97018963, 95891982, 94402587]
1413.4I4402587j244181n86724J75559N76318M49365l2115o65849j287437j576924
1431.8I0210599j450283j507276j573658j216173j043952j060396j093352j314944
1448.1G9950565j647264j970815k123291k123487j575458p12812o46221r30435K23548
1466.4F8444330L318041O648612Q674514O658370L424978K051425J594692J317966
1482.8A02132928J028538Q32892O69968M16410K24614J28257q2314k31683O4218M78983
1503.2A05662811P34031O21045J55878K8467R3019J44386J39165J20998Q7797L624
1523.6A07791221k3329j3125J1420O2382L7432J729Q9156J04189j38294k62905k20465
1546A07439411j25599l3558L7611J29533K43473K86317j4401j72376o7652K9850R9659
$$ y = [94402587, 93158406, 92571682, 92747241, 93323559, 93772924, 93740809, 93074960, 91787523, 90210599, 88760316, 87253040, 85679382, 84463209, 83419257, 82358861, 81265509, 79950565, 78303301, 76332486, 74209195, 72085708, 70510250, 69797438, 69151217, 68220782, 68444330, 71762371, 78410983, 87085497, 93743867, 97168845, 99220270, 100814962, 102132928, 103161466, 103994358, 104664326, 105080736, 105305350, 105433607, 105351293, 105119610, 105183828, 105662811, 106396842, 107017887, 107173765, 107202232, 107295251, 107439637, 107578802, 107699800, 107787597, 107791221, 107767892, 107754767, 107766187, 107828569, 107866001, 107867730, 107956886, 108061075, 107922781, 107659876, 107439411, 107313812, 107280254, 107317865, 107447398, 107690871, 107977188, 107962787, 107790411, 107722759, 107752609, 107852268]
1568.4A07852268Q2815M0507P6473N7614m2367m1223p915k384q476j1420j1957j6701
1592.9A07967234l7122p0441j00016j21010j01566l9888L1865N3895L0064K7561M1843
1615.3A07682419l6025j09411p4291r7418j50585j27887o4612N496N6803o8605l14260
1637.8A06701624l72541l45134k79558k60627k80881j59717r4127l79670m26412k32339
1658.2A03870618j17433j20556k07496j84440j15335k3759J58823L63767L71063K31802
1678.6A04227054J66214J12152j37556l53014l65305m24695m23086n53346p51793r44257
1699A00552368j318002j223868j162445j359439j249528j048613r91648j256400k173722
1717.3H8768703k786619k763974l250367l979200m505217n091089n710489p688957
$$ y = [107852268, 107935083, 107975590, 108052063, 108109677, 108067310, 108026087, 108018172, 108015788, 108007312, 107995892, 107983935, 107967234, 107930112, 107859671, 107759655, 107638645, 107537079, 107497191, 107529056, 107582951, 107613015, 107640576, 107682419, 107646394, 107536983, 107462692, 107365274, 107214689, 107086802, 107022190, 107027686, 107084489, 107015884, 106701624, 106329083, 105983949, 105704391, 105443764, 105162883, 105003166, 104909039, 104529369, 104102957, 103870618, 103753185, 103632629, 103425133, 103240693, 103125358, 103101599, 103260422, 103624189, 103995252, 104227054, 104393268, 104505420, 104367864, 104014850, 103649545, 103224850, 102801764, 102248418, 101496625, 100552368, 99234366, 98010498, 96848053, 95488614, 94239086, 93190473, 92198825, 90942425, 88768703, 85982084, 83218110, 79967743, 75988543, 71483326, 66392237, 60681748, 52992791]
1733.6E2992791q234572o081671n514416m692355k697468p66572J306814L970757O624779
1752C6908087Q011556R356370J0110087R159869Q066678O103950M184598L208214K453458
1770.3I7562867J897389J355481R27615P66397O86085N69189M90117M21178M06695
1788.7A05083013M02867L39699K41220K29705K44057K05004J69170J65236J88625J81472
1809.1A07450068J58048J23179J26838J36876J33443J43242J52040J31678J03295Q9109
1829.5A08747816M6527M9854O5958P0846Q3816J10686R3603K2221Q58J8776M2307L8231
1854A09391499L1197L0064K9302K3532M2176O9416L5882l1114l2103O556R680O151
1878.4A09612238J2911K5451K8205L5393K7883k730Q82J6845J4579M470p03o080K659
$$ y = [52992791, 44758219, 38676548, 33162132, 28469777, 25772309, 25005737, 26312551, 30283308, 36908087, 44919643, 54276013, 64386100, 73545969, 81612647, 87716597, 91901195, 95109409, 97562867, 99460256, 100815737, 101743352, 102509749, 103195834, 103765023, 104255140, 104676318, 105083013, 105485880, 105825579, 106066799, 106296504, 106540561, 106745565, 106914735, 107079971, 107268596, 107450068, 107608116, 107731295, 107858133, 107995009, 108128452, 108271694, 108423734, 108555412, 108658707, 108747816, 108794343, 108844197, 108910155, 108981001, 109064817, 109175503, 109269106, 109291327, 109292185, 109310961, 109353268, 109391499, 109422696, 109452760, 109482062, 109505594, 109547770, 109617186, 109653068, 109621954, 109589851, 109596407, 109606087, 109612238, 109625149, 109650600, 109678805, 109714198, 109742081, 109739351, 109740233, 109757078, 109771657, 109776127, 109775424, 109769344, 109772003]
1904.9A09772003J3768Q107n877l660J1992O819j6415k2149j7679k2757j5283q404
1929.4A09700465m387J419N495O342O700O628q667j8060j2851n48O867R787M220r394
1958A09694016j1992j908Q357K539j0038j2409n973o723j1110j0383p260k802m100
1984.5A09620214p833l337r06j2410j6081r335j1861j6546p916j55r822k0922k2518
2011A09480572j9384j6296j9967k8062k8908k2924j5915q821l278K265R703J5366J4186
2037.5A09358537Q798P391J2696K1290K2447J8371J6868R691J014M804J2636J5819
2062A09510362J9443J8108J2469J0014J4889J7810J0240Q905J9491K6989K4819K5499
2086.5A09719038K8765K4057J5604J2684J4591J8645K0539J8108J9467K1017J8203
$$ y = [109772003, 109785771, 109793878, 109788001, 109784341, 109796333, 109803152, 109786737, 109764588, 109746909, 109724152, 109708869, 109700465, 109696078, 109697497, 109702992, 109709334, 109716034, 109722662, 109713995, 109695935, 109683084, 109682536, 109689403, 109699190, 109703410, 109694016, 109682024, 109680116, 109688473, 109691012, 109680974, 109668565, 109662592, 109655869, 109644759, 109634376, 109627116, 109624314, 109620214, 109612381, 109609044, 109608138, 109595728, 109579647, 109570312, 109558451, 109541905, 109533989, 109533834, 109524012, 109503090, 109480572, 109461188, 109444892, 109424925, 109396863, 109367955, 109345031, 109329116, 109320295, 109317017, 109319282, 109328985, 109344351, 109358537, 109367335, 109374726, 109387422, 109408712, 109431159, 109449530, 109466398, 109476089, 109477103, 109481907, 109494543, 109510362, 109529805, 109547913, 109560382, 109570396, 109585285, 109603095, 109613335, 109622240, 109641731, 109668720, 109693539, 109719038, 109747803, 109771860, 109787464, 109800148, 109814739, 109833384, 109853923, 109872031, 109891498, 109912515, 109930718]
2108.9A09930718J1837J4604K8359L0971K0349J3840J5092J6737J7488J5617R691j251
2133.4A10124052n663k277K551J0538P725j0693j5426L088Q726j037l100L112R215
2159.9A10130811J0431J2421J8871K3186K6429K6739J3554L993J0336J4984J1754J3316
2184.4A10316825J1218M613J5426K5403J7154Q452O950O962P689O556l5m697q94K622
2212.9A10424244O56M673J1849N270p785j0514p022j263J526o175j1957j0717j5640
2239.4A10377145j9920j6773j3554n412j800j0657j9038j9503j3399q440j4067k0420
2263.9A10214162j1897l278n770q309p260l600j288j1456k9456k8920j3829j6844k5809
2290.4A10046446j2815L708M828M065N090J490O831K1279K8765L3974L8577M3892O1763
$$ y = [109930718, 109942555, 109957159, 109985518, 110016489, 110036838, 110050678, 110065770, 110082507, 110099995, 110115612, 110125303, 110124052, 110118389, 110116112, 110118663, 110129201, 110136926, 110126233, 110110807, 110113895, 110122621, 110121584, 110118484, 110121596, 110130811, 110141242, 110153663, 110172534, 110195720, 110222149, 110248888, 110262442, 110266435, 110276771, 110291755, 110303509, 110316825, 110328043, 110332656, 110348082, 110373485, 110390639, 110399091, 110406041, 110413003, 110420692, 110427248, 110427213, 110422516, 110421622, 110424244, 110424900, 110429573, 110441422, 110446692, 110438907, 110428393, 110421371, 110420108, 110421634, 110415459, 110403502, 110392785, 110377145, 110357225, 110340452, 110326898, 110321486, 110319686, 110309029, 110289991, 110270488, 110257089, 110248649, 110234582, 110214162, 110202265, 110198987, 110193217, 110184908, 110177648, 110174048, 110172760, 110161304, 110131848, 110102928, 110089099, 110072255, 110046446, 110033631, 110037339, 110042167, 110046232, 110051322, 110052812, 110059643, 110080922, 110109687, 110143661, 110182238, 110226130, 110287893]
2316.9A10287893Q0526Q6939P5984N6744O3550Q2648O6984K8956J5068K1326K4927
2339.4A10891545J1217n8078j76466j71840O306K07901K92921K33293J63042R5165
2359.8A11495006l1900j31142j61756j94752k25150k13516j81937j56010j37889j24454
2380.2A09936500r5404n4288k9110j8955r763k86K944K265N174N043K229L123P332
2406.7A09756804J3196J3268Q082M888M554O783J0919J5390J3948P260N018N508N245
2433.2A09870863R680J3637Q178R787J9455J8382J3387J3614J7178J6868J4544J2481
2457.7A10038054N651N447J3483J0490K754J2875K8121K4724J4520J2672J0299M578
2482.1A10183668J145K741M268L34k086N650J6105J0765j931j490L409j91k753m387
$$ y = [110287893, 110368419, 110455358, 110531342, 110588086, 110651636, 110734284, 110801268, 110830224, 110845292, 110866618, 110891545, 110902762, 110844684, 110668218, 110496378, 110502684, 110710585, 111003506, 111236799, 111399841, 111495006, 111463106, 111331964, 111170208, 110975456, 110750306, 110536790, 110354853, 110198843, 110060954, 109936500, 109841096, 109786808, 109757698, 109738743, 109728980, 109728694, 109731638, 109733903, 109739077, 109744120, 109746349, 109749472, 109756804, 109770000, 109783268, 109791350, 109796238, 109800792, 109807575, 109818494, 109833884, 109847832, 109855092, 109860110, 109865618, 109870863, 109880543, 109894180, 109902358, 109912145, 109931600, 109949982, 109963369, 109976983, 109994161, 110011029, 110025573, 110038054, 110043705, 110049152, 110062635, 110073125, 110075879, 110088754, 110116875, 110141599, 110156119, 110168791, 110179090, 110183668, 110184813, 110187554, 110191822, 110192156, 110190070, 110195720, 110211825, 110222590, 110220659, 110219169, 110222578, 110222387, 110219634, 110215247]
2510.7A10215247j1158j0217k276j455n960q464p677j705L910P892J5712J8584J7739
2537.2A10230172J7798P367k945N210J6236J1849K802M840P736J08j4365k2149j2589
2563.7A10252070n650j4687k8491l3056k1220o997j0646k7883l7002l4821k8539k6512
2588.2A09976566k6775k1481k1458k1851k1016k7240k8348l3331m6694m5001k9576
2610.6A09653795k6155l8850m1509m1079n8258o4397n1355m5896m5216l9124m0150
2633.1A09161806m5490l9041k7430k1518k6190l5310m5728o5184p5102o4301o3110
2655.5A08653402q4388j08278j19519j12820r9182q0991n5050l6204k9433l1889l6561
2677.9A07859087k2984J5521L9459K9313K5964M5252N9354O0332N0771L0589J8669
$$ y = [110215247, 110204089, 110193872, 110191596, 110190141, 110184181, 110175717, 110168040, 110166335, 110170245, 110178137, 110193849, 110212433, 110230172, 110247970, 110255337, 110252392, 110257602, 110273838, 110285687, 110288489, 110293329, 110301065, 110301173, 110286808, 110264659, 110252070, 110246420, 110231733, 110203242, 110170186, 110148966, 110141969, 110131323, 110103440, 110066438, 110031617, 110003078, 109976566, 109949791, 109928310, 109906852, 109885001, 109863985, 109836745, 109808397, 109775066, 109728372, 109683371, 109653795, 109627640, 109588790, 109547281, 109506202, 109447944, 109383547, 109332192, 109286296, 109241080, 109201956, 109161806, 109116316, 109077275, 109049845, 109028327, 109002137, 108966827, 108921099, 108855915, 108780813, 108716512, 108653402, 108569014, 108460736, 108341217, 108228397, 108129215, 108048224, 107993174, 107956970, 107927537, 107895648, 107859087, 107836103, 107851624, 107891083, 107920396, 107946360, 107991612, 108050966, 108111298, 108162069, 108192658, 108211327]
2700.4A08211327J3578j991k1601l2985l9649m6694n0998n4896o5947q0502q9419r6774
2724.8A07643449q0144k9338Q107J2064J1396L2210N2822L8922M411k9326m0912j0717
2749.3A07612944J9133K169l2687m8876n2797n8186o8117p6413q2385r7299j31929
2771.8A06985557j67763j70148j66642j92714k22194k43104k71046k93541k85256k65777
2792.2A04707372k78735l24452l58271l58403l59237l92199m49085n05245n46026n89645
2812.5A00546074o68961p76184q84425j003647j150143j327008j536191j775950k061707
2830.9H9361858k448016l036767l932804n191505o752277q260560r108948q870223
2847.2D1760758p538951n311477k468339N08640L088223M886285N715910N586981M632965
$$ y = [108211327, 108224905, 108222914, 108201313, 108168328, 108128679, 108081985, 108030987, 107976091, 107910144, 107829642, 107740223, 107643449, 107563305, 107533967, 107542074, 107554138, 107565534, 107597744, 107650566, 107689488, 107693899, 107664573, 107623661, 107612944, 107632077, 107634246, 107601559, 107552683, 107499886, 107441700, 107373583, 107297170, 107214785, 107117486, 106985557, 106817794, 106647646, 106481004, 106288290, 106066096, 105822992, 105551946, 105258405, 104973149, 104707372, 104428637, 104104185, 103745914, 103387511, 103028274, 102636075, 102186990, 101681745, 101135719, 100546074, 99877113, 99100929, 98216504, 97212857, 96062714, 94735706, 93199515, 91423565, 89361858, 86913842, 83877075, 79944271, 74752766, 68000489, 59739929, 50630981, 41760758, 34221807, 28910330, 26441991, 26950631, 30038854, 34925139, 40641049, 46228030, 50860995]
2865.6E0860995L227633K112782J915723K399803K670997K199066J173597L9429r27484
2883.9F5672541j663906k183258k507109k664822k700061k684873k702382k770645
2900.2D5795485k860272k985459l174836l408154l629983l789046l820756l624444
2916.6A8502535l117269k335135j418339n29206K63882R56865J542275K136470K818862
2934.9A8820940L466469L924425M121736L978732L411993K472025J423526O47745L71796
2953.3D2639387O38932J341843K231401L122926L912550M491204M761053M690486M360056
2971.6G2189838L881794L355324K862919K422934K040750J731855J467240J205289
2987.9I1157943R10598N56529J31291l98767j013136j604140k024037k085590j655710
$$ y = [50860995, 54088628, 56201410, 58117133, 60516936, 63187933, 65386999, 66560596, 66600025, 65672541, 64008635, 61825377, 59318268, 56653446, 53953385, 51268512, 48566130, 45795485, 42935213, 39949754, 36774918, 33366764, 29736781, 25947735, 22126979, 18502535, 15385266, 13050131, 11631792, 11102586, 11366468, 12323333, 13865608, 16002078, 18820940, 22287409, 26211834, 30333570, 34312302, 37724295, 40196320, 41619846, 42267591, 42639387, 43278319, 44620162, 46851563, 49974489, 53887039, 58378243, 63139296, 67829782, 72189838, 76071632, 79426956, 82289875, 84712809, 86753559, 88485414, 89952654, 91157943, 92068541, 92625070, 92756361, 92357594, 91344458, 89740318, 87716281, 85630691, 83974981]
3006.3H3974981p57760M24636J608229K524066L020888L081489K802181K334857J842737
3024.7A00856304J434374J098979Q20934O23823N08415M28009L20673K17593J81305
3043A06490409J95277K09630K02119J90282J79064J55687J37902J24764R4736O7019
3063.4A08046889O7580J08314J69038J90699J56069J04296P8404R2388J06299R4962
3083.8A09214938Q4567P3588P0738R2388Q6951L9029k789r645K862p892l2699j9169
3108.3A09592867L1352M4346P093k587K6584O4969Q9121P1525K8098m06J1754L3498
3132.8A09998214J2350l5584m8446j4770J7750K2709J1874j3793l9256j4782L6228
3155.2A09932494M9639L6454J7846J263j263j061j025R65m268j2695j7321j0562l94
$$ y = [83974981, 83217221, 83641857, 85250086, 87774152, 90795040, 93876529, 96678710, 99013567, 100856304, 102290678, 103389657, 104210591, 104834414, 105342829, 105770838, 106091511, 106309104, 106490409, 106685686, 106895316, 107097435, 107287717, 107466781, 107622468, 107760370, 107885134, 107979870, 108046889, 108114469, 108222783, 108391821, 108582520, 108738589, 108842885, 108921289, 109013677, 109119976, 109214938, 109299505, 109373093, 109443831, 109536219, 109623170, 109662199, 109659410, 109649765, 109652627, 109644735, 109612036, 109592867, 109624219, 109668565, 109675658, 109673071, 109699655, 109764624, 109853745, 109925270, 109953368, 109952962, 109964716, 109998214, 110010564, 109974980, 109926534, 109911764, 109929514, 109952223, 109964097, 109950304, 109911048, 109896266, 109932494, 109982133, 110018587, 110036433, 110037696, 110036433, 110035372, 110034347, 110035312, 110031044, 110018349, 110001028, 109990466, 109990072]
3181.7A09990072q023k0968j2231L075j967n102R036J4627K265q58J1980J0920L231
3208.2A09996057R012O926m864k694O449R501N853O80l493j3697l5000l9113L493L4857
3236.8A09973967J9372N841k98k4939l3509L659L0494J2886r822m578J5736K1326N615
3263.3A10015750j1516k6822m4596k6679J1230K6345L2818J9276r405k0814j3113m101
3287.8A09948373k7526n1450k5678J9085M3524K8884k3627o8355m5037K6917Q0419
3310.2A09905529Q8108N5599J9181J347n210k6428m5968m76O3061N8770J0527l8362
3334.7A10085678o4826l1769J8298K8897L4737J9920l3605l0422K9886L6215o628k9492
3359.1A10056889k2900j3471l6096o5828k9766N3370P3695K3210j860O044J3697J8633
$$ y = [109990072, 109982049, 109961081, 109948850, 109951925, 109949958, 109944856, 109953892, 109968519, 109970784, 109969926, 109981906, 109992826, 109996057, 110005069, 110011995, 110007131, 110004437, 110010886, 110020387, 110026240, 110026920, 110023427, 110009730, 109974730, 109935617, 109939110, 109973967, 109993339, 109999180, 109998882, 109973943, 109940434, 109944093, 109974587, 109987473, 109977651, 109973073, 109988809, 110010135, 110015750, 110004234, 109977412, 109932816, 109906137, 109917367, 109943712, 109976530, 109995806, 109986401, 109965587, 109952474, 109948373, 109920847, 109869397, 109843719, 109862804, 109906328, 109935212, 109911585, 109843230, 109798193, 109825110, 109905529, 109993637, 110049236, 110068417, 110069764, 110064554, 110038126, 109992158, 109991682, 110054743, 110113513, 110124040, 110085678, 110020852, 109989083, 110007381, 110036278, 110071015, 110090935, 110057330, 110026908, 110056794, 110093009, 110086381, 110056889, 110033989, 110020518, 109984422, 109918594, 109888828, 109942198, 110015893, 110039103, 110037243, 110043287, 110056984, 110075617]
3383.6A10075617J657m2594r0313p6031J6176N0331l5811q7511j383R3627N7828l0100
3408.1A09931493n1415k0754K5451M9913K1946j2517k6417m7230p8869r1911o2561
3430.5A09637129o4027j10757o1393O0081Q7560K0420m9209q3042p0357m9627n5253
3453A09261525o9392j05524j33550q0431o1846j89793k54607n2392K09200K17807M6504
3475.4A08787501q7857o2120J21927J70362L0374J0896Q6022M7910n5325r7239m5264
3497.8A08907187j1671m7361J0466R3055L4761r2184j87469j47855k8598K372o2907
3520.3A08469796j25658q4579J1646J8168k9433m8983n7673k8217L9398N6100L6037
3542.7A08256602N8472J12534J24097R4366Q8048R4199R4855R6488R8920J40714J93882
$$ y = [110075617, 110077274, 110034680, 109944367, 109868336, 109884512, 109934843, 109899032, 109811521, 109810138, 109903765, 109961593, 109931493, 109880078, 109859324, 109884775, 109934688, 109956634, 109944117, 109917700, 109870470, 109791601, 109699690, 109637129, 109573102, 109462345, 109400952, 109461033, 109548593, 109569013, 109519804, 109436762, 109366405, 109316778, 109261525, 109192133, 109086609, 108953059, 108872628, 108810782, 108620989, 108366382, 108313990, 108523190, 108740997, 108787501, 108699644, 108637524, 108759451, 108929813, 108960187, 108971083, 109057105, 109105015, 109049690, 108952451, 108907187, 108895516, 108848155, 108858621, 108951676, 108986437, 108894253, 108706784, 108558929, 108530331, 108532703, 108469796, 108344138, 108259559, 108271205, 108289373, 108259940, 108210957, 108153284, 108125067, 108164465, 108220565, 108256602, 108315074, 108427608, 108551705, 108646071, 108734119, 108828318, 108923173, 109019661, 109118581, 109259295, 109453177]
3565.1A09453177J42086K3949J9539P9631R3007O6579M1425L4630N3192R3090Q4007
3587.6A10184312k4355r3734p7200n8281k3174O2215J21283J38736J74046J89387J44101
3610A10737336R8455O7293N6732N8758J371l9804L0387J42610J51848k3460j23334
3632.4A11158192q5437l2401J848J3625L2425J06967J90949J21260p6378j21700o3694
3654.9A11245656n4920o6149j4532M4740P4994J15407J36411O7949K5177K8467n1176
3677.3A11552024r8956o1321o91N3131P2909M6300p259l4774j7392K4020O1417M8923
3701.8A11638331J777K6464J06919J21653N257r3639n5206K4450O7365N3645J0514
3724.2A11907530j6952J0956J00374J54936N6183j06143j15490J3208J30594J09362
$$ y = [109453177, 109595263, 109619212, 109638751, 109718382, 109811389, 109877968, 109919393, 109954023, 110007215, 110100305, 110184312, 110159957, 110066223, 109989023, 109930742, 109907568, 109969783, 110091066, 110229802, 110403848, 110593235, 110737336, 110835791, 110903084, 110959816, 111018574, 111019945, 110980141, 111010528, 111153138, 111304986, 111281526, 111158192, 111072755, 111040354, 111042202, 111055827, 111088252, 111195219, 111386168, 111507428, 111431050, 111309350, 111245656, 111190736, 111124587, 111110055, 111154795, 111229789, 111345196, 111481607, 111549556, 111574733, 111603200, 111552024, 111453068, 111391747, 111391056, 111444187, 111517096, 111563396, 111556137, 111521363, 111503971, 111527991, 111589408, 111638331, 111640108, 111666572, 111773491, 111895144, 111900401, 111806762, 111751556, 111776006, 111843371, 111897016, 111907530, 111890578, 111901534, 112001908, 112156844, 112213027, 112106884, 111991394, 112004602, 112135196, 112244558]
3744.6A12244558J0419K6608K0349r2876j10245m2665k1279l5012n00M8458M8554K349
3769.1A12098718m7636n1070j1515J4090Q190Q631Q893j0503l6811l3319K6035Q2934
3793.6A12056637Q2862O4540N9533J0312n3835m9031m3094m1246J9431R6690R7621
3816A12300420M7445J4329n3894r3568o0773p915M1890O6948N7471L2317m267n8043
3840.5A12282360q1909o7389k4092P1883J83535J58214j02508k11561r9551K7763P3147
3862.9A12209892L6371J7226J3327m1043q8239p2551j6367L1364K8503n556l4034k9146
3887.4A12049747n448k6071n4777j0371O4230P9918J1468p4614j03676p3302l4499
3909.8A11822605p200J8227L2783j872n0771k5833K2495L302k4450j6010l2603n4050
$$ y = [112244558, 112254977, 112281585, 112301934, 112209058, 112098813, 112056148, 112034869, 111999857, 111999357, 112047815, 112096369, 112098718, 112051082, 112000012, 111988497, 112002587, 112010777, 112019408, 112028301, 112017798, 111980987, 111947668, 111973703, 112056637, 112139499, 112204039, 112263572, 112273884, 112220049, 112171018, 112127924, 112086678, 112106109, 112202799, 112300420, 112347865, 112362194, 112308300, 112214732, 112153959, 112146044, 112187934, 112254882, 112312353, 112344670, 112340403, 112282360, 112200451, 112133062, 112108970, 112180853, 112364388, 112522602, 112420094, 112208533, 112108982, 112136745, 112209892, 112246263, 112263489, 112276816, 112235773, 112147534, 112074983, 112058616, 112089980, 112118483, 112112927, 112078893, 112049747, 112044299, 112018228, 111963451, 111953080, 112017310, 112097228, 112108696, 112034082, 111930406, 111857104, 111822605, 111815405, 111833632, 111866415, 111864543, 111813772, 111787939, 111810434, 111813736, 111789286, 111773276, 111740673, 111686623]
3934.3A11686623l7813k1911j0979m89r250j7572k1207l1436l2508j9467l970j871
3958.8A11478150j2159k6072l0994j4782m339j1873j6332j9109j9288j0324j1241k3699
3983.3A11277938j8716R5J443j8323k6035j4532j9896
3997.5A11181974
$$ y = [111686623, 111648810, 111626899, 111615920, 111615431, 111606181, 111588609, 111567402, 111535966, 111503458, 111483991, 111480021, 111478150, 111465991, 111439919, 111408925, 111394143, 111389804, 111377931, 111361599, 111342490, 111323202, 111312878, 111301637, 111277938, 111259222, 111259317, 111260760, 111242437, 111216402, 111201870, 111181974]
##END=$$ End of the data block
