##TITLE=$$ Begin of the data block
##JCAMP-DX=5.00 $$ ACD/SpecManager v 10.08
##SPECTROMETER/DATA SYSTEM=Alpha
##DATE=27 Jun 2014 15:13:00
##DATA TYPE=INFRARED SPECTRUM
##DATA CLASS=XYDATA
##ORIGIN=
##OWNER=
##NPOINTS=1667
##FIRSTX=599.63549805
##LASTX=3997.56909180
##MAXX=3997.56909180
##MINX=599.63549805
##MAXY=1.12525237
##MINY=0.11705908
##XFACTOR=1.0000000000
##YFACTOR=0.000000010000000
##FIRSTY=1.04290676
##DELTAX=2.03957605
##XUNITS=1/CM
##YUNITS=ARBITRARY UNITS
##XYDATA=(X++(Y..Y))
599.6A04290676m9102J62852K63357K29788J47009J63888K44296K41554J36864M0984
620A05872166L2509P0881R1529O7759J0049n2523r3413j14262j08552q3125p3814p0119
644.5A05549085o7019q9062j07908j16992j27530j29723j94729k95353l17585k27678
664.9A03875506j82104l79980m42898l84462m25971m50766m32515l93796l51393l37481
685.3A00094140l47746l58277l57509l70741m14705m80223n95337p89690j120210j583582
705.7I3676120j965994j966923j582688j195193j029717r09776n21588K24995J034904
724H5764140J535499J626682J477212J332480J284772J257646J188797J086789R83673
742.4I7537690Q69024P24644N73045M84627M66597L97873K71595K00915J91879K13182
$$ y = [104290676, 104241574, 104404426, 104667783, 104897571, 105044580, 105208468, 105452764, 105694318, 105831182, 105872166, 105904675, 105975556, 106067085, 106134844, 106144893, 106092370, 105998957, 105884695, 105776143, 105693018, 105619204, 105549085, 105482066, 105393004, 105285096, 105168104, 105040574, 104910851, 104716122, 104420769, 104103184, 103875506, 103693402, 103313422, 102870524, 102486062, 102060091, 101609325, 101176810, 100783014, 100431621, 100094140, 99746394, 99388117, 99030608, 98659867, 98245162, 97764939, 97169602, 96379912, 95259702, 93676120, 91710126, 89743203, 88160515, 86965322, 85935605, 85025829, 84504241, 84729236, 85764140, 87299639, 88926321, 90403533, 91736013, 93020785, 94278431, 95467228, 96554017, 97537690, 98406714, 99131358, 99704403, 100189030, 100655627, 101053500, 101325095, 101526010, 101717889, 101931071]
762.8A01931071K41244K07067J32918J12641J57130K07567K07805J76180J71447J83391
783.2A03728461J84405J84858J57464R7811M5836R930j0121m0269j01972j68955k09904
805.6A03877544j92368j30951j28448j79458j69146j23191j08564o2084L2449N0187
826A02865970m5621j71674k62701k70188j92428j01125o8629r0646r7049l7884N2690
848.5A01580715J26851J62649J21117L9637r227n2285j10031j61802k12670k59351
868.9A01225603k90823k88892j99855l3390J03092J51622J57381J75273J88959J48081
889.3A01337051M4322j27339l92544n26524k86233J4031R1266Q8358M8387m7683j07015
911.7A00136077q9061l7885j6796q7404k54816l74794k73466K4438L29572M17315K18082
$$ y = [101931071, 102172315, 102379382, 102512300, 102624941, 102782071, 102989638, 103197443, 103373623, 103545070, 103728461, 103912866, 104097724, 104255188, 104352999, 104398835, 104408765, 104398644, 104358375, 104256403, 104087448, 103877544, 103685176, 103554225, 103425777, 103246319, 103077173, 102953982, 102845418, 102783334, 102815783, 102865970, 102820349, 102648675, 102385974, 102115786, 101923358, 101822233, 101753604, 101662958, 101565909, 101528025, 101580715, 101707566, 101870215, 101991332, 102030969, 102021742, 101969457, 101859426, 101697624, 101484954, 101225603, 100934780, 100645888, 100446033, 100412643, 100515735, 100667357, 100824738, 101000011, 101188970, 101337051, 101381373, 101254034, 100861490, 100334966, 100048733, 100062764, 100154030, 100242388, 100290775, 100243092, 100136077, 100047016, 100009131, 99992335, 99904931, 99650115, 99275321, 99001855, 99026293, 99355865, 99773180, 99991262]
934.1I9991262l8677r2984L2395J29474J11317L1054p1633j78611k64740l00908k61265
956.6I9086684j52659l5900M1550N1904k641o4206j23435k10559k94489k59030o8223
979I7968996Q9067J03259J14363J96857K58410K14773R4199j210l7938q4758j74975
1001.4I8741043k60371l29954m07129l83276j32316J16330M0436k27428l55285k84583
1021.8I6517467j84005j54459j22202k4623N3043j8502k88313p34371j219398j316392
1042.2I2508245p32923L8266L97748M49842M50724L75855K37239J39320J01721R1362
1062.6I4057399P5930J6904q7422k04712l49730n54997q23164j117003j322609j375133
1083H8315463j343375j313258j305461j282697j214129j073927q06635m16476l165
$$ y = [99991262, 99952585, 99859601, 99891996, 100021470, 100132787, 100163841, 100092208, 99913597, 99648857, 99347949, 99086684, 98934025, 98898125, 98939675, 98991579, 98988938, 98924732, 98801297, 98590738, 98296249, 98037219, 97968996, 98058063, 98161322, 98275685, 98472542, 98730952, 98945725, 99039924, 99038714, 99000776, 98916018, 98741043, 98480672, 98150718, 97743589, 97360313, 97227997, 97344327, 97384763, 97157335, 96802050, 96517467, 96333462, 96179003, 96056801, 96032178, 96085221, 96066719, 95778406, 95044035, 93824637, 92508245, 91775322, 91813588, 92211336, 92661178, 93111902, 93487757, 93724996, 93864316, 93966037, 94057399, 94133329, 94150233, 94062811, 93858099, 93508369, 92953372, 92130208, 91013205, 89690596, 88315463, 86972088, 85658830, 84353369, 83070672, 81856543, 80782616, 79975981, 79559505, 79556340]
1101.4G9556340L20333M72820M11648J42812k23446m97371n26917k56299K32934P10631
1121.8H0343485R06062O35189m7934p80118j340675j906240k488291k772111k617765
1140.1F9931602k199965j772201j481062j342530j325166j365828j372278j266176
1156.4E7806396j029306p08020l75086r8377J19394L05658M88943P49427J092184J378661
1176.8E9729874J577819J760429J860958J806712J654810J478141J300413J144236
1193.1G2313392J048207J035148J058519J021803Q85737O84505M75425L04150J95975
1211.5G9022861J45632J26075Q8078j8978j79869l38978m46939m61453l96186l41606
1231.9G7198637l34472l06100j89024K0719K71415N08142O91134P83521P65270O58679
$$ y = [79556340, 79876673, 80349493, 80761141, 80903953, 80680507, 80183136, 79656219, 79399920, 79632854, 80343485, 81249547, 81884736, 81836802, 81056684, 79716009, 77809769, 75321478, 72549367, 69931602, 67731637, 65959436, 64478374, 63135844, 61810678, 60444850, 59072572, 57806396, 56777090, 56069070, 55693984, 55595607, 55715001, 56020659, 56509602, 57259029, 58351213, 59729874, 61307693, 63068122, 64929080, 66735792, 68390602, 69868743, 71169156, 72313392, 73361599, 74396747, 75455266, 76477069, 77362806, 78047311, 78522736, 78826886, 79022861, 79168493, 79294568, 79382646, 79363668, 79183799, 78844821, 78397882, 77936429, 77540243, 77198637, 76864165, 76558065, 76369041, 76389760, 76661175, 77169317, 77860451, 78643972, 79409242, 80067921]
1252.3H0067921N28735M39715M02337L85964L55613L02834K68477K88486L25186L17430
1272.7H3682698K77275K35176K09969K69300M55713O60658P14708N95611M20201K86674
1293.1H7807983K06888J43075Q5634J03867K30849L62467L87234L46392L30741L05426
1313.5I0310556K20805J31542J18362J93644K92528L45939L23856K20853N3239j31959
1333.9I2079365k87294m03738m53508l65520k43818k21789k51955k54464k28328k11125
1354.3H9157826j87308j08009l481K354r3150j47557j50639k09213n49769j152921
1374.7H6558133j168078j29831J154226J780463J771426J597553J260352Q13586M98819
1393I4136649L24554L36670N18621P18075Q24928P17735K40904m55040j156860j511085
$$ y = [80067921, 80596656, 81036371, 81438708, 81824672, 82180285, 82483119, 82751596, 83040082, 83365268, 83682698, 83959973, 84195149, 84405118, 84674418, 85130131, 85790789, 86505497, 87101108, 87521309, 87807983, 88014871, 88157946, 88243580, 88347447, 88578296, 88940763, 89327997, 89674389, 90005130, 90310556, 90531361, 90662903, 90781265, 90974909, 91267437, 91613376, 91937232, 92158085, 92211324, 92079365, 91792071, 91388333, 90934825, 90569305, 90325487, 90103698, 89851743, 89597279, 89368951, 89157826, 88970518, 88862509, 88859028, 88861382, 88768232, 88620675, 88470036, 88260823, 87711054, 86558133, 85390055, 85260224, 86414450, 88194913, 89966339, 91563892, 92824244, 93637830, 94136649, 94461203, 94797873, 95316494, 96034569, 96859497, 97577232, 97818136, 97363096, 96206236, 94695151]
1413.4I4695151j253605n90640J67894N63753M33802m7260o77216j302719j600391
1431.8I0388769j470775j516246j577556j223511j055336j074213j103651j317781
1448.1H0049700j649660j973623k113551k099192j559806p13593o46138r24731K37042
1466.4F8606448L339344O672198Q686787O642395L394956K026248J571816J291823
1482.8A02232015J004863Q13579O52242L93129J90842R9075r5046k39730N0652M61686
1503.2A05563307P21538O17635J40798Q226P9846J39272J33670J09362P9727m720l4249
1525.6A07554412k8932j7023L8099L2914k539Q2933J14024j35541k71380k26235j34707
1548A07006025m6682K9600J27911K37906K98703L481j92070q8763K1386J03986R3174
$$ y = [94695151, 93441546, 92850906, 93018800, 93582553, 94016355, 93969095, 93291879, 91989160, 90388769, 88917994, 87401748, 85824192, 84600681, 83545345, 82471132, 81367481, 80049700, 78400040, 76426417, 74312866, 72213674, 70653868, 69940275, 69294137, 68369406, 68606448, 71945792, 78617990, 87304777, 93947172, 97342128, 99368376, 100940192, 102232015, 103236878, 104050457, 104702699, 105095828, 105286670, 105385745, 105290699, 105050969, 105101621, 105563307, 106284845, 106902480, 107043278, 107051504, 107131350, 107270622, 107404292, 107513654, 107593381, 107588661, 107554412, 107525480, 107508457, 107546556, 107579470, 107576931, 107659864, 107773888, 107638347, 107366967, 107140732, 107006025, 106959343, 106988943, 107116854, 107354760, 107653463, 107656944, 107464874, 107376111, 107397497, 107501483, 107594657]
1570.5A07594657L8361P8118P1049m7266n3311j1575k456j049M137N72j1957l5011
1594.9A07624269o5029q6439j05881r8086m1306L9458O5375L9053L9458O3944j4460
1617.4A07460356j10209p6521q2040j30808j14524n8830J1885P8523l7169k97797l67904
1639.8A06274962l41653k70737k44796k62880j39237p6615l86608m40383k31636j05965
1660.2A03774452j05428j92190j69158j05822j8990J70839L77977L75414K35903J86503
1680.6A04529500J38843j35851l62277l62086m13919m06921n46360p58862r52625j332766
1701I9396676j237518j177579j378894j256025j037639r81170j263815k196807k810538
1719.3H6056691k777814l260416l986949m500312n067038n665714p620209q159819
$$ y = [107594657, 107633018, 107711136, 107782185, 107734919, 107681608, 107670033, 107667577, 107666528, 107670665, 107671237, 107659280, 107624269, 107559240, 107472801, 107366920, 107268834, 107227528, 107266986, 107332361, 107371414, 107410872, 107474816, 107460356, 107350147, 107273626, 107191586, 107060778, 106946254, 106887424, 106899309, 106977832, 106940663, 106642866, 106274962, 105933309, 105662572, 105417776, 105154896, 105015659, 104939044, 104552436, 104112053, 103880417, 103774452, 103669024, 103476834, 103307676, 103201854, 103182864, 103353703, 103731680, 104107094, 104342997, 104529500, 104668343, 104532492, 104170215, 103808129, 103394210, 102987289, 102440929, 101682067, 100729442, 99396676, 98159158, 96981579, 95602685, 94346660, 93309021, 92327851, 91064036, 88867229, 86056691, 83278877, 80018461, 76031512, 71531200, 66464162, 60798448, 53178239, 45018420]
1735.7D5018420o022087n458379m638708k659255p52318J292771L918815O541702P925114
1754D5166075R269029J0031408R114343Q058626O124997M212135L233903K480811J913989
1772.4I9605316J368099R48799P82001O92082N73265M94802M25446M11141M05717L41654
1792.8A06048322K45142K27844K33579J95003J63006J58382J84619J82617J56200J12200
1813.2A07906914J10590J22798J25360J39177J49214J27578R7168P6627K0731K8765
1833.6A08904922O3896O9344P1025J00792Q8441J0169j3030L254K3651K5571K0945
1856A09368980J8084K4998K4009L6263O1894L3259l9863n3966j1826Q655P772J204
1880.5A09479463J3268K4223L2032K7394j836o222K241J776M53j228r417o593L922
$$ y = [45018420, 38996333, 33537954, 28899246, 26239991, 25487673, 26780444, 30699259, 37240961, 45166075, 54435104, 64466512, 73580855, 81639481, 87764478, 91976613, 95210516, 97691327, 99605316, 100973415, 101922214, 102704215, 103396297, 103969562, 104464364, 104889810, 105300951, 105706668, 106048322, 106293464, 106521308, 106754887, 106949890, 107112896, 107271278, 107455897, 107638514, 107794714, 107906914, 108017504, 108140302, 108265662, 108404839, 108554053, 108681631, 108778799, 108855426, 108876157, 108904922, 108968818, 109038162, 109109187, 109209979, 109298420, 109308589, 109295559, 109298813, 109322464, 109348035, 109368980, 109387064, 109412062, 109436071, 109472334, 109534228, 109567487, 109527624, 109473658, 109461832, 109470487, 109478259, 109479463, 109492731, 109516954, 109548986, 109576380, 109574544, 109568322, 109570563, 109572339, 109572792, 109571564, 109562147, 109555554, 109559476]
1907A09559476Q703k003q416M232L719j6880k1219j6427k4355j4913l660k455k170
1933.5A09463632r77L552J2088J1849r513j5902l600P581J2196J5187J2469J538o425
1960A09503675k981O843P892K729k861m088l398l278o104l874M411P605P046P081L481
1990.6A09524179j2267j7369n352p2k158L279Q237j276j2254j5021j0681o282j1778
2017.1A09441185j9264j5342r191p058Q11J1909J8287K0349K0134K0349K3329K5595
2041.6A09531093K2447J9920K4187L1305L1185K2459J4126J3649J8621K3806K8002
2064A09780800K4331J9991K0659K1565J8335J2922J7023K4533L0625L6645L5381K7669
2088.5A10070479K5570K7860K3114J6713K0755K4783K2686K5594K3651J2660P439J8239
$$ y = [109559476, 109568179, 109566176, 109557760, 109561992, 109565711, 109548831, 109527612, 109511185, 109486830, 109471917, 109468257, 109465802, 109463632, 109462655, 109466207, 109478295, 109490144, 109480631, 109464729, 109461129, 109468710, 109480906, 109496093, 109508562, 109510100, 109503675, 109500694, 109507537, 109515429, 109518158, 109515297, 109511209, 109507811, 109504533, 109498429, 109494555, 109498966, 109506571, 109513617, 109520698, 109524179, 109511912, 109494543, 109489191, 109489119, 109486961, 109490240, 109498477, 109497201, 109484947, 109469926, 109459245, 109452963, 109441185, 109421921, 109406579, 109397388, 109390330, 109391141, 109403050, 109421337, 109441686, 109461820, 109482169, 109505498, 109531093, 109553540, 109573460, 109597647, 109628952, 109660137, 109682596, 109696722, 109710371, 109728992, 109752798, 109780800, 109805131, 109825122, 109845781, 109867346, 109885681, 109898603, 109915626, 109940159, 109970784, 110007429, 110042810, 110070479, 110096049, 110123909, 110147023, 110163736, 110184491, 110209274, 110231960, 110257554, 110281205, 110293865, 110301304, 110319543]
2113A10319543L0815K6358J4841J2470J4805J3030P915K051L171O258K218o605q726
2139.5A10438144l183o342j4543j0252J43K229k622j3292j5402n305j049j323L218
2166A10370421R072J2458J2207L969r77J180J240K920N651R54m185j812K671N257K932
2196.6A10423958p569j5426m518P188k360j5545j3876j1873j6344q392m89j4055k4569
2223.1A10296130j6069j2160j5032j5950j9157k0897j8514j8692k2804k4772k4855
2245.6A10087228k0409j5473j7071j8501j7548j6033j3721j7024k7835k7454j0240
2268A09885919l660j0573j2017p927o354j7321k9493k4139j2184j0156j2267r763n615
2294.5A09724450N13O973N401M124J8704L4738L6311L7348L9590M9793Q1218J00374
$$ y = [110319543, 110350358, 110376716, 110391557, 110404027, 110418832, 110431862, 110439777, 110441828, 110444999, 110451257, 110453475, 110446870, 110438144, 110434961, 110428619, 110414076, 110403824, 110403967, 110406196, 110403574, 110390282, 110374880, 110369575, 110368526, 110367203, 110370421, 110379493, 110391951, 110404158, 110408127, 110407150, 110408330, 110409570, 110412490, 110418141, 110419095, 110414910, 110413098, 110415769, 110421026, 110423958, 110416389, 110400963, 110396445, 110403633, 110401273, 110385728, 110371852, 110359979, 110343635, 110335243, 110334754, 110320699, 110296130, 110280061, 110267901, 110252869, 110236919, 110217762, 110196865, 110178351, 110159659, 110136855, 110112083, 110087228, 110066819, 110051346, 110034275, 110015774, 109998226, 109982193, 109968472, 109951448, 109923613, 109896159, 109885919, 109882259, 109871686, 109859669, 109851742, 109845388, 109828067, 109798574, 109774435, 109762251, 109752095, 109739828, 109730065, 109724450, 109724963, 109731936, 109737337, 109741461, 109760165, 109794903, 109831214, 109868562, 109908152, 109957945, 110039163, 110139537]
2319A10139537Q7571P0429P0584Q7344R3448P2551N0807M5932M1222K7216l672o8831
2343.5A10714138j66357j62828O938K17497L22903K72810J84441R8121j1826j02865
2363.8A11372972j52183j88530k16352k25997k15936j74403j23597r1981o6722m2152
2384.2A09875119k3473o842O151J2887J7929K3257K3258J8072J3316P772N329J5557
2408.7A09988332L0446L4237K7609J9908J7118K0242K4187K5535K5070K2745K2101
2431.2A10257530K5618K6369K2471K0087K1803K3163J9073J6201K3711L2246K7084
2453.6A10515356J7870J0812N591J4317K3865J8228J4317K0730K6870J8918L851O771
2478.1A10697496K1517K0218J764o306k38j311n389K098J1170O271m518n460j323m614
$$ y = [110139537, 110227108, 110297537, 110368121, 110455465, 110548913, 110621464, 110672271, 110718203, 110759425, 110786641, 110782969, 110714138, 110547781, 110384953, 110391891, 110609388, 110932291, 111205101, 111389542, 111487663, 111475837, 111372972, 111220789, 111032259, 110815907, 110589910, 110373974, 110199571, 110075974, 109983993, 109917271, 109875119, 109851646, 109844804, 109850955, 109863842, 109881771, 109905028, 109928286, 109946358, 109959674, 109967446, 109972775, 109988332, 110018778, 110053015, 110080624, 110100532, 110117650, 110137892, 110162079, 110187614, 110212684, 110235429, 110257530, 110283148, 110309517, 110331988, 110352075, 110373878, 110397041, 110416114, 110432315, 110456026, 110488272, 110515356, 110533226, 110544038, 110549629, 110563946, 110587811, 110606039, 110620356, 110641086, 110667956, 110686874, 110690725, 110697496, 110719013, 110739231, 110740995, 110734689, 110734451, 110733140, 110727751, 110729849, 110741019, 110747290, 110742772, 110737312, 110735989, 110731375]
2506.6A10731375r465j2279j5842j5235j6964k2602j9228j1087j0109j1158j0943j2183
2531.1A10564280q214J299R382R418q345k3675j0776M804j324j3327j9229k4831k7227
2557.6A10452235k8897l1328k5379k0063k5726m0126m9901m2116k9540l2485m2736
2580A10083938m4394m3821m7660n1355m9627m0448l4487l7945l9756m2522m6420m4012
2604.5A09561491m5037n0569m9782m7099n3382n5576n2249o2013p0202o3312n5933
2626.9A08956337n7125o0487n9426m9507l6335l3462l6669m1819m7064m9114n8079
2649.4A08427250o9892p2205p6473q7643r7858j05715j02175r2101q1062o1452m0198
2671.8A07540476k3758k0897k9660j7071K4605M9937M3535L8529N0163O1905N9700
$$ y = [110731375, 110721910, 110709631, 110693789, 110678554, 110661590, 110638988, 110619760, 110608673, 110598564, 110587406, 110576463, 110564280, 110556066, 110557365, 110566747, 110576165, 110567820, 110544145, 110533369, 110538173, 110536849, 110523522, 110504293, 110479462, 110452235, 110423338, 110392010, 110366631, 110346568, 110320842, 110280716, 110230815, 110188699, 110159159, 110126674, 110083938, 110039544, 109995723, 109948063, 109896708, 109847081, 109806633, 109772146, 109734201, 109694445, 109651923, 109605503, 109561491, 109516454, 109465885, 109416103, 109369004, 109315622, 109260046, 109207797, 109145784, 109075582, 109012270, 108956337, 108899212, 108838725, 108779299, 108729792, 108693457, 108659995, 108623326, 108581507, 108534443, 108485329, 108427250, 108357358, 108285153, 108208680, 108121037, 108023179, 107917464, 107815289, 107723188, 107642126, 107580674, 107540476, 107516718, 107495821, 107466161, 107449090, 107473695, 107523632, 107567167, 107605696, 107655859, 107717764, 107777464]
2694.3A07777464N1368M0817L1876K7967J4555r381k4200k8384l3283m1199m4310m2820
2718.7A07720470n3286p3528q2779o0594j5057J8836L1113L2890M3380O0714N5015
2741.2A07677174K5963n388j7524O20K2674J6868p415k6321l6907m0353m6289n6207
2765.6A07506895n7757p0011j15824j59359j55986j46222j74009k11251k37382k60555
2786A05918539k75433k69640k59769k71094l07345l40271l52061l69120l98790m41635
2806.4A02633381n04899n55146n95355o77967p91967r02420j020324j164878j345515
2824.8I5074910j560628j806021k096433k479857l061920l956467n212146o755650
2841.1F8145788q225507r030789q779335p466033n258310k439102N00696L050921M837295
$$ y = [107777464, 107828832, 107869649, 107901525, 107929492, 107944047, 107934666, 107910466, 107882082, 107848799, 107807600, 107763290, 107720470, 107667184, 107593656, 107510877, 107450283, 107435226, 107454062, 107485175, 107518065, 107561445, 107622159, 107677174, 107703137, 107697749, 107680225, 107680845, 107703519, 107720387, 107712972, 107686651, 107649744, 107609391, 107563102, 107506895, 107449138, 107379127, 107263303, 107103944, 106947958, 106801736, 106627727, 106416476, 106179094, 105918539, 105643106, 105373466, 105113697, 104842603, 104535258, 104194987, 103842926, 103473806, 103075016, 102633381, 102128482, 101573336, 100977981, 100300014, 99508047, 98605627, 97585303, 96420425, 95074910, 93514282, 91708261, 89611828, 87131971, 84070051, 80113584, 74901438, 68145788, 59920281, 50889492, 42110157, 34644124, 29385814, 26946712, 27447408, 30498329, 35335624]
2859.5C5335624N667120N544824M599899L203124K096700J905138K386391K657920
2875.8F3396740K192807J172370L5655r38397j677555k187628k490377k638984k685833
2894.1E4178798k687245k700919k738843k810570k946574l143441l366885l584689
2910.4C0199632l750336l780294l580561l087234k329561j427907n37831K62706R58719
2928.8A2927333J542875K134657K802325L420513L866547M078767L946373L379920
2945.1C8099310K450579J417646O43837L63207O25003J321616K210129L097257L881818
2963.5E4110402M469412M750807M684686M354555L882020L367365K881437K441955
2979.8H4942639K053600J737190J467579J202047R13483N65022J24008m25726j039499
$$ y = [35335624, 41002744, 46547568, 51147467, 54350591, 56447291, 58352429, 60738820, 63396740, 65589547, 66761917, 66797572, 65859175, 64181620, 61993992, 59503615, 56864631, 54178798, 51491553, 48790634, 46051791, 43241221, 40294647, 37151206, 33784321, 30199632, 26449296, 22669002, 19088441, 16001207, 13671646, 12243739, 11705908, 11968614, 12927333, 14470208, 16604865, 19407190, 22827703, 26694250, 30773017, 34719390, 38099310, 40549889, 41967535, 42611372, 42974579, 43599582, 44921198, 47131327, 50228584, 54110402, 58579814, 63330621, 68015307, 72369862, 76251882, 79619247, 82500684, 84942639, 86996239, 88733429, 90201008, 91403055, 92316538, 92881560, 93005568, 92579842, 91540343]
2998.1I1540343j625282k044350k104586j670039p57921M38470J630610K546668L027511
3016.5I0981424L072393K792740K331060J838559J423192J080990P96747N98192M89378
3034.9A05404675M10616K96855J90521J51157J66380J91641J85550J71399J67906J46091
3055.3A07482791J16086R6118P8702O3575O3169J00398J59168J75285J34468Q6475
3075.7A08556235P3826R4748J02448Q3912P4899O4611N7149P7248P7915L7730l922
3098.1A09296799j4210l481j2922l6466k3198L0648M9389J2660n961K2042P1144R8085
3122.6A09484529P4494L0494N210J3077L4916K0576k7085m0304n257K1374K2888K4331
3147A09659243O818k4807k50N6135O5542M1914J8835J0526K1970K2984N340K873J4198
$$ y = [91540343, 89915061, 87870711, 85766125, 84096086, 83338165, 83776635, 85407245, 87953913, 90981424, 94053817, 96846557, 99177617, 101016176, 102439368, 103520358, 104317105, 104915297, 105404675, 105815291, 106112146, 106302667, 106453824, 106620204, 106811845, 106997395, 107168794, 107336700, 107482791, 107598877, 107694995, 107773697, 107837272, 107900441, 108000839, 108160007, 108335292, 108469760, 108556235, 108630061, 108724809, 108827257, 108911169, 108986068, 109050679, 109107828, 109185076, 109262991, 109300721, 109296799, 109282589, 109279108, 109266186, 109229720, 109206522, 109237170, 109286559, 109299219, 109293258, 109315300, 109386444, 109484529, 109559023, 109589517, 109594727, 109607804, 109642720, 109663296, 109636211, 109595907, 109590650, 109612024, 109634912, 109659243, 109666061, 109641254, 109641004, 109697139, 109762681, 109804595, 109823430, 109833956, 109855926, 109878910, 109884250, 109887123, 109901321]
3173.5A09901321J2684J907M578J7726J2207l719j788R191J2553J8918L2020L2365
3198A10049963J5664M029J1480K3163K8777K9766J8668O426J2028J7142R537P343J7727
3224.5A10251713J7702n447l1758k9623K3341O7270M5776O485j0169j6152o533L0875
3249A10343480M8006J9741m983L850K2662K1136K110j2553k5725l9411j4687K6477
3273.5A10390103L9410M6158L4809J479j0765l111m387k8563m8959l0589J4961N5873
3298A10456419M3249k6512p6330n0592K6548Q1300P3815M1270K4200J1265m935l2115
3322.4A10567582n4574j8204L6741L7205N937l7623q5008o2561J573J8073K6655J6224
3346.9A10452020m0996l5381K7442K2340l2342m8399k4223j7750n8246r3389n5122
$$ y = [109901321, 109914005, 109915912, 109920490, 109938216, 109950423, 109946704, 109944916, 109954107, 109966660, 109985578, 110017598, 110049963, 110065627, 110069656, 110081136, 110104299, 110133076, 110162842, 110181510, 110187936, 110199964, 110217106, 110226643, 110233986, 110251713, 110269415, 110263968, 110232210, 110202587, 110225928, 110293198, 110338974, 110345459, 110335290, 110319138, 110312605, 110343480, 110391486, 110411227, 110406244, 110410094, 110432756, 110453892, 110456002, 110443449, 110417724, 110378313, 110363626, 110390103, 110429513, 110475671, 110510480, 110511959, 110501194, 110498083, 110493696, 110465133, 110416174, 110385585, 110400546, 110456419, 110499668, 110473156, 110396826, 110346234, 110372782, 110454082, 110527897, 110569167, 110593367, 110604632, 110599697, 110567582, 110513008, 110494804, 110531545, 110568750, 110574687, 110537064, 110452056, 110389495, 110391068, 110409141, 110435796, 110452020, 110411024, 110375643, 110403085, 110425425, 110393083, 110344684, 110320461, 110302711, 110244465, 110151076, 110095954]
3369.3A10095954L9911P9036K5904j8108j6188j0205j1813k4021o0737j04320q9610
3391.8A09905803p248K5797n2225j03462j5545Q6713M8077n1582o7508k1362J3411
3414.2A09760869J6951j001j3352k4330n5051r5391j10579q3256q6069j16396n3036
3436.7A09139359O4003R2459J8799p1012j06991q2767n1772n1892o8510j05297j39773
3459.1A08636606j04368q9633j95134k41184m9711J96171K03574L5941r1898m8566
3479.5A08251798J48046J79887K5272J0288Q5175M5788n5432r2685l6109j1873n6398
3501.9A08493757J1719J03986L8540r3567j77455j28913j4842O891n9128j15287p6604
3524.4A07989097J0192J5509k6893l4774k7919j0800L2759O0439N5265P4709J23274
$$ y = [110095954, 110135865, 110214901, 110240805, 110222697, 110206509, 110196304, 110184491, 110160470, 110099733, 109995413, 109905803, 109898555, 109924352, 109872127, 109768665, 109753120, 109839833, 109887910, 109836328, 109768820, 109747458, 109760869, 109777820, 109776819, 109763467, 109739137, 109684086, 109588695, 109478116, 109394860, 109308791, 109192395, 109139359, 109203362, 109295821, 109314620, 109243608, 109136617, 109053850, 109002078, 108950186, 108881676, 108776379, 108636606, 108532238, 108442605, 108247471, 108006287, 107956576, 108152747, 108356321, 108392262, 108300364, 108251798, 108399844, 108579731, 108605003, 108615291, 108700466, 108746254, 108690822, 108598137, 108562028, 108550155, 108493757, 108505476, 108609462, 108648002, 108554435, 108376980, 108248067, 108233225, 108240116, 108180988, 108065701, 107989097, 107999289, 108014798, 107987905, 107953131, 107925212, 107914412, 107947171, 108007610, 108062875, 108137584, 108260858]
3546.8A08260858J32048J11222J12546J14977J08004R7370R9897J64187K23136J46413
3567.2A09570658K6334L8576R6798J02901P3016N2118N6636P7117J07384Q4388k1410
3589.6A10264516o6137m2093m4549k4116O6757J41359J67370J95253K02035J42837
3610A11003232Q5902P4399Q6629Q3470J3745k9647M6992J65475J63746j9563j06859
3632.4A11567521p1442l5608o270K2709O1464J38975K13146J04809j22357j24228l2162
3654.9A11716557l5859o8342j4401N9605R3567J23596J31774P5412M7732K0182r1946
3677.3A12057877j24371n9963K0302P1561O7902L9386m184m6158k6667K5880N7793
3699.8A12079358M8030J3208L2270Q9490Q8418k3985j09685n8066K1243N6946N1916
$$ y = [108260858, 108392906, 108504128, 108616674, 108731651, 108839655, 108937025, 109036922, 109201109, 109424245, 109570658, 109596992, 109635568, 109732366, 109835267, 109908283, 109960401, 110017037, 110094154, 110201538, 110285926, 110264516, 110198379, 110156286, 110111737, 110087621, 110154378, 110295737, 110463107, 110658360, 110860395, 111003232, 111089134, 111163533, 111250162, 111333632, 111347377, 111317730, 111364722, 111530197, 111693943, 111674380, 111567521, 111496079, 111460471, 111454201, 111476910, 111538374, 111677349, 111890495, 111995304, 111872947, 111748719, 111716557, 111680698, 111612356, 111597955, 111657560, 111751127, 111874723, 112006497, 112081909, 112129641, 112149823, 112057877, 111933506, 111873543, 111893845, 111965406, 112033308, 112072694, 112068510, 112022352, 111995685, 112021565, 112079358, 112127388, 112140596, 112172866, 112262356, 112350774, 112326789, 112217104, 112159038, 112180281, 112237227, 112289143]
3722.2A12289143J4984k8407r501Q3148J37985L7885j14060r9718K3710J00231N7257
3744.6A12492657q369J4746k2816j27840j14191m4429k8312m6099k4366J6594L1769
3767.1A12139344M935n3882o9773k3127J0026m757j8096j2660j9240m2987m6635K015
3791.5A11865163N8663P6532O8522N9688J0287o5398p3814o7175n3250J3125Q1276
3814A11973619P1443K0229L6n4312r4318o7186k0790K7382M9519M0031L5489J5461
3838.4A11996603m8661r2435r2256m4692O4099J91903J88720r5355k31814j03772L7086
3860.9A11769426R1183M7529R608O187m1115p2897m7922m411L4297J7571j9788j8537
3885.4A11771131j288J3518j0061n0413k1244N0986P5496K7859l8874r3246r3079m0817
$$ y = [112289143, 112304127, 112275720, 112266219, 112349367, 112487352, 112525237, 112411177, 112311459, 112335169, 112435400, 112492657, 112484288, 112499034, 112476218, 112348378, 112234187, 112189758, 112161446, 112115347, 112090981, 112107575, 112139344, 112144279, 112090397, 112020624, 111997497, 112007523, 112002766, 111984670, 111972010, 111952770, 111909783, 111863148, 111865163, 111923826, 112000358, 112068880, 112128568, 112138855, 112073457, 111999643, 111932468, 111879218, 111892343, 111973619, 112045062, 112065291, 112065327, 112011015, 111916697, 111849511, 111828721, 111856103, 111905622, 111945653, 111981142, 111996603, 111947942, 111855507, 111763251, 111718559, 111782658, 111974561, 112163281, 112067926, 111836112, 111732340, 111769426, 111860609, 111908138, 111917746, 111923933, 111882818, 111809921, 111761999, 111757588, 111791885, 111809456, 111789668, 111771131, 111769843, 111783361, 111773300, 111722887, 111701643, 111752629, 111828125, 111855984, 111817110, 111723864, 111630785, 111589968]
3909.8A11589968M89J7774L8552K7812j7667j5497J3244L481k945J6356n329m3869
3934.3A11622369k7823n96Q845J6689J0384j0038l0041l3640j5212K230R644R679J193
3960.8A11563683o772n066k38j514K193O426j67l887n197j2803j2160M232J7524Q762
3989.4A11555016k3186m0150j3983J8155
3997.5A11495852
$$ y = [111589968, 111590457, 111608231, 111646783, 111674595, 111656928, 111641431, 111654675, 111658156, 111655211, 111671567, 111666238, 111622369, 111594546, 111593950, 111602795, 111619484, 111629868, 111619830, 111589789, 111556149, 111540937, 111543167, 111552811, 111562490, 111563683, 111556911, 111551845, 111551607, 111550093, 111552286, 111558712, 111558545, 111554658, 111549461, 111536658, 111524498, 111528730, 111546254, 111555016, 111531830, 111491680, 111477697, 111495852]
##END=$$ End of the data block
