##TITLE=$$ Begin of the data block
##JCAMP-DX=5.00 $$ ACD/SpecManager v 10.08
##SPECTROMETER/DATA SYSTEM=Alpha
##DATE=27 Jun 2014 15:13:00
##DATA TYPE=INFRARED SPECTRUM
##DATA CLASS=XYDATA
##ORIGIN=
##OWNER=
##NPOINTS=1667
##FIRSTX=599.63549805
##LASTX=3997.56909180
##MAXX=3997.56909180
##MINX=599.63549805
##MAXY=1.12190449
##MINY=0.12146112
##XFACTOR=1.0000000000
##YFACTOR=0.000000010000000
##FIRSTY=1.04260957
##DELTAX=2.03957605
##XUNITS=1/CM
##YUNITS=ARBITRARY UNITS
##XYDATA=(X++(Y..Y))
$$ plain form
599.6 104260957 104217219 104399002 104653215 104848492 104996693 105174828 105404019 105629694 105761731 105794358
620 105794358 105824018 105881798 105933666 105961418 105960870 105929673 105851352 105727196 105600846 105495167 105397058 105303168
644.5 105303168 105203283 105081058 104968750 104885793 104778099 104608023 104356170 104032099 103710687 103497100
664.9 103497100 103336263 102943718 102468812 102075624 101645041 101177740 100743783 100367141 100010490 99641490
685.3 99641490 99273807 98922724 98577118 98215765 97822064 97361797 96765453 95961487 94835049 93258107
705.7 93258107 91309518 89367700 87809134 86631924 85613149 84715950 84202373 84409744 85409313
724 85409313 86916661 88535327 90023535 91364044 92643946 93897021 95072299 96136153 97115457
742.4 97115457 97999704 98736441 99324512 99832535 100296628 100664032 100923717 101138926 101343584 101563203
$$ packed form
599.6A04260957m3738J81783K54213J95277J48201J78135K29191K25675J32037L2627
620A05794358K9660N7780N1868K7752n48l1197p8321j24156j26350j05679r8109r3890
644.5A05303168r9885j22225j12308q2957j07694j70076k51853l24071l21412k13587
664.9A03497100j60837l92545m74906l93188m30583m67301m33957l76642l56651l69000
685.3I9641490l67683l51083l45606l61353l93701m60267n96344q03966j126438j576942
705.7I3258107j948589j941818j558566j177210j018775q97199n13577K07371R99569
724H5409313J507348J618666J488208J340509J279902J253075J175278J063854R79304
742.4I7115457Q84247P36737N88071N08023M64093L67404K59685K15209K04658K19619
$$ plain form
762.8 101563203 101803112 101999521 102127051 102244365 102416337 102645850 102868140 103059483 103256476 103452778
783.2 103452778 103634202 103819740 103980064 104083300 104148495 104177368 104170465 104137743 104052687 103888714 103680265
805.6 103680265 103506398 103396308 103280127 103120220 102980137 102876854 102777374 102732444 102782881 102841687
826 102841687 102799618 102617800 102341461 102072966 101898432 101821876 101761961 101669073 101580155 101544631 101599157
848.5 101599157 101751268 101941407 102077234 102127779 102128804 102093709 102004540 101847732 101623118 101354825 101062191
870.9 101062191 100776136 100597930 100594056 100704920 100848770 101003301 101181400 101379430 101550090 101621389
891.3 101621389 101508594 101116121 100574803 100262475 100263834 100368357 100477648 100537550 100491190 100378335
911.7 100378335 100281894 100243938 100229430 100137961 99872476 99480397 99191862 99213165 99544656 99968362 100198376
$$ packed form
762.8A01563203K39909J96409J27530J17314J71972K29513K22290J91343J96993J96302
783.2A03452778J81424J85538J60324J03236O5195K8873o903l2722q5056j63973k08449
805.6A03680265j73867j10090j16181j59907j40083j03283r9480m4930N0437N8806
826A02841687m2069j81818k76339k68495j74534p6556n9915r2888q8918l5524N4526
848.5A01599157J52111J90139J35827N0545J025l5095q9169j56808k24614k68293k92634
870.9A01062191k86055j78206l874J10864J43850J54531J78099J98030J70660P1299
891.3A01621389j12795l92473n41318l12328J359J04523J09291N9902m6360j12855
911.7A00378335r6441l7956j4508r1469k65485l92079k88535K1303L31491M23706K30014
$$ plain form
934.1 100198376 100161970 100062299 100093353 100226617 100336993 100353825 100259972 100068271 99799109 99489677 99219638
956.6 99219638 99062824 99019492 99050295 99097204 99089336 99011832 98875749 98654538 98347497 98081964 98009741
979 98009741 98086244 98176718 98283106 98470092 98720527 98930043 99017018 99013203 98975021 98881292 98686284
1001.4 98686284 98397368 98043251 97624862 97237337 97103119 97217548 97254246 97013915 96637642 96340501
1021.8 96340501 96149760 95987666 95861280 95827836 95863736 95836288 95553344 94818783 93590301 92267901
1042.2 92267901 91528755 91556168 91944069 92390102 92835021 93205786 93446606 93587863 93685693 93772703
1062.6 93772703 93839657 93844020 93752974 93549234 93191123 92618048 91784400 90681440 89379287 88011080
1083 88011080 86677158 85381454 84088820 82815707 81608737 80538321 79735833 79321474 79315251
$$ packed form
934.1A00198376l6406r9671L1054J33264J10376J6832r3853j91701k69162l09432k70039
956.6I9219638j56814m3332L0803M6909p868p7504j36083k21211l07041k65533p2223
979I8009741P6503R0474J06388J86986K50435K09516Q6975l815l8182r3729j95008
1001.4I8686284k88916l54117m18389l87525j34218J14429L6698k40331l76273k97141
1021.8I6340501j90741j62094j26386l3444L5900k7448k82944p34561j228482j322400
1042.2I2267901p39146K7413L87901M46033M44919L70765K40820J41257R7830Q7010
1062.6I3772703O6954M363r1046k03740l58111n73075q33648j102960j302153j368207
1083H8011080j333922j295704j292634j273113j206970j070416q02488m14359o223
$$ plain form
1101.4 79315251 79632330 80107659 80525953 80673963 80451363 79951286 79423130 79169363 79400015 80101377
1121.8 80101377 81000590 81633389 81590670 80828601 79513824 77630681 75153732 72388297 69792902
1140.1 69792902 67629069 65885186 64418185 63077819 61752629 60394126 59031868 57778019
1156.4 57778019 56762552 56062800 55690259 55594414 55715561 56019360 56501013 57233703 58309567 59684986
1176.8 59684986 61260939 63005340 64845610 66635042 68272007 69738024 71035856 72179317
1193.1 72179317 73224497 74254829 75308144 76331472 77228123 77920246 78391671 78694206 78898710
1211.5 78898710 79049748 79174972 79267925 79264498 79098839 78763258 78319818 77869064 77479529 77137893
1231.9 77137893 76806152 76507491 76327294 76351905 76621890 77131337 77827168 78615737 79384243 80041873
$$ packed form
1101.4G9315251L17079M75329M18294J48010k22600n00077n28156k53767K30652P01362
1121.8H0101377Q99213O32799m2719p62069j314777j883143k476949k765435k595395
1140.1F9792902k163833j743883j467001j340366j325190j358503j362258j253849
1156.4E7778019j015467o99752l72541r5845J21147L03799M81653P32690J075864J375419
1176.8E9684986J575953J744401J840270J789432J636965J466017J297832J143461
1193.1G2179317J045180J030332J053315J023328Q96651O92123M71425L02535K04504
1211.5G8898710J51038J25224R2953l427j65659l35581m43440m50754l89535l41636
1231.9G7137893l31741k98661j80197K4611K69985N09447O95831P88569P68506O57630
$$ plain form
1252.3 80041873 80569243 81011552 81421280 81817019 82175291 82479030 82761520 83069736 83410186 83738416
1272.7 83738416 84023291 84265065 84478915 84750575 85213017 85883492 86604500 87202615 87628698 87927353
1293.1 87927353 88147295 88301206 88395554 88505787 88740712 89105862 89497900 89852929 90192521 90506154
1313.5 90506154 90735942 90873563 90994489 91193080 91495085 91851741 92182952 92407888 92464787 92333692
1333.9 92333692 92041874 91631359 91173995 90806496 90560240 90339518 90087664 89821982 89576876 89353365
1354.3 89353365 89157969 89047843 89045531 89045638 88954473 88809860 88652635 88436699 87879878 86711466 85533005
1376.7 85533005 85406762 86575234 88374823 90159118 91761321 93024027 93836224 94330680 94650376
1395.1 94650376 94977373 95482081 96191525 97018051 97738445 97971880 97497690 96311772 94770938
$$ packed form
1252.3H0041873N27370M42309M09728L95739L58272L03739K82490L08216L40450L28230
1272.7H3738416K84875K41774K13850K71660M62442O70475P21008N98115M26083K98655
1293.1H7927353K19942J53911R4348J10233K34925L65150L92038L55029L39592L13633
1313.5I0506154K29788J37621J20926J98591L02005L56656L31211K24936N6899j31095
1333.9I2333692k91818m10515m57364l67499k46256k20722k51854k65682k45106k23511
1354.3H9353365j95396j10126k312J07r1165j44613j57225k15936n56821j168412j178461
1376.7H5533005j26243J168472J799589J784295J602203J262706Q12197M94456L19696
1395.1I4650376L26997N04708P09444Q26526P20394K33435m74190j185918j540834
$$ plain form
1413.4 94770938 93497628 92899197 93069619 93637055 94063568 93995488 93291265 91965014 90351635
1431.8 90351635 88873297 87344128 85755652 84535307 83484066 82404059 81289452 79963589
1448.1 79963589 78316945 76354700 74248135 72144812 70583314 69883931 69250947 68329614 68572551
1466.4 68572551 71924740 78605396 87290090 93924975 97308576 99315941 100869155 102148080
1482.8 102148080 103139603 103935826 104566634 104942536 105122507 105207288 105097806 104848325 104888904 105335164
1503.2 105335164 106038129 106648767 106788969 106786847 106847119 106965649 107088959 107195783 107268906 107253659
1523.6 107253659 107210052 107175612 107156479 107192457 107217717 107200038 107268238 107375503 107245398 106982005 106758928
1546 106758928 106625175 106578612 106599653 106712830 106940722 107237577 107253361 107073128 106989133 107009733 107108748
$$ packed form
1413.4I4770938j273310n98431J70422N67436M26513o8080p04223j326251j613379
1431.8I0351635j478338j529169j588476j220345j051241j080007j114607j325863
1448.1G9963589j646644j962245k106565k103323j561498o99383o32984r21333K42937
1466.4F8572551L352189O680656Q684694O634885L383601K007365J553214J278925
1482.8A02148080R91523P96223O30808L75902J79971Q4781j09482k49481M0579M46260
1503.2A05335164P02965O10638J40202k122O0272J18530J23310J06824P3123j5247
1523.6A07253659m3607l4440j9133L5978K5260j7679O8200J07265j30105k63393k23077
1546A06758928j33753m6563K1041J13177K27892K96855J5784j80233q3995K0600R9015
$$ plain form
1568.4 107108748 107200694 107244599 107326925 107400882 107363260 107320964 107319260 107326579 107332039 107336283 107335830 107332540 107311201
1594.9 107311201 107252228 107167482 107068992 106983304 106953120 106998837 107066858 107112598 107163715 107232428 107221496
1617.4 107221496 107129240 107068551 106996059 106880367 106777823 106726015 106747961 106833625 106799829 106513643 106160879
1639.8 106160879 105831897 105569220 105324173 105063045 104929078 104843760 104452109 104033816 103823292 103725767
1660.2 103725767 103616810 103422832 103265429 103176057 103165901 103338885 103717792 104100394 104348314 104539716
1680.6 104539716 104677808 104551589 104201245 103838956 103418529 103003740 102449989 101685905 100720346 99364674
1701 99364674 98112500 96929300 95550877 94289392 93233579 92236900 90961778 88744360 85916257
1719.3 85916257 83132637 79870737 75895333 71423048 66389930 60761851 53187931 45092228
$$ packed form
1568.4A07108748R1946M3905Q2326P3957l7622m2296j704P319N460M244m53l290k1339
1594.9A07311201n8973q4746r8490q5688l0184M5717O8021M5740N1117O8713j0932
1617.4A07221496r2256o0689p2492j15692j02544n1808K1946Q5664l3796k86186l52764
1639.8A06160879l28982k62677k45047k61128j33967q5318l91651m18293k10524r7525
1660.2A03725767j08957j93978j57403q9372j0156J72984L78907L82602K47920J91402
1680.6A04539716J38092j26219l50344l62289m20427m14789n53751p64084r65559j355672
1701I9364674j252174j183200j378423j261485j055813r96679j275122k217418k828103
1719.3H5916257k783620l261900l975404m472285n033118n628079p573920q095703
$$ plain form
1735.7 45092228 39150026 33770144 29184940 26553124 25811827 27093530 30954009 37397701 45235571
1754 45235571 54428768 64394724 73476064 81530601 87675583 91925240 95193034 97690099 99611181
1772.4 99611181 100982368 101932478 102722001 103423643 103997374 104488039 104911661 105318344 105718875 106057155
1792.8 106057155 106292319 106506681 106733322 106928444 107092488 107248545 107423067 107591462 107741022 107853484
1813.2 107853484 107960105 108073807 108191597 108321679 108460355 108586824 108687425 108764637 108783567 108800554
1833.6 108800554 108848035 108907998 108972037 109064400 109149873 109158278 109138155 109138477 109161687 109182298 109199190 109212804
1858 109212804 109226692 109239852 109270430 109329081 109359646 109314263 109259200 109252095 109259665 109261584 109260178 109273636 109297097
1884.6 109297097 109327257 109356356 109356201 109345472 109344709 109346378 109345233 109346330 109345722 109347558 109353840 109360695 109352732 109337258
$$ packed form
1735.7D5092228n942202n379882m585204k631816p41297J281703L860479O443692P837870
1754D5235571R193197R965956R081340Q054537O144982M249657L267794K497065J921082
1772.4I9611181J371187R50110P89523P01642N73731M90665M23622M06683M00531L38280
1792.8A06057155K35164K14362K26641J95122J64044J56057J74522J68395J49560J12462
1813.2A07853484J06621J13702J17790J30082J38676J26469J00601P7212J8930J6987
1833.6A08800554M7481N9963O4039R2363Q5473Q405k0123L22K3210K0611J6892J3614
1858A09212804J3888J3160L0578N8651L0565m5383n5063p105P570J919j406J3458K3461
1884.6A09297097L0160K9099j55j0729p63J669j145J097o08J836O282O855p963j5474
$$ plain form
1913.1 109337258 109343731 109359741 109357083 109347010 109335184 109308207 109289491 109288788 109296238 109301722 109300852 109300423 109313977
1939.6 109313977 109336865 109341383 109336162 109337211 109344363 109356368 109376001 109392679 109397161 109399414 109407318 109426022 109444571
1966.1 109444571 109446263 109440231 109445405 109455335 109463894 109472501 109479260 109486020 109495378 109510601 109529698 109544575 109547460
1992.6 109547460 109546661 109551060 109556174 109559560 109567893 109583759 109595025 109595740 109592009 109586740 109578407 109567440 109559011 109554827
2021.2 109554827 109551609 109551692 109556937 109568465 109589422 109615743 109640884 109669352 109709013 109749126 109778047 109804809
2045.7 109804809 109834754 109864163 109892321 109917974 109934735 109944010 109960783 109991944 110026550 110051537 110072708 110093725
2070.2 110093725 110113049 110136926 110158873 110174322 110195935 110226274 110256505 110288322 110320842 110347259 110366011
2092.6 110366011 110381150 110397530 110416317 110438704 110463631 110485160 110497403 110500729 110500312 110508668 110530341 110552895
$$ packed form
1913.1A09337258O473J6010k658j0073j1826k6977j8716p03P450N484q70m29J3554
1939.6A09313977K2888M518n221J049P152J2005J9633J6678M482K253P904J8704J8549
1966.1A09444571J692o032N174R930Q559Q607O759O760R358J5223J9097J4877K885
1992.6A09547460p99M399N114L386Q333J5866J1266P15l731n269q333j0967q429m184
2021.2A09554827l218Q3N245J1528K0957K6321K5141K8468L9661M0113K8921K6762
2045.7A09804809K9945K9409K8158K5653J6761R275J6773L1161L4606K4987K1171K1017
2070.2A10093725J9324K3877K1947J5449K1613L0339L0231L1817L2520K6417J8752
2092.6A10366011J5139J6380J8787K2387K4927K1529J2243L326m17Q356K1673K2554
$$ plain form
2117.1 110552895 110565424 110571349 110580277 110592163 110596108 110590851 110588050 110582292 110571027 110559487 110546112 110536873 110529745
2143.6 110529745 110510135 110483003 110465825 110457766 110446429 110424793 110405672 110398805 110394955 110388720 110384595 110384786 110388577
2170.1 110388577 110392475 110385680 110374200 110369682 110367036 110361612 110356867 110351098 110343599 110342026 110343492 110339427 110329556 110318232
2198.6 110318232 110306275 110297501 110292196 110277843 110256410 110241675 110230696 110217822 110209811 110204625 110188985 110165012
2223.1 110165012 110143054 110119867 110098302 110083985 110070002 110050535 110027182 110003078 109980726 109959531 109935856
2245.6 109935856 109915936 109901428 109881651 109856606 109836972 109825683 109815323 109799027 109779394 109767246 109762609 109754848
2270 109754848 109743893 109734488 109728897 109726584 109716165 109691083 109664309 109651446 109650123 109647107 109639728 109635425 109641182
2296.5 109641182 109658694 109682536 109706283 109731019 109759462 109793413 109838033 109888911 109944344 110018575 110113537
$$ packed form
2117.1A10552895J2529N925Q928J1886L945n257k801n758j1265j1540j3375r239p128
2143.6A10529745j9610k7132j7178q059j1337k1636j9121o867l850o235m125J91L791
2170.1A10388577L898o795j1480m518k646n424m745n769p499j573J466m065r871j1324
2198.6A10318232j1957q774n305j4353k1433j4735j0979j2874q011n186j5640k3973
2223.1A10165012k1958k3187k1565j4317j3983j9467k3353k4104k2352k1195k3675
2245.6A09935856j9920j4508j9777k5045j9634j1289j0360j6296j9633j2148m637p761
2270A09754848j0955r405n591k313j0419k5082k6774j2863j323l016p379m303N757
2296.5A09641182J7512K3842K3747K4736K8443L3951M4620N0878N5433P4231R4962
$$ plain form
2319 110113537 110214949 110308385 110380745 110448456 110536480 110612154 110645080 110669565 110713649 110766327 110802364 110775125
2343.5 110775125 110623586 110448289 110439181 110650134 110974681 111243010 111421645 111529326 111532402 111432159
2363.8 111432159 111271417 111082292 110879660 110674298 110484970 110328019 110204363 110108864 110039222 109993923
2384.2 109993923 109971476 109966564 109972465 109984744 110001040 110024679 110053051 110076582 110094059 110104764 110112584 110132325
2408.7 110132325 110161996 110183799 110197783 110217154 110241151 110262072 110282254 110303319 110325038 110350299 110374618
2431.2 110374618 110392916 110409665 110427248 110441399 110456944 110479319 110501337 110517037 110531259 110549629 110564494
2453.6 110564494 110575557 110587287 110593605 110598004 110607457 110618055 110624170 110632420 110651386 110667682 110668421 110662460 110660851
2480.1 110660851 110660982 110652363 110641563 110636735 110627043 110614240 110612535 110614920 110609114 110599840 110589230 110570037 110543025
$$ packed form
2319A10113537J01412R3436P2360O7711Q8024P5674L2926K4485M4084N2678L6037k7239
2343.5A10775125j51539j75297r108K10953L24547K68329J78635J07681L076j00243
2363.8A11432159j60742j89125k02632k05362j89328j56951j23656r5499o9642m5299
2384.2A09993923k2447m912N901J2279J6296K3639K8372K3531J7477J0705P820J9741
2408.7A10132325K9671K1803J3984J9371K3997K0921K0182K1065K1719K5261K4319
2431.2A10374618J8298J6749J7583J4151J5545K2375K2018J5700J4222J8370J4865
2453.6A10564494J1063J1730O318M399R453J0598O115Q250J8966J6296P39n961j609
2480.1A10660851J31q619j0800m828r692j2803j705K385n806r274j0610j9193k7012
$$ plain form
2506.6 110543025 110521662 110504806 110479617 110450006 110419989 110388303 110358620 110331511 110308540 110291374 110271299
2529.1 110271299 110249865 110240388 110238850 110237694 110235178 110221863 110198522 110183549 110180080 110169506 110147631 110125732
2553.5 110125732 110105467 110081029 110044885 110003197 109971106 109943640 109910965 109872460 109828138 109782147 109742796
2576 109742796 109708977 109670329 109622514 109574091 109531498 109487736 109443879 109407079 109369969 109331965 109295726 109255040
2600.4 109255040 109214497 109177327 109137702 109092748 109045899 108999622 108948135 108896863 108849621 108796179 108738661
2622.9 108738661 108683026 108628047 108578360 108535969 108493805 108454704 108425164 108400714 108374202 108343339 108313024
2645.3 108313024 108278191 108225608 108156300 108083177 108014166 107942462 107859814 107766891 107671690 107581925 107507455
2667.7 107507455 107461727 107439196 107422662 107405007 107386911 107386696 107427299 107487381 107537425 107590473 107656753 107726359
$$ packed form
2506.6A10543025k1363j6856k5189k9611l0017l1686k9683k7109k2971j7166k0075
2529.1A10271299k1434r477j538j156k516j3315k3341j4973l469j0574k1875k1899
2553.5A10125732k0265k4438l6144m1688l2091k7466l2675l8505m4322m5991l9351
2576A09742796l3819l8648m7815m8423m2593m3762m3857l6800l7110l8004l6239m0686
2600.4A09255040m0543l7170l9625m4954m6849m6277n1487n1272m7242n3442n7518
2622.9A08738661n5635n4979m9687m2391m2164l9101k9540k4450k6512l0863l0315
2645.3A08313024l4833n2583o9308p3123o9011p1704q2648r2923r5201q9765p4470
2667.7A07507455m5728k2531j6534j7655j8096k15M0603O0082N0044N3048O6280O9606
$$ plain form
2692.2 107726359 107800519 107873452 107928109 107969451 108005452 108030629 108040333 108031154 108006382 107976222 107945085 107914054
2716.7 107914054 107882178 107836533 107771683 107699883 107648575 107644403 107673180 107704234 107739842 107799244 107870638 107924843
2741.2 107924843 107957065 107965851 107959867 107973087 108009446 108029914 108012795 107977998 107944334 107910657 107872033 107825887
2765.6 107825887 107769883 107692444 107571805 107410455 107247782 107089472 106903195 106684732 106446683 106183624
2786 106183624 105893993 105607200 105338490 105057168 104726803 104355907 103984821 103615165 103210604 102746415
2806.4 102746415 102218294 101637745 101006627 100295722 99480569 98557740 97512221 96317703 94943720
2824.8 94943720 93352544 91519564 89408356 86912256 83828753 79866838 74678558 67976230
2841.1 67976230 59829962 50899929 42240959 34891012 29707173 27287158 27759331 30755287 35534066
$$ packed form
2692.2A07726359P4160P2933N4657M1342L6001K5177R704r179k4772l0160l1137l1031
2716.7A07914054l1876m5645o4850p1800n1308m172K8777L1054L5608N9402P1394N4205
2741.2A07924843L2222Q786n984J3220L6359K0468j7119l4797l3664l3677l8624m6146
2765.6A07825887n6004p7439j20639j61350j62673j58310j86277k18463k38049k63059
2786A06183624k89631k86793k68710k81322l30365l70896l71086l69656m04561m64189
2806.4A02746415n28121n80549o31118p10905q15153r22829j045519j194518j373983
2824.8I4943720j591176j832980k111208k496100l083503l961915n188280o702328
2841.1F7976230q146268q930033q658970p349947n183839k420015M72173K995956M778779
$$ plain form
2859.5 35534066 41147968 46642342 51198065 54373276 56453294 58339834 60705656 63347793
2875.8 63347793 65524870 66674405 66690969 65746343 64072627 61895049 59419578 56803483 54146707
2894.1 54146707 51496929 48836243 46127409 43347198 40441313 37341943 34015456 30475113
2910.4 30475113 26783824 23062116 19518135 16446470 14119941 12688595 12146112 12399802 13347086
2928.8 13347086 14879750 16997717 19772217 23159400 26987275 31016725 34917587 38272280
2945.1 38272280 40710023 42114958 42745662 43095103 43706816 45020074 47217557 50291836 54147452
2963.5 54147452 58590883 63321197 67992151 72337401 76215118 79577446 82450491 84882176
2979.8 84882176 86920124 88637024 90085870 91269779 92162424 92704749 92805415 92359537 91304183
$$ packed form
2859.5C5534066N613902N494374M555723L175211K080018J886540K365822K642137
2875.8F3347793K177077J149535J6564r44626j673716k177578k475471k616095k656776
2894.1E4146707k649778k660686k708834k780211k905885l099370l326487l540343
2910.4C0475113l691289l721708l543981l071665k326529j431346n42483K53690R47284
2928.8A3347086J532664K117967K774500L387183L827875M029450L900862L354693
2945.1C8272280K437743J404935O30704L49441O11713J313258K197483L074279L855616
2963.5E4147452M443431M730314M670954M345250L877717L362328K873045K431685
2979.8H4882176K037948J716900J448846J183909Q92645N42325J00666m45878j055354
$$ plain form
2998.1 91304183 89665997 87612695 85504407 83835518 83082646 83527923 85160017 87696493 90706176
3016.5 90706176 93763822 96541286 98850507 100669801 102078998 103144336 103925431 104511595 104984426
3034.9 104984426 105374169 105661666 105859399 106018984 106176877 106349039 106523705 106690383 106851888 106999254
3055.3 106999254 107123673 107221150 107295156 107360256 107429135 107529473 107687151 107870567 108019102 108115244
3075.7 108115244 108193219 108293295 108409727 108508015 108586979 108653033 108712816 108791459 108874238 108925426 108945966
3098.1 108945966 108953583 108953142 108941472 108921289 108909273 108938658 108998060 109034908 109056675 109101367 109177196 109273982
3122.6 109273982 109358764 109403884 109423769 109452581 109494364 109518063 109504962 109479511 109484637 109527826 109581685 109622884
3147 109622884 109634125 109622157 109635317 109696102 109772217 109831572 109866667 109889996 109915280 109941983 109968412 109992826
$$ packed form
2998.1I1304183j638186k053302k108288j668889p52872M45277J632094K536476L009683
3016.5I0706176L057646K777464K309221J819294J409197J065338P81095N86164M72831
3034.9A04984426L89743K87497J97733J59585J57893J72162J74666J66678J61505J47366
3055.3A06999254J24419R7477P4006O5100O8879J00338J57678J83416J48535R6142
3075.7A08115244P7975J00076J16432R8288P8964O6054N9783P8643Q2779N1188K0540
3098.1A08945966P617m41j1670k0183j2016K9385N9402L6848K1767M4692P5829R6786
3122.6A09273982Q4782M5120J9885K8812M1783K3699j3101k5451N126M3189N3859M1199
3147A09622884J1241j1968J3160O0785P6115N9355L5095K3329K5284K6703K6429K4414
$$ plain form
3171.5 109992826 110011351 110028315 110048199 110068905 110088980 110105944 110114110 110118198 110133231 110161936 110198557 110239518
3196 110239518 110272312 110289860 110308313 110341108 110379231 110410798 110434830 110451794 110467887 110493982 110525286 110547721
3220.5 110547721 110561681 110586488 110616326 110621440 110593355 110563052 110583091 110638642 110668790 110671663 110669708 110652590
3244.9 110652590 110633767 110651827 110689187 110705686 110695696 110690057 110713923 110742664 110750961 110744441 110715055 110654593
3269.4 110654593 110610461 110616648 110651088 110695887 110725856 110723472 110709453 110700881 110687292 110644352 110582495 110546613
3293.9 110546613 110557163 110595942 110619712 110586107 110502481 110438752 110446751 110514498 110589886 110623240 110621285 110612953
3318.4 110612953 110603547 110568547 110504603 110478330 110509908 110541308 110544026 110500681 110404456 110329354 110320401 110331917
3342.8 110331917 110352170 110361707 110311401 110265958 110291314 110312963 110269737 110202479 110159183 110127497 110063481 109969807
$$ packed form
3171.5A09992826J8525J6964J9884K0706K0075J6964Q166M088J5033K8705L6621M0961
3196A10239518L2794J7548J8453L2795L8123L1567K4032J6964J6093K6095L1304K2435
3220.5A10547721J3960K4807K9838N114k8085l0303K0039N5551L0148K873j955j7118
3244.9A10652590j8823J8060L7360J6499r990n639K3866K8741Q297o520k9386o0462
3269.4A10654593m4132O187L4440M4799K9969k384j4019q572j3589m2940o1857l5882
3293.9A10546613J0550L8779K3770l3605q3626o3729P999O7747P5388L3354j955q332
3318.4A10612953r406l5000o3944k6273L1578L1400K718m3345r6225p5102q953J1516
3342.8A10331917K0253R537n0306m5443K5356K1649m3226o7258m3296l1686o4016r3674
$$ plain form
3367.3 109969807 109915042 109949791 110014415 110023165 109992492 109972906 109967875 109959722 109940326 109886205 109777880 109688020
3391.8 109688020 109690177 109707439 109629846 109509265 109489703 109576237 109630716 109596694 109537458 109504235 109509480 109527051
3416.3 109527051 109514832 109487128 109470117 109436250 109350264 109238160 109163058 109086633 108957291 108888817 108960521
3438.7 108960521 109060287 109074748 109007466 108913457 108841407 108789611 108728349 108653653 108555043 108436358 108356297
3461.1 108356297 108282602 108094835 107853961 107800186 107994568 108206606 108267212 108202934 108155382 108283734
3481.5 108283734 108460474 108506346 108538473 108626163 108662832 108613312 108537149 108511233 108508885 108458149 108465278 108565807
3506 108565807 108608222 108527446 108364880 108237016 108217609 108235776 108193231 108079839 107999384 108012104 108042288
3528.4 108042288 108039069 108014810 107983828 107982123 108036101 108102345 108150733 108229923 108364725 108505189 108619583
$$ packed form
3367.3A09969807n4765L4749O4624Q750l0673j9586n031q153j9396n4121j08325q9860
3391.8A09688020K157J7262p7593j20581j9562Q6534N4479l4022n9236l3223N245J7571
3416.3A09527051j2219k7704j7011l3867q5986j12104p5102p6425j29342o8474P1704
3438.7A08960521R9766J4461o7282r4009p2050n1796o1262p4696r8610j18685q0061
3461.1A08356297p3695j87767k40874n3775J94382K12038O0606o4278m7552J28352
3481.5A08283734J76740M5872L2127Q7690L6669m9520p6163k5916k348n0736P129J00529
3506A08565807M2415q0776j62566j27864j9407J8167m2545j13392q0455J2720L0184
3528.4A08042288l219k4259l0982j705N3978O6244M8388P9190J34802J40464J14394
$$ plain form
3550.9 108619583 108728218 108844936 108960450 109063303 109172916 109345675 109565794 109704363 109725523 109764731
3571.3 109764731 109870946 109985602 110070419 110132158 110191178 110277247 110392702 110461009 110421789 110352015 110306978
3593.7 110306978 110259688 110235071 110297215 110434818 110608065 110808313 111004150 111146808 111240900 111307395
3614.1 111307395 111377215 111445367 111446822 111425018 111487830 111646986 111781967 111743224 111630177 111553407 111512280
3636.5 111512280 111505687 111534989 111597407 111715949 111880624 111949158 111844683 111746979 111715031 111660862 111573946
3659 111573946 111546648 111599910 111684740 111795199 111922896 111995542 112025690 112024331 111928618 111814904 111755776
3681.4 111755776 111755943 111807561 111877358 111923456 111907506 111847699 111812866 111831367 111885154 111930430 111933863 111946654
3705.9 111946654 112023640 112116265 112096536 111977053 111900461 111908293 111962295 112015998 112024021 111977994 111950302 112012637
$$ packed form
3550.9A08619583J08635J16718J15514J02853J09613J72759K20119J38569K1160L9208
3571.3A09764731J06215J14656Q4817O1739N9020Q6069J15455O8307l9220o9774m5037
3593.7A10306978m7290k4617O2144J37603J73247K00248J95837J42658R4092O6495
3614.1A11307395O9820O8152J455k1804O2812J59156J34981l8743j13047p6770m1127
3636.5A11512280o593K9302O2418J18542J64675O8534j04475r7704l1948n4169q6916
3659A11573946k7298N3262Q4830J10459J27697P2646L0148j359r5713j13714n9128
3681.4A11755776J67N1618O9797M6098j5950n9807l4833J8501N3787M5276L433J2791
3705.9A11946654P6986R2625j9729j19483p6592P832N4002N3703Q023m6027k7692O2335
$$ plain form
3730.3 112012637 112138069 112190449 112087500 111965013 111958814 112062156 112147737 112126958 112127578 112145448 112044573
3752.8 112044573 111912990 111848855 111806762 111747670 111716974 111734521 111760271 111747289 111680889 111620760 111614776
3775.2 111614776 111627972 111623311 111609399 111597466 111578751 111535239 111490405 111501706 111569214 111640537 111694527 111754048
3799.7 111754048 111783934 111737919 111672056 111607516 111557364 111571014 111650705 111732519 111777270 111804390 111764157
3822.1 111764157 111661077 111588967 111575365 111604571 111657786 111709940 111751044 111768603 111729419 111650288 111571169
3844.6 111571169 111528826 111584127 111765349 111953759 111885631 111670792 111562335 111603904 111709476 111766374
3865 111766374 111788046 111801970 111756945 111685038 111640298 111632168 111669326 111716390 111737275 111732209 111714017 111710894
3889.4 111710894 111698413 111654484 111641967 111705065 111804664 111853361 111813700 111728144 111659753 111639118 111651528
$$ packed form
3730.3A12012637J25432N2380j02949j22487o199J03342Q5581k0779O20J7870j00875
3752.8A12044573j31583o4135m2093n9092l0696J7547K5750j2982o6400o0129n984
3775.2A11614776J3196m661j3912j1933j8715m3512m4834J1301O7508P1323N3990N9521
3799.7A11754048K9886m6015o5863o4540n0152J3650P9691Q1814M4751K7120m0233
3822.1A11764157j03080p2110j3602K9206N3215N2154M1104J7559l9184p9131p9119
3844.6A11571169m2343N5301J81222J88410o8128k14839j08457M1569J05572N6898
3865A11766374K1672J3924m5025p1907m4740q130L7158M7064K0885n066j8192l123
3889.4A11710894j2481m3929j2517O3098R9599M8697l9661q5556o8391k0635J2410
$$ plain form
3911.9 111651528 111674070 111710179 111725390 111690593 111669779 111685359 111696875 111702001 111709929 111701763 111676216 111664736
3936.3 111664736 111672318 111683571 111697567 111709058 111702204 111678576 111657572 111653829 111668253 111686027 111695313 111697340
3960.8 111697340 111686945 111667848 111666059 111679459 111685300 111678934 111661637 111648571 111652696 111662424 111672747 111691964
3985.3 111691964 111713505 111718941 111694276 111652696 111624622 111612022
3997.5 111612022
$$ packed form
3911.9A11651528K2542L6109J5211l4797k0814J5580J1516N126P928q166k5547j1480
3936.3A11664736P582J1253J3996J1491o854k3628k1004l743J4424J7774R286K027
3960.8A11697340j0395j9097j789J3400N841o366j7297j3066M125R728J0323J9217
3985.3A11691964K1541N436k4665m1580k8074j2600
3997.5A11612022
##END=$$ End of the data block
