##TITLE=$$ Begin of the data block
##JCAMP-DX=5.00 $$ ACD/SpecManager v 10.08
##SPECTROMETER/DATA SYSTEM=Alpha
##DATE=27 Jun 2014 15:13:00
##DATA TYPE=INFRARED SPECTRUM
##DATA CLASS=XYDATA
##ORIGIN=
##OWNER=
##NPOINTS=1667
##FIRSTX=599.63549805
##LASTX=3997.56909180
##MAXX=3997.56909180
##MINX=599.63549805
##MAXY=1.13338685
##MINY=0.74115884
##XFACTOR=1.0000000000
##YFACTOR=0.000000010000000
##FIRSTY=1.03905356
##DELTAX=2.03957605
##XUNITS=1/CM
##YUNITS=ARBITRARY UNITS
##XYDATA=(X++(Y..Y))
599.6 103905356 103896010 103951716 104041922 104103947 104126155 104186153 104282069 104316342 104334795 104407740 104482996 104538357
624.1 104538357 104580510 104614162 104632819 104617321 104584491 104568827 104558790 104526663 104472411 104397047 104307377 104232371
648.6 104232371 104220343 104246938 104248893 104245985 104268873 104300809 104315817 104122794 103499758 103166497 103583312
671 103583312 103844559 103808117 103718257 103653526 103605855 103583646 103579116 103574550 103585505 103614104 103637421 103641832
695.5 103641832 103635287 103616667 103537965 103348243 103050065 102676284 102285075 101950133 101684284 101444149
715.9 101444149 101200104 101041734 101124346 101419258 101775002 102126765 102458882 102763128 103057563 103341377
736.3 103341377 103592598 103823745 104060340 104282832 104463804 104601204 104719818 104845297 104951406 105022335
756.7 105022335 105093849 105176151 105255806 105330801 105395651 105444813 105476642 105503452 105550051 105623901 105699515 105757213
781.2 105757213 105812025 105873811 105937970 105992424 106029224 106057119 106083632 106112480 106139970 106155002 106148267 106120181
805.6 106120181 106094849 106093407 106090689 106060791 106032586 106028402 106023002 106012559 106021500 106038034 106036019 106019461 105995035
832.1 105995035 105962861 105932748 105913448 105914760 105923378 105916679 105916548 105954850 106019354 106063557 106076753 106087565 106106329
858.7 106106329 106118464 106112719 106090498 106053853 106009316 105961180 105915475 105887270 105891192 105924165 105963683 106000721
883.1 106000721 106040037 106083381 106130052 106166363 106156051 106078088 105979729 105932271 105940223 105969238 106000590 106020749
907.6 106020749 106024289 106017888 106010532 106006336 106008613 106006670 105968893 105902839 105872774 105913579 105992639 106069565 106118631
934.1 106118631 106131196 106133735 106153929 106185794 106216979 106237984 106232798 106205261 106165004 106115294 106076038 106061673
958.6 106061673 106059206 106063187 106080973 106105244 106120515 106112099 106081593 106038010 106001711 106004810 106039941 106078649
983.1 106078649 106111526 106152761 106210613 106259918 106284499 106294990 106298268 106288600 106261766 106227636 106193244 106144357
1007.5 106144357 106086242 106066370 106101346 106135082 106116629 106064153 106021798 105996799 105970180 105949509 105955255 105977452
1032 105977452 105985677 105947530 105823064 105591452 105330098 105186880 105207229 105299807 105401397 105518353 105632925
1054.5 105632925 105709696 105746889 105771208 105801880 105838323 105872273 105885649 105861020 105802333 105717146 105581403
1076.9 105581403 105368209 105109131 104850638 104593456 104329407 104059672 103785729 103516817 103275287 103095686
1097.3 103095686 103003347 102999628 103069282 103185725 103302193 103364003 103343356 103250098 103142643 103104544 103181481
1119.7 103181481 103360105 103572643 103713679 103702521 103546071 103273118 102848363 102257049 101582861 100938356
1140.1 100938356 100381684 99912018 99507219 99136472 98760527 98357004 97942436 97562122 97252297 97026330
1160.5 97026330 96899670 96872276 96909964 96987975 97122055 97344172 97663295 98062354 98519361 99016595
1180.9 99016595 99535608 100045705 100512695 100918388 101260984 101555741 101830411 102102685 102374339 102641010
1201.3 102641010 102881610 103073621 103213513 103301215 103355265 103403318 103452516 103496170 103513694 103491306 103436339
1223.7 103436339 103358614 103269351 103182912 103105927 103036582 102975595 102940261 102953005 103021419 103145981 103319502
1246.2 103319502 103519011 103714681 103885472 104025054 104140759 104248583 104359591 104463792 104544592 104607868
1266.6 104607868 104675210 104760814 104856205 104947329 105023658 105081284 105148983 105262387 105416274 105576611 105721486
1289 105721486 105840576 105925763 105983853 106025875 106057060 106094623 106161487 106252873 106344151 106422842 106491864 106560147
1313.5 106560147 106620419 106659412 106706321 106787968 106881797 106970274 107055891 107129490 107163322 107129323 107021618
1335.9 107021618 106880689 106805027 106828690 106859744 106849039 106816840 106775844 106728852 106682193 106650805 106617773
1358.3 106617773 106545734 106496060 106554365 106622803 106628454 106577039 106395864 106115711 105933642 105981004 106258702
1380.8 106258702 106631064 106946754 107226729 107540286 107761014 107782423 107737529 107801855 107999468 108270907
1401.2 108270907 108494401 108663201 108785641 108756745 108558166 108262718 107913744 107614732 107627869 107896340
1421.6 107896340 108099055 108162868 108045053 107756650 107445753 107105410 106679308 106412053 106334174 106190443
1442 106190443 105943274 105625641 105275953 104920185 104440033 103739178 102871299 102442276 102573776 102549481
1462.4 102549481 102237487 102270198 103083181 104455805 106145751 107601297 108536398 109139025 109539521
1480.7 109539521 109823561 109968710 109944224 109919226 110119224 110346651 110341811 110233212 110284865 110434806
1501.1 110434806 110436249 110150921 109976470 110310161 110644400 110743940 110656059 110549450 110478139 110471022 110619974
1523.6 110619974 110786617 110940945 111041284 110990620 110955489 110983682 110773790 110405171 110441780 110765457
1543.9 110765457 111056077 111181557 111188519 111172843 111069334 110775745 110461569 110785580 111269450 111440063
1564.3 111440063 111433232 111376405 111438477 111549151 111498487 111488235 111687684 111843944 111892450 111911583 111924732
1586.8 111924732 111926115 111925006 111926007 111934662 111956322 111963236 111937594 111916173 111914146 111914563 111938739 111979067 111927783
1613.3 111927783 111766028 111728251 111825228 111795759 111719000 111748898 111814094 111886692 111867237 111635923 111425507
1635.7 111425507 111572623 111769211 111774063 111560690 111233246 111146224 111154032 110913193 110902035 111294746 111507356
1658.2 111507356 111477017 111378062 111374152 111326456 111137140 111071491 111181784 111294532 111455953 111572123 111466432
1680.6 111466432 111171341 111079538 111323845 111479461 111500943 111385083 111056197 110699880 110446811 110346675
1701 110346675 110361314 110277915 110174680 110108471 109940326 109596920 109082437 108528316 108193755 107868922
1721.4 107868922 107240856 106314838 105129170 103636062 101768160 99015725 96064985 93668699 90981668
1739.7 90981668 88406581 86790419 86236602 86858374 88856292 92027014 95423722 98733532 101831901
1758.1 101831901 104330766 106357193 107870376 108814096 109386313 109755063 110126948 110583949 110949302
1776.5 110949302 111155653 111291397 111427760 111571217 111697936 111725140 111642361 111665869 111837530 111951935
1796.9 111951935 111973023 112015569 112139928 112258911 112306035 112300658 112326074 112410176 112484634 112524700 112562931
1819.3 112562931 112572086 112523913 112483048 112462521 112464654 112571120 112700224 112744176 112755501 112756598 112687898 112604260
1843.8 112604260 112651956 112771070 112856495 112905121 112934399 112955201 112960637 112959766 112956309 112921476 112820840 112736726
1868.2 112736726 112808454 112949324 113022029 113036907 113044238 113049829 113049209 113049769 113033473 112994647 113002074 113046193 113067043
1894.8 113067043 113094187 113128376 113132477 113118958 113108993 113093925 113090706 113123095 113156939 113132632 113071644 113062394
1919.2 113062394 113083649 113101542 113143849 113181245 113189900 113191783 113197815 113205457 113206589 113175297 113123953 113121605 113164818
1945.7 113164818 113198102 113215184 113224638 113230836 113240993 113249648 113247335 113243318 113236034 113220668 113226283 113250685 113260400
1972.3 113260400 113260138 113264370 113273358 113281512 113282466 113277173 113266838 113247919 113223386 113225102 113261580 113289821 113294482
1998.8 113294482 113294387 113296473 113293266 113280475 113269353 113268876 113266265 113246989 113225853 113229740 113250732 113262701 113261592
2025.3 113261592 113259196 113260055 113260543 113259590 113258600 113259268 113253152 113241625 113243389 113257921 113269150 113269114 113263750 113262224 113264263
2055.9 113264263 113262570 113260543 113263702 113265026 113265884 113272893 113282835 113287890 113283372 113277030 113277316 113286006 113299072 113304138
2084.4 113304138 113300955 113302219 113306701 113306892 113304400 113303459 113307333 113314009 113319302 113323176 113323247 113319445 113314891 113309216 113309920
2115 113309920 113325036 113338685 113333869 113321388 113316739 113316536 113314211 113312531 113310921 113309550 113313937 113320661 113321126 113314438
2143.6 113314438 113308203 113306296 113299978 113288593 113285995 113295507 113305247 113303709 113292253 113282418 113282609 113291430 113301265 113307369
2172.1 113307369 113306594 113298833 113288605 113280010 113279629 113287878 113295496 113299167 113300991 113303447 113308203 113310516 113307273 113305998
2200.7 113305998 113308346 113308883 113306010 113298082 113291872 113291550 113292038 113294089 113292348 113284290 113282979 113287163 113287377 113284242 113276327
2231.3 113276327 113268244 113263035 113258457 113255930 113248968 113236558 113227987 113223016 113217545 113210797 113194132 113168848 113152170
2257.8 113152170 113140893 113123286 113107812 113099718 113093996 113091791 113092852 113097882 113111472 113124847 113129759 113133514 113127398
2284.3 113127398 113087809 113014936 112926984 112835824 112743092 112646031 112539661 112422025 112285435 112109458 111892712
2306.7 111892712 111658227 111435497 111255360 111093462 110850835 110490108 110114467 109845889 109673536 109485400
2327.1 109485400 109256613 109096861 109044075 108983862 108865559 108745337 108686328 108801126 109246647 109769845
2347.5 109769845 109846938 109348595 108559263 107828498 107325733 107123852 107177615 107412922 107818568 108364892
2367.9 108364892 108978808 109608185 110217011 110801458 111380744 111934710 112403965 112747085 112963116 113075495
2388.3 113075495 113112724 113112652 113113534 113120329 113120461 113115525 113105714 113091564 113087237 113095367 113104784 113108575 113108599 113105023 113094807
2418.9 113094807 113087034 113084614 113079369 113071215 113068759 113072169 113070965 113069248 113075519 113079786 113073540 113066471 113064539 113064384
2447.5 113064384 113072872 113086057 113081038 113059688 113047945 113052285 113055634 113050699 113046169 113045800 113048887 113050008 113041306 113031268
2476 113031268 113030314 113030958 113024533 113012981 113004494 112999570 112992585 112984765 112979841 112979770 112983894 112981570 112968636 112960744 112957036
2506.6 112957036 112946987 112942028 112945199 112941289 112922978 112901270 112889671 112887251 112882769 112873411 112867522 112864256 112862420
2533.1 112862420 112870705 112882996 112882054 112867451 112850273 112841463 112846553 112855005 112852895 112841773 112833786 112830734 112823236
2559.6 112823236 112811279 112802684 112801349 112805820 112807953 112798440 112783122 112773144 112767482 112761259 112746966 112722099 112703121
2586.2 112703121 112702119 112708855 112707222 112693834 112677026 112666357 112662637 112656772 112644279 112629104 112615883 112606728 112602854
2612.7 112602854 112603068 112597716 112583995 112573302 112567973 112555730 112535834 112522602 112516892 112512052 112510133 112506175 112498534
2639.2 112498534 112495494 112490451 112472916 112451136 112439811 112437022 112430334 112415934 112399495 112385166 112368751 112348998
2663.7 112348998 112329924 112316096 112305319 112291348 112278569 112268019 112255800 112253201 112265933 112280393 112288904 112293303
2688.1 112293303 112301338 112318039 112333333 112343919 112352717 112354600 112349987 112345493 112340057 112330389 112326026 112325084 112312305
2714.6 112312305 112300766 112295866 112277079 112245059 112215734 112209535 112229383 112242699 112235022 112230515 112237263 112239778 112240565
2741.2 112240565 112245154 112238145 112219846 112213206 112224996 112238097 112238419 112233531 112231731 112226021 112207007 112181461 112162840
2767.7 112162840 112138498 112091923 112042069 112014341 111997950 111971927 111938858 111903644 111852515 111786211 111734045
2790.1 111734045 111696374 111644757 111576045 111512291 111462069 111408854 111340892 111251950 111147034 111047959 110945582
2812.5 110945582 110816169 110665333 110501623 110315287 110092080 109829390 109526002 109172535 108752298 108233321
2832.9 108233321 107561576 106657171 105418813 103702831 101370537 98434621 95126128 91892159 89359862
2851.3 89359862 88143629 88507110 90184212 92568260 95058227 97243363 98893577 99950683 100587523
2869.7 100587523 101132095 101814163 102582002 103201675 103511763 103505051 103244054 102790380 102187359 101469851
2890.1 101469851 100667155 99807876 98916203 97991508 97000539 95903295 94667828 93252748 91587508
2908.4 91587508 89589053 87221211 84525645 81627220 78779548 76362497 74745125 74115884 74450999
2926.8 74450999 75597960 77361089 79579854 82113963 84785420 87395090 89771342 91792542
2943.1 91792542 93372303 94454688 95058322 95318419 95473480 95762640 96312547 97133052 98193544
2961.4 98193544 99448758 100803983 102139592 103374553 104456973 105354023 106089365 106705046 107223141
2979.8 107223141 107668626 108048666 108352101 108584809 108744586 108823478 108830082 108751571 108568633 108264661
3000.2 108264661 107840419 107389426 107044613 106879699 106928682 107220614 107737803 108381593 109022653 109570086
3020.6 109570086 109991586 110316503 110580206 110763967 110869980 110944915 111024952 111110520 111163783 111178660
3041 111178660 111198986 111250257 111306679 111334729 111353970 111393452 111436570 111473632 111509192 111520576 111495388 111463642
3065.5 111463642 111474192 111536193 111603475 111631346 111608434 111561489 111536312 111547089 111579657 111629152 111676967
3087.9 111676967 111707795 111738551 111767757 111772466 111755645 111752427 111768198 111763132 111725175 111692297 111698699 111706281
3112.4 111706281 111663032 111611438 111606491 111649215 111724484 111790705 111813569 111804080 111796260 111807144 111809528 111779785
3136.8 111779785 111746371 111756647 111802554 111828685 111815703 111778879 111740255 111738813 111781752 111826980 111845469 111842930
3161.3 111842930 111844730 111857963 111863256 111861265 111863422 111865830 111861098 111849654 111845756 111854374 111864686 111875868 111885667
3187.8 111885667 111887133 111882675 111877608 111876523 111877358 111874759 111868715 111866629 111867249 111860037 111853504 111856937 111865306 111870790 111869526
3218.4 111869526 111874211 111883891 111879575 111868989 111858451 111817038 111763215 111776972 111845970 111888933 111889613 111860275
3242.9 111860275 111815786 111805189 111842549 111865878 111839497 111812639 111832714 111877823 111904359 111898005 111867940 111818051
3267.4 111818051 111751997 111716664 111738765 111782897 111824358 111844933 111843634 111847222 111853802 111836374 111783230 111734307
3291.8 111734307 111731744 111763871 111803973 111824536 111790013 111697280 111616898 111624110 111709988 111799598 111840713 111849856
3316.3 111849856 111851609 111844730 111815000 111770070 111762440 111805320 111847723 111853623 111814332 111747730 111709499 111717021
3340.8 111717021 111740100 111768222 111774004 111735916 111714280 111746764 111781418 111779809 111751127 111716974 111683130 111632276
3365.3 111632276 111575067 111565673 111636317 111725199 111756802 111751008 111748254 111754537 111764562 111764300 111730051 111646426 111574328
3391.8 111574328 111588454 111629677 111600852 111537755 111550963 111644614 111704326 111684465 111642540 111619067 111633980
3414.2 111633980 111680269 111697567 111679864 111681592 111690223 111661184 111615717 111594963 111571074 111517024 111493027 111532211
3438.7 111532211 111575294 111589158 111591852 111592317 111601925 111614048 111610091 111597693 111573088 111525488 111488259 111471295
3463.2 111471295 111416721 111325777 111309922 111417043 111536229 111569381 111521745 111469042 111504972 111574328 111578560
3485.6 111578560 111575687 111612499 111633003 111602533 111547339 111510837 111472631 111407363 111401975 111471224 111508191 111491621
3510.1 111491621 111455500 111431873 111432707 111420643 111360085 111258781 111205065 111238086 111283493 111322105 111355150 111341250
3534.5 111341250 111307764 111317503 111313057 111220860 111120868 111135840 111234736 111299133 111332238 111390400 111439776 111438751
3559 111438751 111408257 111355972 111236489 111136663 111239350 111441708 111558473 111583853 111572242 111542082 111497474
3581.5 111497474 111412692 111270654 111179912 111243689 111311805 111278939 111240005 111256742 111295557 111354744 111411858
3603.9 111411858 111401117 111355472 111366379 111393881 111404681 111402833 111333978 111300790 111405694 111489165 111385322
3626.3 111385322 111159456 111169887 111400998 111585057 111680651 111728156 111743677 111722243 111624420 111385047 111103153
3648.8 111103153 111141634 111438024 111609197 111614752 111654723 111751223 111828959 111831820 111712229 111514688 111427248
3671.2 111427248 111396646 111280119 111314964 111517262 111676371 111736584 111651099 111389208 111185229 111299360
3691.6 111299360 111511993 111618185 111643386 111609852 111549950 111573982 111632574 111575556 111411881 111362600 111532068
3714 111532068 111692166 111695027 111581433 111436999 111329937 111330318 111427760 111441731 111251307 111026049 111039913
3736.5 111039913 111266863 111471891 111484432 111353457 111329341 111330104 111274898 111374962 111560726 111637664 111643720
3758.9 111643720 111708558 111790085 111798513 111770964 111755192 111800504 111906183 111953199 111880624 111795545 111819553
3781.3 111819553 111882639 111922574 111955845 111963320 111957729 111922538 111819673 111731231 111661363 111591637 111638844 111699474
3805.8 111699474 111736858 111858916 111949885 111866570 111670208 111544800 111476386 111502349 111650574 111753976
3826.2 111753976 111794329 111785984 111710155 111613691 111504555 111420214 111459076 111583602 111725855 111856186 111898220
3848.6 111898220 111764050 111476660 111396646 111616540 111795628 111794913 111684108 111633039 111657333 111624730 111584151
3871.1 111584151 111645675 111773455 111865067 111805344 111704302 111694050 111704564 111762810 111803389 111770380 111815047
3893.5 111815047 111887848 111818361 111657178 111557865 111579812 111733723 111926031 112032580 112049723 112011063 111922431
3915.9 111922431 111852431 111865985 111899447 111904943 111931527 111956155 111913478 111873066 111911857 111972237 111999059 111988294
3940.4 111988294 111955452 111947083 111949873 111923027 111908281 111942053 111994565 112027586 112040269 112040162 112037671 112054467
3964.9 112054467 112069392 112057245 112026989 111986339 111961591 111983359 112026882 112048292 112048590 112059116 112079227 112078941
3989.4 112078941 112060857 112043977 112035704 112043381
3997.5 112043381
##END=$$ End of the data block
