##TITLE=$$ Begin of the data block
##JCAMP-DX=5.00 $$ ACD/SpecManager v 10.08
##SPECTROMETER/DATA SYSTEM=Alpha
##DATE=27 Jun 2014 15:13:00
##DATA TYPE=INFRARED SPECTRUM
##DATA CLASS=XYDATA
##ORIGIN=
##OWNER=
##NPOINTS=1667
##FIRSTX=599.63549805
##LASTX=3997.56909180
##MAXX=3997.56909180
##MINX=599.63549805
##MAXY=1.13405502
##MINY=0.74431837
##XFACTOR=1.0000000000
##YFACTOR=0.000000010000000
##FIRSTY=1.03884149
##DELTAX=2.03957605
##XUNITS=1/CM
##YUNITS=ARBITRARY UNITS
##XYDATA=(X++(Y..Y))
$$ plain form
599.6 103884149 103890908 103954053 104028511 104097807 104155147 104220331 104273713 104264188 104272318 104359388 104460788 104540849
624.1 104540849 104588187 104615009 104636991 104643595 104626763 104599559 104565358 104512715 104448283 104355979 104237747 104162419
648.6 104162419 104175663 104215217 104211271 104180014 104174459 104212797 104242992 104020596 103326309 102999640 103496885
671 103496885 103788114 103742313 103646278 103587067 103548002 103526759 103518641 103524005 103557849 103601539 103625846 103629291
695.5 103629291 103622782 103598738 103514624 103330064 103041065 102663517 102266192 101945651 101705885 101480734
715.9 101480734 101235485 101069427 101141226 101434338 101815617 102192521 102511251 102776837 103039265 103315961
736.3 103315961 103584957 103831983 104065859 104285061 104466355 104601943 104719031 104834580 104925990 104988968
756.7 104988968 105061805 105152452 105234468 105305219 105373847 105436039 105479968 105511761 105553961 105613077 105676913 105738044
$$ packed form
599.6A03884149O759O3145P4458O9296N7340O5184N3382r525Q130Q7070J01400Q0061
624.1A04540849M7338K6822K1982O604j6832k7204l4201n2643o4432r2304j18232p5328
648.6A04162419J3244L9554l946l1257n555L8338L0195k22396o94287l26669M97245
671A03496885K91229m5801r6035n9211l9065k1243q118N364L3844M3690K4307L445
695.5A03629291o509k4044q4114j84560k88999l77548l97325l20541k39766k25151
715.9A01480734k45249j66058P1799K93112L81279L76904L18730K65586K62428K76696
736.3A03315961K68996K47026K33876K19202J81294J35588J17088J15549R1410O2978
756.7A04988968P2837R0647Q2016P0751O8628O2192M3929L1793M2200N9116O3836O1131
$$ plain form
781.2 105738044 105800354 105869472 105948126 106011951 106042206 106058753 106070960 106084847 106110990 106133556 106132448 106107318
805.6 106107318 106073666 106047404 106025028 105993390 105971038 105980599 105999207 106016886 106045783 106066251 106052887 106015611
830.1 106015611 105978870 105952883 105935013 105925059 105931127 105939412 105935609 105942285 105981326 106027830 106044650 106049228 106069815
856.6 106069815 106096399 106107593 106099844 106079817 106045079 105999029 105949140 105900514 105873239 105884671 105922639 105962014
881.1 105962014 105989265 106024027 106081760 106132102 106152463 106138301 106070435 105971372 105913997 105922019 105969596 106020617
905.6 106020617 106039703 106028640 106011593 106003165 106006730 106021249 106023884 105976534 105898547 105867064 105914485 105999923
930 105999923 106079519 106128323 106140506 106142843 106161082 106188846 106218886 106244421 106241119 106208658 106166518 106123435
954.5 106123435 106085408 106063187 106062400 106076646 106098509 106119013 106130409 106122959 106089115 106037903 105997217 105994046
$$ packed form
781.2A05738044O2310O9118P8654O3825L0255J6547J2207J3887K6143K2566j108k5130
805.6A06107318l3652k6262k2376l1638k2352R561J8608J7679K8897K0468j3364l7276
830.1A06015611l6741k5987j7870r954O068Q285l803O676L9041M6504J6820M578K0587
856.6A06069815K6584J1194p749k0027l4738m6050m9889m8626k7275J1432L7968L9375
881.1A05962014K7251L4762N7733N0342K0361j4162o7866r9063n7375Q022M7577N1021
905.6A06020617J9086j1063j7047q428L565J4519K635m7350p7987l1483M7421Q5438
930A05999923P9596M8804J2183K337J8239K7764L0040K5535l302l2461m2140m3083
954.5A06123435l8027k2221p87J4246K1863K0504J1396p450l3844n1212m0686l171
$$ plain form
979 105994046 106024826 106067109 106101573 106140089 106200027 106256902 106287408 106298077 106300592 106295264 106277919 106251073
1003.5 106251073 106210947 106152928 106100094 106086874 106114924 106139994 106120253 106070518 106031322 106009507 105984426
1025.9 105984426 105959153 105960453 105986178 105998003 105956984 105828202 105594897 105338693 105214119 105254185 105348468
1048.3 105348468 105435777 105534017 105641580 105725741 105765009 105779719 105807185 105850339 105880165 105879688 105853176 105803144
1072.8 105803144 105718803 105577123 105364680 105108070 104850745 104606843 104359138 104090786 103814530 103552008
1093.2 103552008 103316963 103136837 103041589 103037834 103107393 103219342 103331733 103392696 103372765 103286445 103184140
1115.6 103184140 103137183 103202045 103374076 103584564 103734410 103737724 103585684 103308952 102885544 102302015
1136 102302015 101632905 100990975 100439095 99972731 99570835 99206227 98837513 98441535 98027283 97636384
$$ packed form
979A05994046L0780M2283L4464L8516N9938N6875L0506J0669K515n328j7345k6846
1003.5A06251073m0126n8019n2834j3220K8050K5070j9741m9735l9196k1815k5081
1025.9A05984426k5273J300K5725J1825m1019j28782k33305k56204j24574M0066R4283
1048.3A05348468Q7309R8240J07563Q4161L9268J4710K7466M3154K9826m77k6512n0032
1072.8A05803144q4341j41680k12443k56610k57325k43902k47705k68352k76256k62522
1093.2A03552008k35045j80126r5248l755O9559J11949J12391O0963j9931q6320j02305
1115.6A03184140m6957O4862J72031K10488J49846L314j52040k76732m23408n83529
1136A02302015o69110o41930n51880m66364m01896l64608l68714l95978m14252l90899
$$ plain form
1156.4 97636384 97321379 97105253 96989131 96959317 96992534 97077578 97217464 97429574 97735554 98129958
1176.8 98129958 98585033 99080610 99596566 100103688 100566816 100962555 101301181 101600659 101870608 102132094
1197.2 102132094 102403092 102671337 102907217 103094602 103230679 103319073 103380120 103432631 103484166 103532839
1217.6 103532839 103554142 103529143 103467655 103384495 103292167 103204620 103126216 103056991 103001285 102972078 102987206
1240.1 102987206 103054786 103173733 103336477 103531396 103732383 103905320 104040611 104151142 104253447 104360652
1260.4 104360652 104463685 104545975 104617345 104692090 104777575 104873550 104962862 105030477 105081224 105147636 105261552
1282.9 105261552 105413771 105570459 105710196 105826449 105912101 105970204 106012702 106042004 106073546 106132436 106221771
1305.3 106221771 106321251 106404483 106466591 106527293 106585288 106621671 106667840 106756341 106860232 106952739 107032251
$$ packed form
1156.4I7636384l15005k16126j16122k9814L3217Q5044J39886K12110L05980L94404
1176.8I8129958M55075M95577N15956N07122M63128L95739L38626K99478K69949K61486
1197.2A02132094K70998K68245K35880J87385J36077Q8394O1047N2511N1535M8673
1217.6A03532839K1303k4999o1488q3160r2328q7547p8404o9225n5706k9207J5128
1240.1A02987206O7580J18947J62744J94919K00987J72937J35291J10531J02305J07205
1260.4A04360652J03033Q2290P1370P4745Q5485R5975Q9312O7615N0747O6412J13916
1282.9A05261552J52219J56688J39737J16253Q5652N8103M2498K9302L1542N8890Q9335
1305.3A06221771R9480Q3232O2108O0702N7995L6383M6169Q8501J03891R2507P9512
$$ plain form
1327.8 107032251 107095218 107119691 107081711 106976414 106838739 106767023 106800532 106839156 106823897 106784165 106742823
1350.2 106742823 106698024 106650507 106616950 106584585 106517112 106469381 106525636 106593847 106596625 106536937 106352496
1372.6 106352496 106080770 105907083 105952275 106224144 106592095 106903529 107184100 107499206 107713687 107727671
1393 107727671 107682192 107748175 107944500 108213711 108434522 108604169 108732760 108709967 108516395 108225024
1413.4 108225024 107875168 107566798 107569361 107838619 108050764 108122575 108004391 107713163 107409430 107080925
1433.8 107080925 106658423 106389141 106313741 106175792 105934858 105624199 105277741 104921186 104442585 103746712
1454.2 103746712 102886307 102463901 102595127 102564812 102252400 102292907 103101933 104448009 106101322 107534993
1474.6 107534993 108462286 109064388 109469831 109755433 109891367 109858572 109839809 110049665 110276222 110261428
$$ packed form
1327.8A07032251O2967K4473l7980j05297j37675p1716L3509L8624j5259l9732m1342
1350.2A06742823m4799m7517l3557l2365o7473m7731N6255O8211K778n9688j84441
1372.6A06352496k71726j73687M5192K71869L67951L11434K80571L15106K14481J3984
1393A07727671m5479O5983J96325K69211K20811J69647J28591k2793j93572k91371
1413.4A08225024l49856l08370K563K69258K12145P1811j18184k91228l03733l28505
1433.8A07080925m22502k69282p5400j37949k40934l10659l46458l56555m78601o95873
1454.2A03746712q60405m22406J31226l0315l12412M0507Q09026J346076J653313J433671
1474.6A07534993R27293O02102M05443K85602J35934l2795j8763K09856K26557j4794
$$ plain form
1495 110261428 110141277 110187244 110339677 110344207 110050821 109870100 110218585 110562682 110655546 110555100 110443163
1517.4 110443163 110371077 110361278 110512424 110686862 110853028 110960650 110902739 110861051 110895824 110685313 110299230
1539.9 110299230 110328150 110665619 110975468 111112225 111114252 111083186 110969138 110671413 110358417 110695493
1560.3 110695493 111192238 111374831 111373734 111310291 111366022 111476016 111420441 111399639 111597323 111762655 111818552
1582.7 111818552 111839259 111853874 111857450 111856854 111857581 111868608 111893988 111900175 111869717 111843932 111838114 111834216 111857951
1609.2 111857951 111906421 111865079 111704850 111664164 111761010 111730587 111655879 111692822 111762726 111836553 111813068
1631.6 111813068 111567795 111341727 111494958 111709881 111724222 111505723 111161351 111061537 111069560 110837483
1652 110837483 110850775 111261439 111474299 111434782 111326551 111320210 111270905 111076069 111015534 111141205 111261249
$$ packed form
1495A10261428j20151M5967J52433M530k93386j80721L48485L44097R2864j00446j11937
1517.4A10443163p2086r799J51146J74438J66166J07622n7911m1688L4773k10511l86083
1539.9A10299230K8920L37469L09849J36757K027l1066j14048k97725l12996L37076
1560.3A10695493M96745J82593j097o3443N5731J09994n5575k0802J97684J65332N5897
1582.7A11818552K0707J4615L576n96P27J1027K5380O187l0458k5785n818l898K3735
1609.2A11857951M8470m1342j60229m0686R6846l0423p4708L6943O9904P3827k3485
1631.6A11813068k45273k26068J53231K14923J4341k18499l44372r9814Q023k32077
1652A10837483J3292M10664K12860l9517j08231o341m9305j94836o0535J25671J20044
$$ plain form
1674.5 111261249 111422753 111534870 111419117 111116707 111033785 111287892 111444616 111469018 111354244 111020732
1694.9 111020732 110658443 110397708 110298479 110324574 110248423 110148954 110087085 109927344 109594643 109082806
1715.3 109082806 108530891 108208477 107891631 107267141 106349981 105180883 103704679 101846778 99108440
1733.6 99108440 96182048 93804377 91134542 88582581 86984628 86432105 87038636 89014786 92164487
1752 92164487 95539892 98824602 101893437 104364514 106370723 107871401 108809102 109378028 109740067
1770.3 109740067 110109282 110569572 110930514 111128247 111262774 111404586 111553812 111683178 111706483 111619842
1790.7 111619842 111648810 111823392 111932731 111950791 111993718 112120914 112246847 112297225 112287760 112311208 112396896
1813.2 112396896 112471938 112514746 112559128 112571847 112519896 112470841 112444925 112451148 112567735 112699187 112740862
$$ packed form
1674.5A11261249J61504J12117j15753l02410q2922K54107J56724K4402j14774l33512
1694.9A11020732l62289k60735r9229K6095p6151r9469o1869j59741l32701n11837
1715.3A09082806n51915l22414l16846o24490r17160j169098j476204j857901k738338
1733.6I9108440k926392k377671k669835k551961j597953n52523O06531J976150L149701
1752I2164487L375405L284710L068835K471077K006209J500678R37701N68926L62039
1770.3A09740067L69215M60290L60942J97733J34527J41812J49226J29366K3305q6641
1790.7A11619842K8968J74582J09339J8060M2927J27196J25933N0378r465K3448Q5688
1813.2A12396896P5042M2808M4382J2719n1951m9055k5916O223J16587J31452M1675
$$ plain form
1835.6 112740862 112756824 112761927 112688196 112601197 112651169 112771499 112863445 112924671 112958407 112972069 112971306 112969398
1860.1 112969398 112965608 112927878 112821889 112739849 112820470 112963319 113035727 113054883 113065505 113072526 113074505 113075352
1884.6 113075352 113053393 113008332 113015616 113059592 113077044 113100946 113134408 113148463 113149786 113145399 113126433 113113081
1909 113113081 113139725 113177967 113158369 113095796 113078713 113095033 113118863 113170171 113211179 113221085 113224220 113230896
1933.5 113230896 113238323 113237751 113203025 113148463 113152874 113213730 113256514 113268876 113273048 113275778 113280678 113286507 113286209
1960 113286209 113286722 113280809 113263679 113270617 113300049 113314819 113317156 113323593 113334179 113338566 113333607 113328338 113321853 113302767
1988.6 113302767 113274527 113272560 113305461 113331676 113338721 113343406 113348329 113348889 113341999 113331079 113326836 113323784 113307309
2015.1 113307309 113292277 113296998 113309550 113320088 113325393 113322723 113318777 113318992 113322079 113325787 113328135 113320184 113307893
$$ packed form
1835.6A12740862J5962N103p3731q6999M9972J20330R1946O1226L3736J3662p63j908
1860.1A12969398l790l7730j05989q2040Q0621J42849P2408J9156J0622P021J979Q47
1884.6A13075352k1959m5061P284M3976J7452K3902L3462J4055J323m387j8966j3352
1909A13113081K6644L8242j9598o2573j7083J6320K3830N1308M1008R906L135O676
1933.5A13230896P427n72l4726n4562M411O0856M2784J2362M172K730M900N829k98
1960A13286209N13n913j7130O938K9432J4770K337O437J0586M387m959n269o485j9086
1988.6A13302767k8240j967L2901K6215P045M685M923N60o890j0920m243l052j6475
2015.1A13307309j5032M721J2552J0538N305k670l946K15L087L708K348p951j2291
$$ plain form
2041.6 113307893 113311791 113329208 113341022 113341594 113339341 113336217 113332450 113330519 113330901 113332832 113334358 113339245 113348353 113353729
2070.2 113353729 113352907 113350666 113350880 113354075 113359082 113366151 113370311 113368332 113367951 113372695 113379037 113383913 113386035 113386953 113389289
2100.7 113389289 113394856 113400126 113397694 113391244 113390863 113391924 113391912 113398814 113404548 113400173 113393855 113395035 113403594 113405502 113394582
2131.3 113394582 113383460 113378167 113381052 113392591 113398063 113391578 113386667 113387299 113384128 113376260 113371742 113373399 113376713 113376403
2159.9 113376403 113367736 113354671 113352382 113364899 113379729 113389480 113390672 113379836 113366771 113359392 113357067 113360488 113363469
2186.4 113363469 113364542 113371062 113383484 113394535 113396657 113390291 113384748 113382792 113382232 113381982 113378298 113377571 113378620 113372779
2215 113372779 113368106 113365686 113361716 113362467 113365424 113363671 113361192 113359499 113352799 113343966 113339114 113334429 113324535 113312423 113306010
2245.6 113306010 113303268 113297665 113287961 113269389 113243616 113222396 113209426 113198268 113184774 113169861 113157225 113152575
$$ packed form
2041.6A13307893L898J7417J1814N72k253l124l767j931L82J931J526M887R108N376
2070.2A13353729q22k241K14L195N007P069M160j979l81M744O342M876K122R18K336
2100.7A13389289N567N270k432o450l81J061j2O902N734m375o318J180Q559J908j0920
2131.3A13394582j1122n293K885J1539N472o485m911O32l171p868m518J657L314l10
2159.9A13376403q667j3065k289J2517J4830R751J192j0836j3065p379k325L421K981
2186.4A13363469J073O520J2422J1051K122o366n543j956n60k50l684p27J049n841
2215A13372779m673k420l970P51K957j753k479j693o700q833m852m685r894j2112o413
2245.6A13306010k742n603r704j8572k5773k1220j2970j1158j3494j4913j2636m650
$$ plain form
2270 113152575 113157439 113167918 113179779 113190317 113199961 113208032 113197935 113151431 113075268 112988794 112901223 112806201
2294.5 112806201 112698007 112580991 112457871 112316275 112132096 111903918 111659503 111429715 111241126 111065805
2314.9 111065805 110808885 110437310 110051453 109771085 109577453 109359407 109109473 108943069 108892095 108838308
2335.3 108838308 108724642 108606005 108546734 108663905 109132767 109684825 109759796 109222138 108386970 107638884
2355.7 107638884 107130623 106908798 106940722 107177544 107614970 108207917 108857083 109504151 110136867 110760570
2376.1 110760570 111378014 111961055 112452924 112814093 113038886 113147366 113182724 113189185 113191950 113192856 113187480
2398.5 113187480 113181162 113172889 113163185 113165188 113177633 113186550 113185585 113181663 113178432 113168776 113157678 113154411 113155222 113150573
2427.1 113150573 113145864 113148546 113146400 113139808 113143122 113147378 113139451 113133132 113137293 113139749 113143194 113154316 113156486 113140225
$$ packed form
2270A13152575M864J0479J1861J0538R644Q071j0097m6504p6163q6474q7571r5022
2294.5A12806201j08194j17016j23120j41596j84179k28178k44415k29788j88589j75321
2314.9A11065805k56920l71575l85857k80368j93632k18046k49934j66404n0974n3787
2335.3A08838308j13666j18637n9271J17171M68862N52058P4971n37658q35168p48086
2355.7A07638884n08261k21825L1924K36822M37426N92947O49166O47068O32716O23703
2376.1A10760570O17444N83041M91869L61169K24793J08480L5358O461K765R06n376
2398.5A13187480o318q273r704K003J2445Q917r65l922l231r656j1098l267Q11m649
2427.1A13150573m709K682k146o592L314M256p927o319M161K456L445J1122K170j6261
$$ plain form
2455.6 113140225 113119650 113104951 113099909 113103330 113099694 113091385 113093722 113096285 113086665 113074076 113070452 113075113 113077819
2482.1 113077819 113072848 113069284 113070428 113067603 113061357 113056028 113052678 113051641 113048100 113036454 113022995 113012898 113004220
2508.7 113004220 113004196 113010120 113006008 112991202 112976527 112965524 112956870 112949955 112946820 112945843 112937224 112926328 112929749 112938488
2537.2 112938488 112934256 112920833 112910366 112910187 112918127 112922394 112914228 112900209 112893927 112892365 112888110 112882984 112877202 112871969
2565.8 112871969 112869477 112865853 112856984 112843871 112829876 112819886 112813747 112803090 112786067 112774098 112773216 112774122 112764704
2592.3 112764704 112748301 112741339 112742496 112736976 112730157 112726831 112713253 112691295 112675214 112671471 112678707 112680674 112669075
2618.8 112669075 112653458 112637389 112619519 112607133 112602973 112594163 112580585 112575114 112570977 112561226 112556314 112555420 112545264
2645.3 112545264 112524545 112506640 112497890 112491679 112488198 112491012 112486124 112461150 112432694 112410712 112385333 112362552
$$ packed form
2455.6A13140225k0575j4699n042L421l636q309K337K563r620j2589l624M661K706
2482.1A13077819m971l564J144k825o246n329l350j037l541j1646j3459j0097q678
2508.7A13004220k4N924m112j4806j4675j1003q654o915l135r77q619j0896L421Q739
2537.2A12938488m232j3423j0467j79P940M267q166j4019o282j562m255n126n782n233
2565.8A12871969k492l624q869j3113j3995r990o139j0657j7023j1969q82R06r418
2592.3A12764704j6403o962J157n520o819l326j3578k1958j6081l743P236J967j1599
2618.8A12669075j5617j6069j7870j2386m160q810j3578n471m137r751m912q94j0156
2645.3A12545264k0719j7905q750o211l481K814m888k4974k8456k1982k5379k2781
$$ plain form
2669.8 112362552 112354934 112358391 112357593 112345529 112342870 112361312 112377274 112382770 112387311 112391794 112401700 112415993 112429297
2696.3 112429297 112438917 112439132 112436604 112440395 112445438 112445021 112440026 112427390 112406135 112396312 112396288 112377191 112339854 112307906
2724.8 112307906 112302554 112322140 112336671 112332940 112328815 112333322 112340355 112345135 112341762 112327063 112312436 112312865 112330258
2751.4 112330258 112350070 112351000 112338519 112332070 112326288 112311232 112297153 112286329 112254870 112199318 112150049 112127054
2775.8 112127054 112119782 112105060 112072027 112026298 111967397 111895871 111843038 111817861 111774969 111695158 111618555 111570776
2800.3 111570776 111528575 111465943 111376071 111271846 111179352 111090660 110971820 110823345 110661602 110474813
2820.7 110474813 110248601 109989870 109692931 109340823 108924496 108413470 107750678 106857502 105630124
2839.1 105630124 103929007 101611984 98682410 95383257 92165697 89643174 88426262 88783097
$$ packed form
2669.8A12362552p618L457p98j2064k659J8442J5962N496M541M483R906J4293J3304
2696.3A12429297R620K15k528L791N043m17m995j2636k1255r823k4j9097l7337l1948
2724.8A12307906n352J9586J4531l731m125M507P033M780l373j4699j4627M29J7393
2751.4A12330258J9812R30j2481o449n782j5056j4079j0824l1459n5552m9269k2995
2775.8A12127054p272j4722l3033m5729n8901p1526n2833k5177m2892p9811p6603m7779
2800.3A11570776m2201o2632q9872j04225r2494q8692j18840j48475j61743j86789
2820.7A10474813k26212k58731k96939l52108m16327n11026o62792q93176j227378
2839.1A05630124j701117k317023k929574l299153l217560k522523j216912L56835
$$ plain form
2855.4 88783097 90453649 92832571 95317543 97497958 99140793 100193012 100827372 101363313 102037525
2873.7 102037525 102803922 103420019 103722763 103714740 103459382 103010333 102406776 101685286 100883126 100033581
2894.1 100033581 99156821 98243022 97256559 96165472 94940048 93528795 91862416 89871281 87516320
2912.5 87516320 84826809 81925917 79081815 76677334 75064564 74431837 74765295 75910747 77666128
2930.8 77666128 79876381 82409298 85077894 87675601 90041834 92060435 93634307 94710749
2947.2 94710749 95321059 95590144 95738029 96005040 96535885 97355533 98424792 99680209 101022518
2965.5 101022518 102339435 103561485 104638767 105535662 106270361 106875980 107383990 107831311 108216035
2983.9 108216035 108518302 108747005 108905518 108986998 108996034 108919001 108737624 108436489 108019257 107573736
$$ packed form
2855.4H8783097J670552K378922K484972K180415J642835J052219O34360N35941O74212
2873.7A02037525P66397O16097L02744q023k55358m49049o03557p21490q02160q49545
2894.1A00033581q76760r13799r86463j091087j225424j411253j666379j991135k354961
2912.5H7516320k689511k900892k844102k404481j612770o32727L33458J145452J755381
2930.8G7666128K210253K532917K668596K597707K366233K018601J573872J076442
2947.2I4710749O10310K69085J47885K67011N30845Q19648J069259J255417J342309
2965.5A01022518J316917J222050J077282Q96895P34699O05619N08010M47321L84724
2983.9A08216035L02267K28703J58513Q1480R036p7033j81377l01135m17232m45521
$$ plain form
3004.3 107573736 107229590 107063639 107108378 107397974 107913530 108549249 109180152 109722531 110150182 110482621
3024.7 110482621 110739076 110906124 110999680 111074650 111167455 111264634 111319935 111333346 111348772 111396575 111458230
3047.1 111458230 111492002 111507642 111535025 111572230 111615384 111654079 111665452 111646569 111618102 111627698 111694658 111761868
3071.6 111761868 111777079 111748874 111712360 111698878 111711609 111740112 111794400 111852694 111881268 111903930 111933327
3094 111933327 111942089 111922836 111907172 111915112 111915958 111885595 111854887 111861062 111871517 111832774 111782169 111778045 111822832
3120.5 111822832 111898839 111965966 111985195 111965787 111955392 111976349 111989522 111958432 111919332 111929727 111973572
3143 111973572 111998749 111992407 111962616 111925972 111919487 111946869 111971784 111986017 111998260 112009239 112018752 112021291 112019563
3169.5 112019563 112023640 112031901 112032795 112024283 112020302 112025630 112029684 112030828 112032104 112035882 112042868 112044358 112043202 112050915
$$ packed form
3004.3A07573736l44146j65951M4739K89596N15556O35719O30903N42379M27651L32439
3024.7A10482621K56455J67048R3556P4970R2805R7179N5301J3411J5426M7803O1655
3047.1A11458230L3772J5640K7383L7205M3154L8695J1373j8883k8467R596O6960O7210
3071.6A11761868J5211k8205l6514j3482J2731K8503N4288N8294K8574K2662K9397
3094A11933327Q762j9253j5664P940Q46l0363l0708O175J0455l8743n0605m124M4787
3120.5A11822832P6007O7127J9229j9408j0395K0957J3173l1090l9100J0395M3845
3143A11973572K5177o342k9791l6644o485K7382K4915J4233J2243J0979R513K539j728
3169.5A12019563M077Q261Q94q512l981N328M054J144J276L778O986J490j156P713
$$ plain form
3198 112050915 112055206 112045789 112038577 112040401 112042463 112039936 112035954 112034094 112032449 112036991 112052703 112059116 112048364 112042189
3226.6 112042189 112032092 111981833 111919653 111927867 111998010 112046516 112046409 112014854 111972606 111962533 112001348 112030613
3251.1 112030613 112008500 111976528 111987150 112023973 112038994 112027204 112003958 111961043 111894250 111850441 111859965 111901832
3275.5 111901832 111960030 112003171 112012672 112010431 112003005 111973560 111916018 111865294 111860168 111893177 111935902 111955893
3300 111955893 111913764 111820674 111754513 111769199 111851692 111936188 111975718 111992145 111997628 111983526 111948323 111905456
3324.5 111905456 111900342 111940849 111975479 111973011 111933255 111869597 111838949 111866498 111900818 111919725 111916935 111875260
3348.9 111875260 111851382 111889315 111931300 111932456 111901093 111864698 111834121 111782229 111720955 111706781 111772037 111872005
3373.4 111872005 111916697 111898053 111877167 111879921 111890125 111890101 111862135 111791873 111734581 111751175 111772108 111714232
$$ packed form
3198A12050915M291r417p212J824K062k527l982j860j645M542J5712O413j0752o175
3226.6A12042189j0097n0259o2180Q214P0143M8506j07l1555m2248j0073L8815K9265
3251.1A12030613k2113l1972J0622L6823J5021j1790k3246m2915o6793m3809R524M1867
3275.5A11901832N8198M3141R501k241p426k9445n7542n0724n126L3009M2725J9991
3300A11955893m2129r3090o6161J4686Q2493Q4496L9530J6427N483j4102l5203m2867
3324.5A11905456n114M0507L4630k468l9756o3658l0648K7549L4320J8907k790m1675
3348.9A11875260k3878L7933M1985J156l1363l6395l0577n1892o1274j4174O5256R9968
3373.4A11872005M4692j8644k0886K754J0204k4k7966p0262n7292J6594K0933n7876
$$ plain form
3397.9 111714232 111639714 111664474 111768329 111820018 111790216 111750770 111738670 111763120 111806846 111814034 111788380
3420.3 111788380 111785340 111794710 111778009 111744988 111719799 111682975 111624718 111602628 111643362 111693013 111708128 111696970
3444.8 111696970 111685109 111692941 111713588 111728466 111728024 111694515 111636472 111602914 111593020 111543381 111452997 111428618
3469.3 111428618 111526906 111642420 111670268 111618781 111565506 111599183 111673629 111687112 111679137 111705148 111722922
3491.7 111722922 111691320 111630797 111587477 111553717 111505771 111516583 111593139 111630058 111607349 111556756 111520100
3514.2 111520100 111522043 111523342 111476731 111376560 111302018 111310315 111350906 111389756 111421096 111411047 111383653 111401868
3538.6 111401868 111397552 111290336 111183155 111210966 111313879 111366463 111397672 111461556 111509490 111501884 111463523
3561.1 111463523 111402452 111275232 111178482 111297047 111516893 111641276 111660099 111637318 111600101 111558652 111479330
$$ packed form
3397.9A11714232p4518K4760J03855N1689k9802l9446j2100K4450M3726P188k5654
3420.3A11788380l040R370j6701l3021k5189l6824n8257k2090M0734M9651J5115j1158
3444.8A11696970j1861P832K0647J4878m42l3509n8043l3558r894m9639r0384k4379
3469.3A11428618R8288J15514K7848n1487n3275L3677P4446J3483p975K6011J7774
3491.7A11722922l1602o0523m3320l3760m7946J0812P6556L6919k2709n0593l6656
3514.2A11520100J943J299m6611j00171p4542Q297M0591L8850L1340j0049k7394J8215
3538.6A11401868m316j07216j07181K7811J02913N2584L1209O3884M7934p606l8361
3561.1A11463523o1071j27220r6750J18565K19846J24383J8823k2781l7217m1449p9322
$$ plain form
3583.5 111479330 111328030 111225438 111297452 111381245 111351848 111309278 111325955 111364746 111423063 111481702 111473691
3605.9 111473691 111426079 111423814 111437583 111445260 111447382 111385334 111357033 111462033 111541057 111429799 111199307
3628.4 111199307 111217034 111451197 111626160 111724031 111779094 111788440 111771834 111696100 111451602 111138761 111178100
3650.8 111178100 111485291 111647391 111642516 111692488 111810458 111899436 111901140 111778522 111571443 111472917 111441779
3673.2 111441779 111327314 111371207 111578310 111730170 111793828 111734545 111492121 111263418 111342108 111545670
3693.6 111545670 111658454 111685646 111647272 111596477 111633980 111684000 111607659 111441588 111404395 111582148 111748171
3716.1 111748171 111751175 111625326 111467874 111363435 111366451 111447716 111447155 111258316 111035705 111053884 111288524
3738.5 111288524 111491466 111496162 111366093 111352873 111348224 111271679 111381769 111593974 111675274 111675858 111743557
$$ packed form
3583.5A11479330j51300j02592P2014Q3793k9397m2570J6677L8791N8317N8639q011
3605.9A11473691m7612k265J3769P677K122o2048k8301J05000P9024j11258k30492
3628.4A11199307J7727K34163J74963R7871N5063R346j6606p5734k44498l12841L9339
3650.8A11178100L07191J62100m875M9972J17970Q8978J704j22618k07079r8526l1138
3673.2A11441779j14465M3893K07103J51860O3658n9283k42424k28703P8690K03562
3693.6A11545670J12784K7192l8374n0795L7503N0020p6341j66071l7193J77753J66023
3716.1A11748171L004j25849j57452j04439L016Q1265n61j88839k22611J8179K34640
3738.5A11288524K02942M696j30069j3220m649p6545J10090K12205Q1300N84O7699
$$ plain form
3760.9 111743557 111828268 111835587 111805463 111782515 111819518 111926663 111989272 111933196 111844420 111860681 111927295
3783.4 111927295 111967957 112003374 112015498 112008512 111976480 111879325 111782956 111696601 111612880 111661899 111739004 111790562
3807.8 111790562 111918676 112005055 111911702 111716461 111591983 111507320 111526275 111691082 111809945 111848819
3828.2 111848819 111830771 111755776 111669397 111566782 111483586 111529267 111665308 111809039 111929631 111960173 111822832
3850.7 111822832 111541784 111464858 111681521 111854458 111846483 111741412 111708975 111735618 111689293 111637616 111694956
3873.1 111694956 111825848 111922669 111872387 111785185 111767757 111746204 111788094 111848938 111844766 111899364 111973071
3895.5 111973071 111901021 111728156 111614442 111620045 111762762 111959100 112079346 112105787 112065840 111978662 111919463
3918 111919463 111947846 111990643 111987805 111997032 112014711 111968219 111908519 111931682 112006092 112062407 112072062 112052262
$$ packed form
3760.9A11743557Q4711P319l0124k2948L7003J07145O2609n6076q8776J6261O6614
3783.4A11927295M0662L5417J2124o986l2032r7155r6369q6355q3721M9019P7105N1558
3807.8A11790562J28114Q6379r3353j95241j24478q4663J8955J64807J18863L8874
3828.2A11848819j8048p4995q6379j02615q3196M5681J36041J43731J20592L0542j37341
3850.7A11822832k81048p6926K16663J72937p975j05071l2437K6643m6325n1677N7340
3873.1A11694956J30892R6821n0282q7202j7428k1553M1890O0844m172N4598P3707
3895.5A11973071p2050j72865j13714N603J42717J96338J20246K6441l9947q7178n9199
3918A11919463K8383M2797k838R227J7679m6492n9700K3163P4410N6315R655j9800
$$ plain form
3942.5 112052262 112052357 112045801 112007451 111998594 112042201 112095463 112123883 112137520 112144828 112146461 112155855 112157679 112140977
3969 112140977 112117624 112086284 112063491 112079215 112113738 112124395 112116945 112127054 112152135 112157035 112127805 112093091
3993.4 112093091 112085116 112096989
3997.5 112096989
$$ packed form
3942.5A12052262R5o556l8350q857M3607N3262K8420J3637P308J633R394J824j6702
3969A12140977k3353l1340k2793J5724L4523J0657p450J0109K5081M900k9230l4714
3993.4A12093091p975J1873
3997.5A12096989
##END=$$ End of the data block
