##TITLE=$$ Begin of the data block
##JCAMP-DX=5.00 $$ ACD/SpecManager v 10.08
##SPECTROMETER/DATA SYSTEM=Alpha
##DATE=27 Jun 2014 15:13:00
##DATA TYPE=INFRARED SPECTRUM
##DATA CLASS=XYDATA
##ORIGIN=
##OWNER=
##NPOINTS=1667
##FIRSTX=599.63549805
##LASTX=3997.56909180
##MAXX=3997.56909180
##MINX=599.63549805
##MAXY=1.13412642
##MINY=0.74756080
##XFACTOR=1.0000000000
##YFACTOR=0.000000010000000
##FIRSTY=1.03927946
##DELTAX=2.03957605
##XUNITS=1/CM
##YUNITS=ARBITRARY UNITS
##XYDATA=(X++(Y..Y))
599.6 103927946 103922963 104022682 104101479 104148078 104207408 104278576 104313374 104301023 104341662 104441702 104519320 104582059
624.1 104582059 104629123 104644799 104634464 104594386 104545403 104525769 104527915 104512441 104454458 104348159 104224396
646.5 104224396 104142404 104135311 104147923 104133010 104124725 104152429 104205525 104242015 104028547 103323293 102952385
669 102952385 103434587 103738534 103696108 103597164 103540266 103497910 103473997 103480661 103502476 103528094 103560185 103594315
693.5 103594315 103607476 103607345 103605437 103552115 103383005 103088307 102702916 102303004 101984704 101753366 101529562
715.9 101529562 101277113 101116109 101197135 101476157 101837182 102210593 102530527 102798939 103069210 103349280
736.3 103349280 103614032 103851032 104073048 104279935 104449105 104583204 104709804 104837358 104943752 105020785
756.7 105020785 105097210 105179334 105248272 105303633 105350661 105396342 105438066 105481386 105542326 105603790 105656457 105724633
781.2 105724633 105801797 105867708 105934489 105980468 105988669 105999315 106031847 106072092 106096172 106101155 106099367 106084478
805.6 106084478 106067085 106063461 106051373 106018543 105991614 105984473 105980206 105971277 105978358 106005251 106022096 106009722 105971479
832.1 105971479 105926418 105897665 105893409 105905795 105907941 105892336 105894244 105934954 105989349 106026804 106048286 106062794
856.6 106062794 106075454 106089318 106094706 106077623 106040037 106001103 105966723 105930316 105900264 105893421 105919492 105968606
881.1 105968606 106007504 106030190 106062961 106110251 106151426 106144667 106064641 105960882 105907011 105914104 105953920 105993652
905.6 105993652 106006920 106004131 106004286 106008804 106019819 106032348 106022799 105969071 105890739 105855823 105898893 105982387 106063938
932.1 106063938 106116593 106126356 106119299 106136549 106179583 106223106 106243432 106231272 106200767 106160355 106114244 106072140
956.6 106072140 106045353 106044173 106062484 106085074 106107640 106127310 106124628 106092823 106045818 106007004 106005883 106038845
981 106038845 106073725 106102252 106144249 106201470 106249344 106273389 106283593 106293297 106294024 106273186 106240296 106200492 106144106
1007.5 106144106 106089962 106078160 106108308 106133032 106119609 106082940 106050730 106025827 105998445 105976534 105980551 106007886
1032 106007886 106018019 105971897 105841196 105611718 105363548 105240870 105269575 105350852 105439973 105550945 105659199
1054.5 105659199 105729294 105763447 105788136 105820143 105860209 105894208 105900466 105876589 105831897 105756056 105622280
1076.9 105622280 105415857 105159426 104895711 104636943 104372597 104103374 103837788 103580475 103341603 103156078
1097.3 103156078 103062010 103069603 103156722 103283548 103401363 103455377 103418565 103314459 103207421 103170955 103249824
1119.7 103249824 103431165 103642750 103783584 103774750 103619397 103352642 102951050 102390373 101732123 101088095
1140.1 101088095 100532329 100073457 99678588 99300861 98911762 98512042 98110199 97729695 97418070 97204363
1160.5 97204363 97084820 97048169 97080296 97166723 97307044 97520477 97827840 98219186 98667908 99158639
1180.9 99158639 99667752 100162661 100616539 101013112 101354110 101648438 101915061 102183032 102457643 102721810
1201.3 102721810 102953017 103138804 103279591 103370261 103424191 103468072 103514266 103562701 103590178 103573000 103513443
1223.7 103513443 103428721 103336632 103249109 103174305 103113759 103062224 103027368 103033698 103099155 103224277 103394294
1246.2 103394294 103582430 103762531 103924811 104067469 104185677 104286301 104389644 104493403 104576123 104640901
1266.6 104640901 104707003 104790473 104889452 104979932 105048132 105102813 105168819 105277908 105428863 105583394 105721247
1289 105721247 105840445 105931747 105996370 106041873 106069040 106095529 106150353 106235588 106330502 106418347 106491578 106553483
1313.5 106553483 106601059 106630147 106677139 106759644 106851041 106944335 107033849 107102692 107131135 107094252 106983936
1335.9 106983936 106839919 106765378 106797671 106836939 106825447 106784904 106737888 106694555 106655741 106630206 106600356
1358.3 106600356 106526637 106471741 106525838 106592751 106598675 106548715 106372774 106101239 105923772 105967927 106238353
1380.8 106238353 106602192 106906331 107179248 107491589 107704222 107716310 107669210 107730329 107922542 108192122
1401.2 108192122 108413231 108580458 108707535 108683777 108485341 108190393 107844174 107537317 107536674 107806647
1421.6 107806647 108018184 108086264 107965815 107674825 107373440 107045329 106620896 106354713 106288409 106159985
1442 106159985 105920780 105603909 105259073 104916358 104450166 103757834 102892923 102467656 102604139 102578557
1462.4 102578557 102266765 102304161 103104007 104434097 106072390 107504070 108435547 109037256 109437287
1480.7 109437287 109720087 109857249 109816480 109780455 109984171 110215116 110204005 110088599 110141671 110295856
1501.1 110295856 110291564 109983337 109798694 110156250 110508406 110607803 110507047 110386419 110306215 110293424
1521.5 110293424 110446250 110621119 110786700 110899353 110847270 110803270 110829806 110604513 110203624 110243833
1541.9 110243833 110600209 110917771 111055255 111056912 111023748 110905302 110598230 110265040 110602570 111114860
1562.3 111114860 111300445 111297154 111235189 111300993 111418724 111357415 111333954 111542344 111716199 111775172 111794519
1584.7 111794519 111802745 111801708 111804390 111806953 111812532 111832964 111840999 111815774 111788976 111779153 111777174 111802745 111847687
1611.3 111847687 111800706 111634719 111598480 111706674 111677527 111592996 111617267 111686003 111777282 111770403 111521542
1633.7 111521542 111282241 111435282 111655867 111672783 111449671 111097538 111002231 111016715 110772538 110772860 111197281
1656.1 111197281 111427379 111393809 111281991 111277199 111234903 111042047 110974205 111090684 111205709 111367953
1676.5 111367953 111486828 111376166 111067462 110974860 111236918 111407745 111441445 111330473 110994971 110625684
1696.9 110625684 110358107 110261738 110294735 110221577 110129654 110078549 109918571 109572983 109050596 108502126
1717.3 108502126 108193827 107890451 107279027 106376708 105215347 103740299 101891017 99180013 96282595
1735.7 96282595 93919599 91268414 88744313 87171668 86634046 87241733 89205462 92332733 95681906
1754 95681906 98936307 101972651 104418170 106405640 107887340 108808506 109367096 109717607 110077536
1772.4 110077536 110543728 110918963 111125493 111259854 111400688 111544120 111659181 111675107 111589456 111617172
1792.8 111617172 111794305 111911643 111934865 111979568 112107003 112230670 112277913 112266719 112292564 112384284 112461543
1815.2 112461543 112501585 112544954 112558103 112503576 112451315 112420845 112420619 112537694 112675166 112721062 112740004
1837.6 112740004 112749994 112678754 112586963 112633371 112756884 112850988 112908888 112942243 112962067 112964356 112961054 112957239
1862.1 112957239 112919044 112808418 112720954 112802219 112949884 113025343 113045084 113057065 113067532 113070357 113067317
1884.6 113067317 113039088 112987077 112993503 113045013 113071167 113099670 113133264 113141811 113138020 113138533 113125932 113111484
1909 113111484 113133276 113167691 113148510 113090372 113078964 113096964 113119936 113171625 113210034 113214660 113215613 113224971 113236535
1935.5 113236535 113235569 113196492 113139379 113141704 113199615 113244915 113262403 113266051 113269567 113285398 113302791 113300633 113290644
1962.1 113290644 113281059 113265967 113269913 113295567 113312566 113319993 113326705 113329995 113330567 113328075 113323200 113316619 113301027
1988.6 113301027 113278234 113278723 113311970 113341558 113348198 113345432 113346779 113347602 113337290 113324296 113321352 113315260 113292551
2015.1 113292551 113276744 113283777 113293982 113300800 113307738 113311803 113313019 113313007 113316286 113321757 113321185 113310373 113303089 113312185
2043.6 113312185 113328087 113338971 113342524 113342941 113342547 113340533 113336837 113333452 113334620 113339198 113343811 113350332 113358629 113360953
2072.2 113360953 113356864 113357186 113361478 113365376 113372564 113377333 113375056 113373518 113376832 113384116 113392806 113396776 113394511 113394308 113401878
2102.8 113401878 113409925 113409662 113405085 113402665 113400483 113399625 113405228 113411605 113411295 113407719 113407624 113411105 113410318 113403785 113397908 113395548
2135.4 113395548 113399470 113408113 113411176 113406253 113399422 113394237 113392949 113394666 113394690 113392234 113390005 113387966 113383067 113376498 113376415
2166 113376415 113382137 113387930 113395083 113396728 113387239 113375235 113368011 113369691 113378263 113381803 113378227 113380027 113394201 113409865
2194.6 113409865 113412642 113403058 113394988 113393390 113394105 113396490 113395083 113391125 113391948 113394821 113395548 113391197 113381720 113377273 113380384
2225.2 113380384 113381457 113379765 113375640 113367736 113360035 113354051 113347960 113338566 113327467 113319099 113310969 113304162 113299441 113284767
2253.7 113284767 113262129 113246143 113232410 113212395 113193488 113180923 113172960 113169777 113168073 113168585 113178527 113194597 113211417
2280.2 113211417 113227391 113218081 113161743 113074899 112983620 112898743 112809420 112700653 112573600 112438941 112292039
2302.7 112292039 112105215 111868870 111604297 111348701 111144233 110964346 110701156 110316229 109905851 109594917
2323.1 109594917 109391665 109177399 108910227 108710432 108635843 108573723 108460951 108332133 108250582 108370674
2343.5 108370674 108879685 109473646 109556198 108987987 108102334 107305479 106769454 106550848 106602693 106860650
2363.8 106860650 107319582 107933354 108614028 109313929 110002756 110669792 111322188 111938488 112459195 112835801
2384.2 112835801 113063622 113172626 113209105 113217831 113224077 113230884 113234258 113233674 113226712 113216412 113214612 113219774 113224089
2410.8 113224089 113223386 113219047 113218892 113219512 113215435 113212073 113209534 113202572 113195026 113188756 113185215 113191247 113200307 113199699 113191986
2441.3 113191986 113188076 113188148 113187957 113192546 113202715 113206017 113193655 113177800 113172030 113169384 113161814 113152707 113149047 113153243
2469.9 113153243 113155842 113147521 113137388 113138926 113146961 113148665 113140309 113127899 113120449 113118386 113114619 113111734 113113511 113114893
2498.5 113114893 113113105 113105905 113096726 113088214 113079643 113078880 113084507 113079727 113061023 113046718 113041127 113035512 113031614 113028717
2527 113028717 113025236 113019490 113009107 113004673 113010025 113012791 113008833 113002729 112997317 112998700 113004673 113002241 112994003 112988102
2555.6 112988102 112982726 112980318 112978888 112967885 112950265 112942517 112947893 112949383 112937212 112920749 112911785 112911308 112905824
2582.1 112905824 112886596 112868679 112864208 112865722 112863922 112859416 112856555 112854898 112851691 112843966 112830198 112813187 112796414
2608.6 112796414 112783706 112783539 112794161 112796962 112783444 112761831 112741840 112724769 112710094 112700033 112692893 112692320 112698007
2635.1 112698007 112697542 112691486 112688589 112686002 112681639 112675393 112664080 112647331 112626863 112611997 112604582 112592721 112577307
2661.6 112577307 112564862 112548077 112523675 112499976 112485993 112481928 112473631 112460756 112465763 112488246 112505674 112512767
2686.1 112512767 112518382 112529111 112542737 112553906 112564945 112573695 112575734 112577450 112579989 112574995 112565196 112562692 112561345
2712.6 112561345 112550676 112546146 112546253 112525487 112488556 112455213 112440622 112451279 112466156 112466800 112465322 112471116 112482214
2739.1 112482214 112497735 112502992 112485170 112462664 112457180 112468266 112485874 112492299 112483788 112477207 112470114 112453830 112442291
2765.6 112442291 112435603 112410724 112367320 112327445 112303209 112287593 112265468 112230599 112189138 112138164 112070084 112010264
2790.1 112010264 111975908 111933744 111866426 111804760 111760676 111710882 111640584 111545599 111441457 111355352 111271155
2812.5 111271155 111152351 111003816 110843933 110660994 110437250 110175824 109874475 109521806 109109342 108606136
2832.9 108606136 107947934 107049048 105820513 104132748 101832235 98915750 95627445 92418265 89897078
2851.3 89897078 88680673 89045703 90719408 93093240 95575321 97748476 99376923 100423324 101064360
2869.7 101064360 101605844 102273905 103025985 103638196 103954136 103958404 103705108 103251946 102642298 101917970
2890.1 101917970 101120281 100280488 99408823 98497683 97518831 96429473 95203352 93804008 92145628
2908.4 92145628 90146810 87787282 85107279 82226014 79400104 77001309 75387025 74756080 75094175
2926.8 75094175 76241505 77993202 80193293 82712829 85369134 87953472 90303689 92306006
2943.1 92306006 93867356 94938076 95547348 95821369 95980722 96258938 96791285 97596282 98642862
2961.4 98642862 99881881 101222312 102548277 103772271 104837704 105724216 106457973 107063913 107565987
2979.8 107565987 108009994 108405650 108719742 108946550 109094954 109171760 109187818 109118283 108937526 108638692
3000.2 108638692 108226264 107781374 107433712 107262802 107304227 107591677 108106411 108738899 109360564 109896851
3020.6 109896851 110322034 110650194 110909534 111090446 111191893 111261141 111344397 111435699 111489773 111505377
3041 111505377 111528909 111583805 111642778 111668706 111680436 111710989 111750770 111789763 111823618 111834610 111817360 111797607
3065.5 111797607 111820161 111888969 111948693 111956120 111923528 111889160 111882114 111899042 111926973 111975789 112025464 112052715
3089.9 112052715 112081683 112110460 112112665 112088060 112065673 112068534 112073576 112053454 112027574 112029099 112028992 111989665 111952889
3116.4 111952889 111953783 111990535 112059891 112125182 112149835 112138104 112123764 112138629 112157834 112131643 112080920 112076807
3140.9 112076807 112123871 112160325 112159014 112127090 112084901 112081158 112123895 112165833 112183082 112178552 112171447 112181878
3165.4 112181878 112194157 112193084 112186158 112178922 112170827 112163472 112164485 112171364 112175238 112179148 112184179 112187624 112192190 112196743
3193.9 112196743 112199545 112202692 112206089 112204671 112195325 112187767 112189591 112192762 112191296 112190974 112194479 112201560 112213600 112221134
3222.5 112221134 112216341 112213457 112213075 112174964 112120640 112138009 112211835 112249696 112231636 112193000 112152886 112136436
3247 112136436 112165785 112195051 112178051 112152278 112164211 112198246 112217760 112212884 112194395 112149704 112069154 112015808
3271.4 112015808 112029660 112077272 112126851 112150729 112152219 112153614 112150156 112127340 112076020 112026691 112018895 112041557
3295.9 112041557 112073445 112096930 112063539 111964655 111885476 111903048 111993325 112066436 112094319 112116599 112132430
3318.4 112132430 112123561 112089705 112045085 112033677 112071550 112112200 112112665 112067521 112002194 111977232 112002552 112024713
3342.8 112024713 112041557 112046754 112002456 111967337 112000489 112039673 112038124 112015891 111989713 111961091 111913908 111852992
3367.3 111852992 111835015 111903954 111993432 112016141 112001634 111996531 112004936 112022007 112026358 111996222 111918533 111848712
3391.8 111848712 111863029 111896980 111850035 111774218 111788571 111886060 111948466 111934924 111900973 111883807 111904192
3414.2 111904192 111948609 111952972 111920023 111903858 111900103 111880243 111851156 111834884 111807275 111747241 111717200 111761081
3438.7 111761081 111819637 111833417 111814642 111804402 111825764 111848819 111841714 111823988 111801410 111758780 111726487 111712873
3463.2 111712873 111657417 111564136 111545467 111649120 111769831 111802173 111747563 111690068 111720669 111790764 111805260
3485.6 111805260 111806607 111840808 111860573 111826098 111758816 111712503 111678481 111622238 111618042 111688018 111727333 111704576
3510.1 111704576 111655390 111626589 111635101 111628997 111564910 111460555 111400187 111424494 111480653 111539197 111577809 111555243
3534.5 111555243 111515605 111527884 111515403 111402261 111285377 111294162 111394465 111464119 111511934 111586738 111637247
3557 111637247 111632514 111599648 111537552 111402071 111288595 111397386 111616158 111733556 111751008 111744821 111721265
3579.4 111721265 111670208 111577427 111428988 111329174 111389351 111467302 111448932 111414850 111418092 111440742 111504471
3601.9 111504471 111573243 111564505 111509919 111501515 111520481 111540520 111544812 111478460 111455905 111563754 111632943 111510956
3626.3 111510956 111272371 111291337 111537755 111722934 111822152 111871815 111879528 111858821 111763716 111502469 111198783
3648.8 111198783 111263120 111583877 111752319 111767137 111834371 111941230 112008393 111996269 111855340 111632085
3669.2 111632085 111539721 111508596 111371851 111408794 111639118 111816525 111887670 111813045 111549222 111318600
3689.6 111318600 111404967 111623311 111757481 111793029 111744976 111672294 111696148 111752009 111676812 111489356 111440408
3712 111440408 111631501 111801481 111800182 111679602 111528814 111422229 111423385 111516380 111534476 111352265 111123383
3734.4 111123383 111134899 111364627 111565721 111576843 111455739 111436343 111420631 111343992 111464763 111689258
3754.8 111689258 111776686 111773539 111839366 111931455 111946762 111923540 111902177 111940145 112054574 112113762 112046123
3777.3 112046123 111956453 111971223 112033617 112078702 112118220 112136245 112140846 112109482 111996448 111878645 111774337
3799.7 111774337 111698210 111770129 111849666 111901128 112035620 112123311 112027740 111830807 111706817 111612046 111625111
3822.1 111625111 111800730 111913860 111936224 111917841 111843598 111745870 111632180 111548901 111592805 111715722 111858487
3844.6 111858487 112001157 112052882 111907339 111585724 111493742 111743867 111945367 111941206 111826754 111780703
3865 111780703 111803138 111767638 111724043 111775923 111900449 111996269 111936331 111835063 111821806 111818433 111871958 111920226
3889.4 111920226 111898494 111964405 112051129 111967003 111779392 111677945 111712205 111865401 112051773 112163627
3909.8 112163627 112195599 112163126 112069118 111998820 112023723 112067711 112072635 112089837 112101173 112042356 111990583 112036920
3934.3 112036920 112113678 112146556 112136734 112114012 112119925 112117422 112071264 112055480 112094831 112142122 112178743 112204218
3958.8 112204218 112220967 112232816 112235200 112225306 112209630 112189806 112161481 112139750 112154758 112194574 112217724 112216771
3983.3 112216771 112218535 112232733 112242079 112237787 112221599 112210250 112215006
3997.5 112215006
##END=$$ End of the data block
