##TITLE=$$ Begin of the data block
##JCAMP-DX=5.00 $$ ACD/SpecManager v 10.08
##SPECTROMETER/DATA SYSTEM=Alpha
##DATE=27 Jun 2014 15:13:00
##DATA TYPE=INFRARED SPECTRUM
##DATA CLASS=XYDATA
##ORIGIN=
##OWNER=
##NPOINTS=1667
##FIRSTX=599.63549805
##LASTX=3997.56909180
##MAXX=3997.56909180
##MINX=599.63549805
##MAXY=1.11886811
##MINY=0.17666686
##XFACTOR=1.0000000000
##YFACTOR=0.000000010000000
##FIRSTY=1.07602501
##DELTAX=2.03957605
##XUNITS=1/CM
##YUNITS=ARBITRARY UNITS
##XYDATA=(X++(Y..Y))
599.6 107602501 107548165 107586491 107656837 107761323 107865334 107977140 108099103 108180165 108212471 108230245 108243501
622.1 108243501 108256626 108278227 108261573 108175194 108057344 107915270 107750189 107600296 107469094 107346141
642.5 107346141 107211196 107042778 106867766 106732261 106633890 106514430 106346786 106156206 105964172 105763674
662.9 105763674 105457163 104860711 104346371 104337323 104247081 103935230 103590298 103271365 102975380 102717471
683.3 102717471 102489626 102264678 102037716 101820910 101616251 101378798 101047909 100600982 100028718 99247026
703.7 99247026 98143351 96755958 95340216 94185239 93322146 92570013 91857052 91425526 91611451
722 91611451 92410058 93525434 94690740 95755452 96699524 97587216 98432374 99203086 99887186 100475013
742.4 100475013 100983882 101468110 101927328 102326846 102651918 102879524 103002334 103063130 103126085 103253472
762.8 103253472 103448021 103612006 103677571 103699863 103762400 103867936 103971553 104069042 104184377 104303038
783.2 104303038 104389644 104446483 104488051 104515302 104519951 104495728 104448748 104392612 104322445 104199994 104030669
805.6 104030669 103880143 103759289 103614664 103451824 103323972 103223610 103120291 103042138 103028738 103037047
826 103037047 102977240 102822733 102614582 102424967 102303076 102216685 102118945 102014184 101924372 101868963 101871920
848.5 101871920 101928926 102001321 102042925 102028394 101979816 101914930 101823151 101695454 101527596 101319492 101085770
870.9 101085770 100872254 100744414 100735176 100803113 100873363 100923193 100985932 101073861 101159322 101193845 101095724
893.3 101095724 100791240 100394690 100170004 100159132 100207949 100244129 100238061 100162697 100052726 99968868 99930286
915.8 99930286 99901438 99811691 99609071 99341851 99147224 99133420 99306911 99546945 99675047 99649167 99587548
938.2 99587548 99594152 99658692 99710125 99703306 99629664 99498051 99327290 99143255 98976386 98859948 98812896
960.6 98812896 98809499 98810083 98794550 98742962 98646778 98504704 98312068 98133856 98074329 98116714 98177886 98264867
985.1 98264867 98408526 98575974 98709989 98778921 98796797 98789531 98745871 98640507 98473132 98252112 97987098
1007.5 97987098 97750604 97675294 97753137 97782135 97639185 97411674 97231674 97117329 97021061 96955323 96961039
1030 96961039 97013563 97021854 96860754 96404862 95616531 94744778 94257158 94290549 94566029 94893020 95243281
1052.4 95243281 95551687 95762831 95898324 96006691 96106732 96190506 96237016 96216649 96116358 95922446
1072.8 95922446 95589274 95069021 94356441 93500429 92586517 91685259 90802509 89914280 89021748 88157147
1093.2 88157147 87380612 86794913 86505461 86519194 86756563 87113297 87446523 87590861 87463129 87130451
1113.6 87130451 86774486 86618263 86821389 87380934 88097978 88626730 88662285 88165271 87243658 85867703
1134 85867703 84009379 81887186 79840094 78094703 76678795 75481749 74368531 73243040 72076774
1152.4 72076774 70906484 69818097 68919891 68286479 67934096 67825776 67905062 68129975 68502945 69105637
1172.7 69105637 70017081 71189535 72529274 74003232 75543892 77021706 78360569 79558182 80621082
1191.1 80621082 81557947 82415617 83263338 84130335 84976631 85724640 86309654 86720008 86996835 87190169
1211.5 87190169 87339479 87471348 87573844 87598640 87503493 87282318 86974525 86655098 86375463 86125201
1231.9 86125201 85881495 85660523 85526967 85555977 85785151 86209929 86783224 87425816 88050681 88588929
1252.3 88588929 89019287 89378804 89719135 90056789 90369195 90631866 90866041 91113222 91383892 91660148
1272.7 91660148 91916096 92126507 92297238 92506462 92860544 93371856 93931389 94409424 94754475 95005590
1293.1 95005590 95207143 95360082 95462549 95570606 95771927 96068478 96374184 96644467 96908432 97165000
1313.5 97165000 97363096 97498995 97634512 97821957 98068976 98348129 98611325 98803663 98872024 98790359
1333.9 98790359 98579502 98289466 97991896 97776723 97642124 97508579 97338724 97155422 96988988 96832174
1354.3 96832174 96687257 96596140 96575946 96579403 96553433 96488100 96403289 96269435 95859253 94986635 94116938
1376.7 94116938 94023001 94886553 96221554 97529149 98689693 99633133 100261033 100619423 100833583
1395.1 100833583 101087058 101514316 102107906 102752376 103299820 103524661 103253174 102453923 101368260
1413.4 101368260 100429237 99950516 100078917 100553370 100919127 100915921 100428367 99457598 98272234 97166944
1433.8 97166944 95997763 94821388 93946278 93168765 92337459 91449463 90391219 89096618 87520319
1452.2 87520319 85744238 83917141 82636356 82128030 81603301 80791366 80937916 83583665 88795418
1470.5 88795418 95472825 100562537 103196406 104762137 105931664 106874287 107590592 108113003 108515859
1488.9 108515859 108842432 109073615 109161723 109061623 108922660 109030330 109370470 109750152 110025251 110201514
1509.3 110201514 110338521 110435438 110497236 110548282 110588622 110592055 110601735 110631931 110663664 110699856 110705757 110666382
1533.7 110666382 110646653 110623646 110493469 110325408 110228074 110165679 110121751 110088980 110088408 110139167 110212409
1556.2 110212409 110244012 110260689 110324132 110375226 110408795 110439348 110481131 110544145 110566247 110527325 110514247
1578.6 110514247 110530484 110527813 110511315 110497451 110488105 110477805 110456014 110404170 110326076 110236061 110128760 110030258
1603.1 110030258 109969103 109945381 109937775 109935260 109925044 109865916 109755242 109673917 109592974 109452379 109316552
1625.5 109316552 109223771 109172738 109142697 109059262 108863449 108665419 108487034 108250308 107972670 107648766
1645.9 107648766 107375109 107235587 107024336 106646276 106432354 106297803 106116736 105889857 105686188 105563378
1666.3 105563378 105486894 105523729 105722666 106031942 106329644 106508887 106579411 106544101 106374276 106151438
1686.7 106151438 105876172 105495667 105076957 104520535 103851211 103109527 102183449 101363611 100562537 99643588
1707.1 99643588 98815811 98090547 97342378 96352077 94724739 92718285 90696549 88253808 85205889
1725.5 85205889 81661433 77531999 72722113 66007906 58554703 52638847 46906793 41849011
1741.8 41849011 38836962 37999341 39591947 44171515 51381886 59461004 68151945 76931375 84384996
1760.1 84384996 90588915 95111787 98082840 100250471 101842690 103065324 103982258 104617167 105100024
1778.5 105100024 105516815 105865169 106157732 106390417 106584370 106752431 106927848 107084000 107207036 107315493
1798.9 107315493 107413709 107517588 107615089 107704842 107780516 107863903 107947171 108022261 108085346 108144486 108198929
1821.3 108198929 108241475 108286631 108334410 108386838 108427203 108456600 108474362 108490658 108512366 108534396 108549643
1843.8 108549643 108568716 108593333 108607852 108616722 108617258 108621275 108629620 108638155 108639336 108631921 108619642 108614945 108621836
1870.3 108621836 108620870 108612490 108603513 108602917 108604872 108608210 108611012 108612776 108613968 108619332 108628464 108634162 108636427 108633947 108633149
1900.9 108633149 108626080 108616972 108611596 108602953 108592844 108588064 108584249 108578622 108576465 108572650 108564639 108553493 108544934 108539248
1929.4 108539248 108538330 108539510 108539653 108537269 108529818 108525503 108529890 108537877 108541560 108544219 108547211 108551443 108555818 108556831 108555412
1960 108555412 108554006 108554864 108559656 108570051 108576655 108573186 108566535 108562458 108557343 108552492 108550239 108549094 108550572 108553410 108554018
1990.6 108554018 108552945 108553720 108555353 108553839 108545744 108541822 108548689 108548808 108534729 108523571 108521938 108515608 108502257 108490753
2019.2 108490753 108483994 108481467 108476317 108472276 108481312 108495677 108506942 108518457 108530688 108544111 108556616 108567321
2043.6 108567321 108584702 108604276 108616018 108627784 108648658 108673477 108693683 108710456 108723664 108732772 108741176 108751500
2068.1 108751500 108764303 108778250 108797050 108820307 108839405 108851910 108868003 108896399 108930969 108956611 108971918
2090.5 108971918 108990252 109015298 109037721 109054279 109068596 109083652 109101677 109118831 109136784 109160018 109182227
2113 109182227 109194279 109201086 109216750 109241104 109261239 109274542 109291482 109315252 109334636 109338021 109337389 109346128 109354317
2139.5 109354317 109356630 109361398 109371436 109377468 109374177 109376729 109400213 109429502 109445608 109449899 109452462 109464097 109491503
2166 109491503 109526706 109551609 109568167 109590590 109616184 109635746 109649289 109660602 109676266 109695756 109716201 109741437
2190.5 109741437 109764373 109780931 109799099 109821391 109844935 109866107 109880030 109887922 109899867 109920418 109943104 109962177
2215 109962177 109976661 109987485 109999120 110017490 110037208 110048318 110053349 110056794 110067546 110088682 110100162 110095501
2239.4 110095501 110095382 110107112 110112822 110111701 110121608 110134494 110133171 110128677 110130656 110133278 110141110 110151482 110153854 110159004
2268 110159004 110173190 110188186 110204315 110221601 110240722 110264099 110281754 110283458 110270500 110241652 110195422 110147238
2292.5 110147238 110109878 110071492 110017991 109960747 109907246 109828365 109714127 109596360 109491980 109405363 109327793
2314.9 109327793 109211195 109043729 108880234 108756685 108661783 108573151 108482218 108406925 108366907 108340025 108301079
2337.3 108301079 108264410 108249128 108300447 108527350 108814013 108873725 108628440 108224905 107863188 107624853
2357.7 107624853 107534218 107579088 107717836 107944930 108244407 108571327 108903706 109240699 109574473 109892654
2378.1 109892654 110197628 110470176 110674536 110801506 110869038 110902083 110919178 110930657 110938716 110943162 110950279
2400.6 110950279 110964155 110974157 110976565 110980344 110990083 111004639 111013377 111011708 111013651 111025500 111034775 111035275 111042440
2427.1 111042440 111063015 111072254 111065602 111066341 111072361 111073816 111076164 111079001 111084902 111101711 111116016 111120141 111126804 111134315
2455.6 111134315 111139548 111144733 111139989 111125565 111117542 111120355 111126769 111134279 111142194 111142004 111128128 111110675 111103451 111102307
2484.2 111102307 111095357 111088026 111083913 111073828 111062932 111059165 111056232 111051941 111041331 111020517 111000919 110984969 110970116
2510.7 110970116 110960376 110951591 110938406 110921335 110905099 110892546 110879564 110861564 110839951 110826921 110828328 110831583
2535.2 110831583 110828388 110822296 110817456 110814607 110814273 110816610 110811150 110790908 110771501 110762894 110751748 110729671 110709465
2561.7 110709465 110699582 110684931 110661769 110646081 110636175 110617292 110589874 110560477 110526514 110489726 110456777 110429657
2586.2 110429657 110410321 110392535 110370314 110350335 110334957 110315228 110287273 110261106 110242164 110220718 110189795
2608.6 110189795 110160673 110137796 110107291 110072935 110041356 110005975 109967995 109929478 109892714 109860015 109825373
2631 109825373 109788990 109760654 109743536 109729862 109713125 109691536 109666657 109643483 109620416 109591115 109554410 109506905
2655.5 109506905 109444678 109370923 109295797 109233534 109187174 109148431 109110200 109078205 109063184 109052527 109035254
2677.9 109035254 109029961 109050453 109084892 109114110 109137690 109169459 109209466 109247100 109277499 109309733 109346068 109368813
2702.4 109368813 109369755 109355128 109337080 109320569 109297681 109266233 109239304 109219027 109181821 109118056 109044802 108995438
2726.9 108995438 108989823 109009826 109032357 109044755 109056294 109090185 109132540 109149528 109135520 109109962 109100354 109111571
2751.4 109111571 109116626 109105921 109091818 109070027 109032810 108981538 108925056 108868968 108799291 108700550 108579159
2773.8 108579159 108465266 108363485 108244097 108102357 107945275 107750571 107519042 107308996 107139528 106954122
2794.2 106954122 106714880 106449449 106198609 105953181 105676186 105353165 104988956 104595578 104171419 103694499
2814.6 103694499 103149569 102524662 101798630 100952446 99978483 98860401 97561872 96037871 94205457
2832.9 94205457 91894454 88841558 84718138 79173404 72054690 63718605 55050111 47230905
2849.3 47230905 41497445 38831779 39543131 43115282 48484632 54471016 60049981 64472842 67444849
2867.6 67444849 69336617 71010482 73081118 75372475 77234143 78205931 78228498 77442479 76027048
2886 76027048 74151826 71972567 69621527 67188996 64714688 62176645 59516770 56684762 53630197
2904.3 53630197 50275403 46532294 42349592 37752527 32883048 28059831 23761548 20446596
2920.6 20446596 18398604 17666686 18130848 19615102 21951050 25092676 29022902 33567488 38426942
2939 38426942 43264607 47707319 51370394 53965825 55452174 56126857 56514382 57174826 58520055
2957.4 58520055 60692459 63640785 67220956 71212184 75315326 79229951 82761347 85827798
2973.7 85827798 88433087 90621448 92441058 93957233 95239735 96314108 97172242 97809076 98202246
2992 98202246 98290342 97990882 97262484 96118253 94648945 93111151 91881371 91307807 91599220 92765355
3012.4 92765355 94611436 96808493 99016303 100993419 102619147 103887022 104869044 105608630 106137848
3030.8 106137848 106523836 106842136 107132554 107353210 107479215 107573164 107697213 107847452 107979047 108091164
3051.2 108091164 108213997 108337784 108454418 108558333 108616769 108635426 108653665 108710861 108834434 108989024
3071.6 108989024 109108734 109162295 109177780 109222245 109304726 109383965 109455538 109515107 109559953 109624135 109703648
3094 109703648 109749746 109749162 109747601 109772944 109785938 109759080 109727466 109743989 109782970 109773469 109744704 109760547 109832156
3120.5 109832156 109943449 110046101 110100245 110111928 110121894 110154438 110174429 110146987 110112429 110132182 110186350
3143 110186350 110224962 110241878 110228395 110185969 110183370 110248816 110312569 110345900 110371196 110390520 110407507 110430515
3167.4 110430515 110452712 110466743 110475039 110471821 110459733 110460627 110470605 110469484 110463130 110458052 110458159 110480201 110517907
3193.9 110517907 110542178 110545349 110546362 110557890 110572672 110584283 110606265 110639465 110655260 110648978 110645545 110647333
3218.4 110647333 110651827 110668659 110687327 110696363 110688293 110641825 110584259 110592997 110662460 110713720 110730779 110729945 110698080
3244.9 110698080 110666645 110689092 110734141 110739028 110715461 110718155 110744309 110758090 110752165 110728121 110679138 110609221
3269.4 110609221 110571611 110598671 110652161 110693049 110706329 110695839 110680270 110669518 110640633 110582078 110533285
3291.8 110533285 110523927 110548413 110591948 110615647 110574651 110481548 110412860 110428202 110506678 110580766 110608757 110616684
3316.3 110616684 110633290 110632467 110590434 110534286 110525620 110572946 110603952 110580242 110523891 110456419 110417545 110421503
3340.8 110421503 110439420 110466707 110470188 110415471 110372901 110402310 110447764 110444939 110401332 110360456 110325205 110250854
3365.3 110250854 110155714 110127544 110193932 110270202 110291886 110294247 110314202 110352194 110380518 110373294 110325861 110246229
3389.7 110246229 110197818 110222888 110248947 110195291 110105085 110103071 110192156 110236633 110204959 110177028 110179901 110204077
3414.2 110204077 110224438 110204470 110168850 110153556 110128212 110062063 109977531 109915555 109860182 109782851 109744799
3436.7 109744799 109788370 109843779 109848404 109805262 109746981 109714711 109700835 109672499 109619367 109524977 109409642
3459.1 109409642 109351456 109325433 109204900 109025276 108988714 109152210 109333563 109387910 109336305 109311521 109438586
3481.5 109438586 109587097 109614658 109644580 109724200 109747279 109702170 109638453 109593809 109548020 109476483 109492016
3504 109492016 109600103 109643757 109581685 109458506 109351504 109317565 109307408 109251463 109146380 109077477 109102619
3526.4 109102619 109150398 109162366 109137225 109084213 109059501 109096122 109135580 109139776 109162056 109253788 109373260
3548.8 109373260 109461820 109540093 109638464 109726715 109774172 109812868 109893501 110007238 110098481 110148358 110210872
3571.3 110210872 110301149 110381579 110429096 110443425 110440207 110439920 110456538 110487962 110495520 110459709 110404599 110352015
3595.7 110352015 110322309 110356927 110462344 110576832 110683286 110815275 110946357 111030149 111065400 111069596 111059403
3618.2 111059403 111054039 111066675 111088443 111112177 111142826 111177969 111198342 111205006 111215270 111233628 111251533 111271453
3642.6 111271453 111294889 111300027 111272585 111265314 111303639 111338735 111336374 111312330 111322558 111377048 111424041 111432755
3667.1 111432755 111414587 111397290 111394572 111410463 111427474 111422276 111404848 111381757 111355340 111318982 111307478 111355281
3691.6 111355281 111390531 111388731 111398542 111441219 111480296 111478508 111465573 111483109 111527383 111573052 111599255 111589789
3716.1 111589789 111546767 111498892 111460876 111424470 111404073 111410797 111433792 111451161 111449277 111457002 111489904 111534297
3740.5 111534297 111593986 111662471 111684871 111678517 111692750 111696601 111677337 111669421 111685014 111696625 111685979 111688912
3765 111688912 111709297 111715925 111714339 111705959 111690748 111671615 111658514 111670339 111685443 111688602 111683416 111676300 111680472
3791.5 111680472 111687088 111689413 111686301 111684120 111708188 111729681 111728513 111735618 111747682 111751366 111749792 111748493 111737263
3818 111737263 111721897 111736012 111757016 111763501 111762583 111757529 111742115 111699677 111675203 111718678 111774909 111792850 111784232
3844.6 111784232 111772251 111763966 111765516 111804354 111849427 111832392 111794651 111792970 111821580 111841130 111842382 111831641
3869 111831641 111817598 111818779 111836636 111836505 111822557 111816180 111791718 111774361 111798179 111831677 111857831 111866903 111851501
3895.5 111851501 111830640 111824501 111838436 111868107 111886811 111880076 111868751 111866975 111865330 111863303 111874342 111883461 111880362
3922.1 111880362 111880422 111886430 111884475 111867237 111854041 111848712 111844552 111853921 111862814 111864734 111866474 111851370 111835694 111841619
3950.6 111841619 111853325 111866546 111878967 111870086 111835790 111799896 111788452 111791945 111793339 111799896 111804283 111800051 111801732
3977.1 111801732 111818111 111840212 111848438 111844039 111847138 111855829 111842275 111814892 111805189 111798167
3997.5 111798167
##END=$$ End of the data block
