##TITLE=$$ Begin of the data block
##JCAMP-DX=5.00 $$ ACD/SpecManager v 10.08
##SPECTROMETER/DATA SYSTEM=Alpha
##DATE=27 Jun 2014 15:13:00
##DATA TYPE=INFRARED SPECTRUM
##DATA CLASS=XYDATA
##ORIGIN=
##OWNER=
##NPOINTS=1667
##FIRSTX=599.63549805
##LASTX=3997.56909180
##MAXX=3997.56909180
##MINX=599.63549805
##MAXY=1.11897206
##MINY=0.17969844
##XFACTOR=1.0000000000
##YFACTOR=0.000000010000000
##FIRSTY=1.07688606
##DELTAX=2.03957605
##XUNITS=1/CM
##YUNITS=ARBITRARY UNITS
##XYDATA=(X++(Y..Y))
599.6A07688606p6926L7909Q5771Q3553Q1242J22213J26314O1202K4760L8886L4094
622.1A08307624J7691l505n2929q2565r4842j25850j48737j52660j32966r7596j09410
644.5A07324255j68574j91605j44494j03927j31428j75702j85943j84345j95730l14582
664.9A05527925o41882n39541M4668l8469l05653l72171l35491k85041k42043k18701
685.3A02593601k09010k15852k38049k37990k37226l02672m26567n67997p86167j105183
705.7I8266888j378429j402021j142353q57067p56192p13318m27103J71494P76684
724I2538583J115150J173031J058990R30392Q76534Q53950P91001O76078N65267N07843
744.4A01086819M85504M44603L91710L33535K36845J23942N7924O8033J35112J90627
$$ plain form
599.6 107688606 107611680 107649589 107735360 107818913 107900155 108022368 108148682 108209884 108234644 108273530 108307624
622.1 108307624 108325315 108321810 108268881 108186316 108091474 107965624 107816887 107664227 107531261 107433665 107324255
644.5 107324255 107155681 106964076 106819582 106715655 106584227 106408525 106222582 106038237 105842507 105527925
664.9 105527925 104886043 104346502 104391170 104352701 104047048 103674877 103339386 103054345 102812302 102593601
685.3 102593601 102384591 102168739 101930690 101692700 101455474 101152802 100726235 100158238 99372071 98266888
705.7 98266888 96888459 95486438 94344085 93487018 92730826 92017508 91590405 91761899 92538583
724 92538583 93653733 94826764 95885754 96816146 97692680 98546630 99337631 100013709 100578976 101086819
744.4 101086819 101572323 102016926 102408636 102742171 102979016 103102958 103160882 103228915 103364027 103554654
764.8A03554654J60742P6425K8753N3132J05369J17886R1875R0122J10173R7644O7652
787.3A04554427M4644L1733J6975k5117o8772p5650p1454j03784j47295j44517j21367
809.7A03889823j45674j73425j43958j12271j00374n7221J5200K6929o6042j70124
830.1A02962863k11691j96064j41096r7323q3553p9620q3685o8188j6296L7122P4935
852.5A02097404O7902J514n2250p6830j10102j46377j79553k10881k31600k15840j26541
875A00816846O068P9393P3612O3824P5818Q0275O4480J8371r6560k92981l93927k28727
899.4A00266492j3709M9150M6325K27q4162j17553q2528l9494l6669q9085j95515k75564
923.9I9427915k10804j8609J75798K41423J27786l0052o5840O253O7967N8079o998
$$ plain form
764.8 103554654 103715396 103791821 103820574 103873706 103979075 104096961 104188836 104278958 104389131 104486775 104554427
787.3 104554427 104599071 104630804 104647779 104622662 104553890 104478240 104406786 104303002 104155707 104011190 103889823
809.7 103889823 103744149 103570724 103426766 103314495 103214121 103156900 103172100 103199029 103132987 102962863
830.1 102962863 102751172 102555108 102414012 102316689 102233136 102153516 102069831 102001643 101985347 102022469 102097404
852.5 102097404 102165306 102166820 102114570 102037740 101927638 101781261 101601708 101390827 101159227 100943387 100816846
875 100816846 100822914 100902307 100975919 101039743 101115561 101195836 101260316 101278687 101182127 100889146 100495219 100266492
899.4 100266492 100252783 100301933 100348258 100348485 100264323 100146770 100064242 100024748 99988079 99898994 99703479 99427915
923.9 99427915 99217111 99198502 99374300 99615723 99743509 99713457 99647617 99653870 99721837 99779916 99772918
946.4I9772918q2034j35117j67865j84393j69927j13958m1836N00N532j6338o4302
968.8I8803180j11454j50502j92392j71375m8804N6338P1162Q1915J25151J54031J34736
991.2I8751986P6032K3269j1992n6434j16926j69885k10721k57361k43908q2272Q1885
1013.7I7783673K9856j48368k25014j72698j13058r2530n6744R835N0908J544j71042
1036.1I6896362m60565p78997q54361m80908K6482K64490L14629L40396L04824K08319
1056.5I5780671J32560J06830R9116Q6004N1206j4096r6250j94323l28660n07688p06029
1078.9I4409341q64840r28378r04131q70717q76534q89605q62956p68012n76764k93183
1099.3H6574221K658K33889L62479L38495J44744j30570l39222l61490j57201K02709
$$ plain form
946.4 99772918 99690884 99555767 99387902 99203509 99033582 98919624 98877788 98878288 98883820 98867482 98803180
968.8 98803180 98691726 98541224 98348832 98177457 98128653 98184991 98256153 98338068 98463219 98617250 98751986
991.2 98751986 98828018 98851287 98839295 98782861 98665935 98496050 98285329 98027968 97784060 97701788 97783673
1013.7 97783673 97813529 97665161 97440147 97267449 97154391 97061861 97005117 97014952 97065860 97067404 96896362
1036.1 96896362 96435797 95656800 94802439 94321531 94348013 94612503 94927132 95267528 95572352 95780671
1056.5 95780671 95913231 96020061 96119177 96205181 96256387 96242291 96146041 95951718 95623058 95115370 94409341
1078.9 94409341 93544501 92616123 91711992 90841275 89964741 89075136 88212180 87444168 86867404 86574221
1099.3 86574221 86576879 86810768 87173247 87511742 87656486 87525916 87186694 86825204 86668003 86870712
1119.7H6870712N61303P20799N28061L0184n01269r17971j361132j839483k108222
1138.1H1982982k033818j734227j414603j195657j101786j110077j156699j169801
1154.4G1066314j093781r00501o27452l49057j14655P3373K30026L82114O04778R08333
1174.8G0179492J164729J328498J464152J530570J465481J328707J192320J058423
1191.1H0712372R31287Q52322Q44259Q64452Q40634P42632N84531M06670K67607J88947
1211.5H7235713J49137J31529J01006J8633r8568k14786l00187l15427k74772k46680
1231.9H6185598k46179k27320j36566L2270K32589M23348N66292O31654O16211N32830
1252.3H8610727M27955L62945L41773L33345L05402K50572K27135K54405K82067K77388
$$ plain form
1119.7 86870712 87432015 88152814 88680875 88711059 88209790 87291819 85930687 84091204 81982982
1138.1 81982982 79949164 78214937 76800334 75604677 74502891 73392814 72236115 71066314
1154.4 71066314 69972533 69072032 68444580 68095523 67980868 68054241 68284267 68666381 69271159 70179492
1174.8 70179492 71344221 72672719 74136871 75667441 77132922 78461629 79653949 80712372
1191.1 80712372 81643659 82495981 83340240 84204692 85045326 85787958 86372489 86779159 87046766 87235713
1211.5 87235713 87384850 87516379 87617385 87636018 87537450 87322664 87022477 86707050 86432278 86185598
1231.9 86185598 85939419 85712099 85575533 85607803 85840392 86263740 86830032 87461686 88077897 88610727
1252.3 88610727 89038682 89401627 89743400 90076745 90382147 90632719 90859854 91114259 91396326 91673714
1272.7I1673714K46555K04640J70845K07847L51823N07968N52482M72849L46190K51097
1293.1I4986010J95235J44487R9695J13231K06184K96992L05897K68007K53772K43891
1313.5I7113401J93995J38956J37228J84673K39897K73990K63131J93095O9970p8207
1333.9I8730129k11173k95371k94620k05165j32239j34534j64449j76734j67793j63507
1354.3I6784544j49262q9008j3762P915k4426o3056q4370j37597m08572q61579q64882
1376.7I4095945j04862Q47477J325374J305104J163578R45300O22856L53527K17784
1395.1A00772083K62081M26865N81789O31046N37873K20620k71880p90596j065326
1413.4A01304555r19306m71861J20491M64368L64435K181m82416r62931j171434j092994
$$ plain form
1272.7 91673714 91920269 92124909 92295754 92503601 92855424 93363392 93915874 94388723 94734913 94986010
1293.1 94986010 95181245 95325732 95425427 95538658 95744842 96041834 96347731 96615738 96869510 97113401
1313.5 97113401 97307396 97446352 97583580 97768253 98008150 98282140 98545271 98738366 98808336 98730129
1333.9 98730129 98518956 98223585 97928965 97723800 97591561 97457027 97292578 97115844 96948051 96784544
1354.3 96784544 96635282 96546274 96532512 96540427 96516001 96452945 96368575 96230978 95822406 94960827 94095945
1376.7 94095945 93991083 94838560 96163934 97469038 98632616 99577916 100200772 100554299 100772083
1395.1 100772083 101034164 101461029 102042818 102673864 103211737 103432357 103160477 102369881 101304555
1413.4 101304555 100385249 99913388 100033879 100498247 100862682 100864863 100382447 99419516 98248082 97155088
1433.8I7155088j157415j168602q78954p78228q18742q70359j048916j297796j579708
1452.2H7556368j768470j805520j260662n08022n27811q04645J47194K622479N173439
1470.5H8824350O634378N057651K611351J550364J166499R39667P08664N20265M03964
1488.9A08417153L23689K28608R1779r1445j36495J02008L34799L81791K88439J79553
1509.3A10119879J24455Q7213O3217N3072M0710J3661J9133K5797K3902L2663O795
1531.7A10610497l4046k0349l2163j28686j49513q9836p1799n7888l9399j049N2166
1554.1A10037935Q1503N1320K6226N6362M5729K9802K4998L6073O4635L5107k2483
1576.6A10467207n340J8179n960k1947j1944n806j2624k2638m8923p6187q9502j07086
$$ plain form
1433.8 97155088 95997673 94829071 93950117 93171889 92353147 91482788 90433872 89136076 87556368
1452.2 87556368 85787898 83982378 82721716 82213694 81685883 80881238 81028432 83650911 88824350
1470.5 88824350 95458728 100516379 103127730 104678094 105844593 106784260 107492924 108013189 108417153
1488.9 108417153 108740842 108969450 109061229 108969784 108833289 108935297 109270096 109651887 109940326 110119879
1509.3 110119879 110244334 110331547 110394764 110447836 110488546 110502207 110521340 110547137 110571039 110603702 110610497
1531.7 110610497 110576451 110556102 110523939 110395253 110245740 110155904 110084105 110026217 109986818 109985769 110037935
1554.1 110037935 110119438 110170758 110196984 110253346 110299075 110328877 110353875 110389948 110454583 110489690 110467207
1576.6 110467207 110461867 110480046 110474086 110452139 110440195 110434389 110421765 110399127 110350204 110274017 110184515 110077429
1601.1A10077429r4688n1284j5187n961p367j5271n2714r7120q0144q5330j38795j32454
1625.5A09301114r3317n5599l4559p9310j83928j92225j78349k40481k84695l21734
1645.9A07636917k55919j22809j96493l71015k24507j43874j77371k15316j99699j25099
1666.3A05604815p6043L7885J94180L01706K93053J80518P7009k7859j65260k21097
1686.7A06198907k72298l76677m15791n50079o61087p34389r17685q18109p98989r09412
1707.1I9744391q18359p18558p39825r77594j609993j994198k019406k438497l033209
1725.5H5394752l523016m110396m794830o689280p430363n912864n736330n059725
1741.8D2137948l009299q31151J600650M578063P189435Q047050Q653826Q742761P424802
$$ plain form
1601.1 110077429 109982741 109931457 109916270 109910309 109902942 109887671 109834957 109737837 109657693 109572363 109433568 109301114
1625.5 109301114 109207797 109152198 109117639 109038329 108854401 108662176 108483827 108243346 107958651 107636917
1645.9 107636917 107380998 107258189 107061696 106690681 106466174 106322300 106144929 105929613 105729914 105604815
1666.3 105604815 105528772 105566657 105760837 106062543 106355596 106536114 106613123 106585264 106420004 106198907
1686.7 106198907 105926609 105549932 105134141 104584062 103922975 103188586 102270901 101452792 100653803 99744391
1707.1 99744391 98926032 98207474 97467649 96490055 94880062 92885864 90866458 88427961 85394752
1725.5 85394752 81871736 77761340 72966510 66277230 58846867 52934003 47197673 42137948
1741.8 42137948 39128649 38297498 39898148 44476211 51665646 59712696 68366522 77109283 84534085
1760.1H4534085O178599M500819K958738K160520J586008J220512R13739O33407M87995
1778.5A05174422M21465L48568K90203K29001J93071J70541J74558J53911J24824J10102
1798.9A07390666R6405R9074R3902R4890Q6808Q6654P4994O8820O5875O4552N8746
1821.3A08281386M4536M4549M3368M4752L9410L3736J9050J8692K8157K8193J9574
1843.8A08645403J9789K2650J2183P606K396N555P272Q499N114k122r214o080L731
1870.3A08722782M29l481p498l791N150J4484J0240J609j466L314K372l635J215Q95
1898.8A08742619k110m852k39O0o533j0228r227p021k301J443n746o700p629q035r89
1929.4A08672512N161l171j1897o616j895J287O855O723j67K86M983J0336J1492L111
$$ plain form
1760.1 84534085 90712684 95213503 98172241 100332761 101918769 103139281 104053020 104686427 105174422
1778.5 105174422 105595887 105944455 106234658 106463659 106656730 106827271 107001829 107155740 107280564 107390666
1798.9 107390666 107487071 107586145 107680047 107774937 107861745 107948399 108023393 108092213 108158088 108222640 108281386
1821.3 108281386 108325922 108370471 108413839 108458591 108498001 108531737 108550787 108569479 108597636 108625829 108645403
1843.8 108645403 108665192 108687842 108700025 108707631 108710027 108715582 108722854 108731353 108736467 108734345 108725131 108719051 108722782
1870.3 108722782 108723211 108719730 108712232 108708441 108713591 108728075 108738315 108739924 108738458 108741772 108744144 108740509 108741724 108742619
1898.8 108742619 108740509 108735657 108735418 108735478 108728945 108718717 108709490 108702469 108700168 108701611 108695865 108689165 108681536 108673501 108672512
1929.4 108672512 108677673 108674502 108662605 108655989 108654094 108655381 108662236 108668959 108668792 108669078 108674061 108684397 108695889 108699000
1958A08699000m828k408K396K801N949L827m101l278M100L183l350p462m673k098l696
1988.6A08685362M89N770P391M399l636p916j418K312n817j0610k908K26r262j3173
2017.1A08651209j2028j1611o390n996n841M851J2470J6164J8585J1611O080P999R918
2043.6A08697021J5283J7726J5247J7202K0289K0564J5545J0884J3756J5474R298Q333
2068.1A08876622J6761J8990J8274K2173J7226P308J3208K7466L2186K1696J1826J8167
2092.6A09101903K6799K6500J9979J0419Q691J5068J7523J9074J8012J6404J4829Q512
2117.1A09303713R477J8108K2578J7405O878O211J8132J8799P224L028L183L350Q153
2143.6A09446239Q643j252l731J2994K9027K3127J0014N734N221R334J9574K2757J8871
$$ plain form
1958 108699000 108694172 108691764 108694160 108696961 108702910 108706737 108702636 108699358 108703458 108706641 108703291 108695829 108691156 108689058 108685362
1988.6 108685362 108685851 108691621 108699012 108703411 108699775 108691859 108690441 108692753 108686936 108676326 108673418 108673644 108664382 108651209
2017.1 108651209 108639181 108627570 108621180 108615184 108609343 108614194 108626664 108642828 108661413 108673024 108679104 108687103 108697021
2043.6 108697021 108712304 108730030 108745277 108762479 108782768 108803332 108818877 108829761 108843517 108858991 108868289 108876622
2068.1 108876622 108893383 108912373 108930647 108952820 108970046 108977354 108990562 109018028 109050214 109071910 109083736 109101903
2092.6 109101903 109128702 109155202 109175181 109185600 109194291 109209359 109226882 109245956 109263968 109280372 109295201 109303713
2117.1 109303713 109313190 109331298 109353876 109371281 109378159 109384370 109402502 109421301 109428525 109431553 109434736 109438086 109446239
2143.6 109446239 109454882 109453630 109449899 109462893 109491920 109515047 109525061 109530795 109536016 109545350 109564924 109587681 109606552
2170.1A09606552K3437K8598K5010K1350J9765J2827P963J1790K0480L0148K9517K0134
2194.6A09857571J5557J7178K2173K2948J0812L004J3530K4927K1267J1742R739J3054
2219A10043502J5402J4269J0014O961P666O616P689J7225J9050M375k766N234M816
2245.6A10160053N00N877N818j097K814P152J07l099j025O79N365J2707J9050J6820
2274.1A10231721J1766J9122K6428J5009n997j9002k9015m3070m6254l9422l9685m9615
2298.6A10031986n6648o1274q5103j15085j20949j09852r0372q3995j29450j80721
2319A08998537j62435j04165q3589j07289j18279p6830k4975k3389m3785m5765k1469
2341.4A08186567O5994K39945K86865O8986k32053m13155l94631k54726q7953K9016
$$ plain form
2170.1 109606552 109629989 109658587 109683597 109704947 109724712 109737539 109745502 109757292 109777772 109807920 109837437 109857571
2194.6 109857571 109873128 109890306 109912479 109935427 109946239 109949243 109962773 109987700 110008967 110020709 110030448 110043502
2219 110043502 110058904 110073173 110083187 110090148 110097814 110104430 110112119 110129344 110148394 110152769 110150003 110155237 110160053
2245.6 110160053 110160553 110166430 110172248 110171151 110173965 110181117 110181224 110178125 110177100 110177779 110183144 110195851 110214901 110231721
2274.1 110231721 110243487 110262609 110289037 110304046 110298049 110279047 110250032 110206962 110160708 110121286 110081601 110031986
2298.6 110031986 109975338 109914064 109828961 109713876 109592927 109483075 109392703 109308708 109179258 108998537
2319 108998537 108836102 108731937 108648348 108541059 108422780 108345950 108320975 108297586 108253801 108208036 108186567
2341.4 108186567 108252561 108492506 108779371 108848357 108616304 108203149 107808518 107553792 107465839 107494855
2361.8A07494855J18828K28619L18384L53504L49927L33905L21126L12269L02279K69460
2382.2A10403156K05314J34922P8868L5584J1039O449O676L266J014P569J2172J1444
2406.7A10917473R918L648j586o91N269J2147J4413P975k003J097J1635N412j979M232
2435.2A10986960N400Q23M05M244J0574J4460J3399J1837N520k384J692O223Q82k432
2463.8A11057603k837l719R54L433P75n281j3411j2339n900n258j0204j0562n722n483
2492.3A10982049o378l481j156n484j5068j4591m435p677k1827k9206k5547j8990j8978
2518.9A10809231j2481p99m721j8084k6512k0456J156J1992k14r394m780k050l887
2545.4A10719001k098m053j2731j2637q285j6427k7597k1493p761j1384k1708k2066
$$ plain form
2361.8 107494855 107613683 107842302 108160686 108514190 108864117 109198022 109519148 109831417 110133696 110403156
2382.2 110403156 110608470 110743392 110822260 110857844 110868883 110875332 110882008 110885274 110886288 110893857 110906029 110917473
2406.7 110917473 110927391 110931039 110929453 110928762 110934031 110946178 110960591 110968566 110966563 110967660 110979295 110984707 110982728 110986960
2435.2 110986960 110992360 110993183 110993588 110997832 111008406 111022866 111036265 111048102 111053622 111051238 111052930 111059153 111060035 111057603
2463.8 111057603 111054766 111051047 111052001 111055434 111056209 111050928 111037517 111025178 111019278 111014020 111003816 110993254 110987532 110982049
2492.3 110982049 110975671 110972190 110971034 110965550 110950482 110935891 110931456 110923779 110901952 110872746 110847199 110828209 110809231
2518.9 110809231 110796750 110795951 110791230 110773146 110746634 110726178 110727334 110739326 110739112 110729718 110724938 110722888 110719001
2545.4 110719001 110716903 110712850 110700119 110687482 110679197 110662770 110635173 110613680 110605919 110594535 110572827 110550761
2569.8A10550761k1112k0087j9919k6060l1042l1280l0327k4927j7059j9216k4307
2592.3A10285425k2423k1601k2614k2697k0767j9419k5522l5859l5786k6107k4426
2614.7A10008204k5785k5249l0589m3475n4229m4655k5356k1207k5583k4855k1052
2637.1A09666169j7846j9062k6416l1007k9957k4712k1148l0303m7028o0117o7949
2659.6A09290624o9750o3169m9007l7455l7456l2258j6534j5092k0325l874K3925L2389
2684.1A09002018K8300L8111N0569M4107L1960K8813L2890L6991K8026L576j8072j6200
2708.5A09291089j0026k3198l5930l0029k4795m2820o6233o8652m0317k170J8871K4069
2733A08989859J5306J4401L4511M0769J9717p367k1028r871J2815J3852p832k4128
$$ plain form
2569.8 110550761 110529649 110509562 110489643 110463583 110432541 110401261 110370934 110346007 110328948 110309732 110285425
2592.3 110285425 110263002 110241401 110218787 110196090 110175323 110155904 110130382 110094523 110058737 110032630 110008204
2614.7 110008204 109982419 109957170 109926581 109883106 109828877 109784222 109758866 109737659 109712076 109687221 109666169
2637.1 109666169 109648323 109629261 109602845 109571838 109541881 109517169 109496021 109465718 109418690 109358573 109290624
2659.6 109290624 109220874 109157705 109108698 109071243 109033787 109001529 108984995 108969903 108949578 108945704 108969629 109002018
2684.1 109002018 109030318 109068429 109118998 109163105 109195065 109223878 109256768 109293759 109321785 109325361 109307289 109291089
2708.5 109291089 109281063 109257865 109221935 109191906 109167111 109124291 109058058 108989406 108949089 108946919 108965790 108989859
2733 108989859 109005165 109019566 109054077 109094846 109114563 109107196 109086168 109076297 109089112 109102964 109095132 109071004
2757.5A09071004l0899l4654l9649m1747m3487o5721r9921j19257j09827j00160j20723
2779.9A08264959j45817j61684j91473k20025k01201j67740j82855k29371k53105k43461
2800.3A06268227k47455k83253l20899l53384l83616m16863m67467n36335o24859p27963
2820.7A01906133q34942r53078j102716j293814j523799j821083k281010l020829m103559
2839.1H4971303n528820p098299q313489q643067p800552n734420k672324P09141L571459
2857.4D3460932N369833N976862N557353M403811K963609J891064J671380K060193
2873.7G3355037K276719J853132R73683K6828p81881j405478j860142k165758k343929
2892.1F9928211k432537k475768k530599k644450k815264l040469l346085l737223
$$ plain form
2757.5 109071004 109040105 109005451 108965802 108924055 108880568 108814847 108714926 108595669 108485842 108385682 108264959
2779.9 108264959 108119142 107957458 107765985 107545960 107344759 107177019 106994164 106764793 106511688 106268227
2800.3 106268227 106020772 105737519 105416620 105063236 104679620 104262757 103795290 103258955 102634096 101906133
2820.7 101906133 101071191 100118113 99015397 97721583 96197784 94376701 92095691 89074862 84971303
2839.1 84971303 79442483 72344184 64030695 55387628 47587076 41852656 39180332 39889473 43460932
2857.4 43460932 48830765 54807627 60364980 64768791 67732400 69623464 71294844 73355037
2873.7 73355037 75631756 77484888 78458571 78485399 77703518 76298040 74437898 72272140 69928211
2892.1 69928211 67495674 65019906 62489307 59844857 57029593 53989124 50643039 46905816
2908.4D6905816m183913m606846m876166m827166m309615l330814k062057p39395M73049
2926.8A8442893J504737K348198L140293L927210M546941M862371M837483M439807
2943.1D8049933L656810K589882J480561O59031L71206O56676J344025K165639K937198
2961.4F3910961L566665L980308M095400L900861L510571L050536K589071K168178
2977.8I0772551J811064J521957J284176J059842Q44389O33550L87448Q5300k87414
2996.1I8112863p17598j145375j463920j520508j215172n66816K90912J157946J834970
3014.5I4767302K182985K192211J965827J616704J265037R85873P40826N25963L81553
3032.8A06624281L18098K90478K14374J29938J11318J32548J50013J34552J15442J17767
$$ plain form
2908.4 46905816 42721903 38115057 33238891 28411725 24102110 20771296 18709239 17969844 18442893
2926.8 18442893 19947630 22295828 25436121 29363331 33910272 38772643 43610126 48049933
2943.1 48049933 51706743 54296625 55777186 56436217 56807423 57464099 58808124 60973763 63910961
2961.4 63910961 67477626 71457934 75553334 79454195 82964766 86015302 88604373 90772551
2977.8 90772551 92583615 94105572 95389748 96449590 97293979 97927529 98314977 98400277 98112863
2996.1 98112863 97395265 96249890 94785970 93265462 92050290 91483474 91774386 92932332 94767302
3014.5 94767302 96950287 99142498 101108325 102725029 103990066 104975939 105716765 106242728 106624281
3032.8 106624281 106942379 107232857 107447231 107577169 107688487 107821035 107971048 108105600 108221042 108338809
3053.2A08338809J09267J04308J06597P3219K9158K6095P1132J26410J41108J11437
3073.6A09237540N3990J4519M2343Q1563P8249P4709O9487N2524O7138P9978M7052
3096A09899092J108j1575J2171J8800j0205k5749N555K5082o759j3161K2650O4909
3120.5A09981918J02616R4747M9150J9324K4188L7026J6475l1531m0162J5331N0556
3143A10319638L7146K3043o652m2033p427O0082O0320L0577K6607K2793J3530J3948
3167.4A10551572J6212J2422Q583M780J991N663Q869J609r525j4007R90K8157K9850
3193.9A10647166J1694N222R298J5008J3459N686J4520K8110J7714L481J347l004j383
3220.5A10768318O736L802L088L671k4461m2105R346O0654M1318J0478j001k8396l1483
$$ plain form
3053.2 108338809 108448076 108552384 108658981 108732200 108761358 108787453 108858585 108984995 109126103 109237540
3073.6 109237540 109291530 109306049 109348392 109429955 109508204 109582913 109652400 109704924 109772062 109852040 109899092
3096 109899092 109900200 109888625 109900796 109919596 109909391 109883642 109889197 109914279 109907520 109894359 109917009 109981918
3120.5 109981918 110084534 110179281 110228431 110247755 110271943 110308969 110325444 110293913 110253751 110269082 110319638
3143 110319638 110356784 110379827 110373175 110331142 110323715 110383797 110444117 110474694 110501301 110524094 110537624 110551572
3167.4 110551572 110567784 110580206 110588789 110593569 110595560 110601223 110610092 110611701 110602176 110588169 110589159 110617316 110647166
3193.9 110647166 110658860 110664082 110673380 110688388 110701847 110707533 110722053 110750163 110767877 110771358 110772705 110769701 110768318
3220.5 110768318 110775054 110778856 110781944 110785615 110761154 110719049 110728395 110789049 110830367 110840845 110839844 110811448 110779965
3247A10779965J6141L7587Q499j4341K158J7321J216j2100j4293l4559o4730m2987
3271.4A10679877J9181M8542M0805J9932l481j0264j0121l5477o2596n0009r238K5427
3295.9A10652578M2033K5427l8349r8205q0979M614P8606Q6272L7193r53N269O139
3320.4A10719645k7883n5194k0897L6537L2604j8132n9402p4577m2951J919J6058K6285
3344.9A10534012L422n2548l0875L8767L8051j3172m9091m3189k8515o5386r5690k7978
3369.3A10207808P5543Q7881K4188j2434J717K7466K9778L576m3869q5866n4038L0112
3393.8A10291862L4857n1200q6010L493Q6439M0126l2819l5750o903K3520K8289o426
3418.3A10289478k8598j8191k0552n5587q7309p8643o9117p7129l1793M4442N7232
$$ plain form
3247 110779965 110796106 110833693 110842192 110827851 110830009 110847330 110848546 110836446 110822153 110787594 110722864 110679877
3271.4 110679877 110699058 110747600 110788405 110808337 110804856 110794592 110784471 110748994 110686398 110636389 110627151 110652578
3295.9 110652578 110694611 110720038 110681689 110583484 110502505 110507119 110585725 110671997 110709190 110708237 110713506 110719645
3320.4 110719645 110691762 110636568 110615671 110652208 110684812 110666680 110607278 110532701 110489750 110491669 110507727 110534012
3344.9 110534012 110537434 110484886 110454011 110492778 110530829 110517657 110468566 110425377 110396862 110331476 110235786 110207808
3369.3 110207808 110283351 110371232 110395420 110382986 110384703 110412169 110441947 110445523 110401654 110315788 110261750 110291862
3393.8 110291862 110326719 110275519 110189509 110193002 110279441 110319567 110286748 110250998 110244095 110267615 110295904 110289478
3418.3 110289478 110260880 110242689 110222137 110166550 110079241 110000598 109931481 109854352 109822559 109867001 109924233
3440.7A09924233J3185m1402o6864m3381k1481k5213m2784q7226j14214o4874l7861
3463.2A09392118j19936j66667k8693J65462J84775N9247n4395l6502J18756J53506
3483.6A09667671L3176J4913O0665K4689l8374o5529m2677l6824p1072P355J08087
3506A09662080M5275p7033j40583j03593k0730o712o2585j07896o3634K1696K7931
3528.4A09174216p320k4449l6729q786M2499L3378n066K0086R5571J14643P6032P6377
3552.9A09550452R9945Q4257N4169M8161P3266J01816Q4615M2975N8937R1887Q2540
3575.3A10373020N4336K8825M696j6069j2887K0111R656m5741o3943m0925o986N0068
3599.8A10354161J08397J12415J01030J17719J26183R4902L7623j109p939p022N460
$$ plain form
3440.7 109924233 109937418 109896016 109829152 109785771 109764290 109739077 109696293 109609067 109494853 109429979 109392118
3463.2 109392118 109272182 109105515 109076822 109242284 109427059 109486306 109431911 109395409 109514165 109667671
3483.6 109667671 109700847 109715760 109776425 109801114 109762740 109697211 109654534 109617710 109546638 109553993 109662080
3506 109662080 109707355 109630322 109489739 109386146 109365416 109358704 109296119 109188223 109124589 109146285 109174216
3528.4 109174216 109166896 109142447 109105718 109096932 109139431 109172809 109167743 109187829 109283400 109398043 109474075 109550452
3552.9 109550452 109650397 109734654 109788823 109836984 109910250 110012066 110096681 110139656 110198593 110290480 110373020
3575.3 110373020 110427356 110456181 110460877 110444808 110431921 110452032 110461688 110415947 110352004 110311079 110304093 110354161
3599.8 110354161 110462558 110574973 110676003 110793722 110919905 111014807 111052430 111051321 111043382 111036360 111041820
3622.2A11041820K7204L9875M3750K9826J2338J9408K5546K1029J7547J1516P284k99
3646.7A11296844j8358J359M4060L4511j4937l2437P987M8197M8005L2509J8584j1742
3671.2A11454582k6965j109J4508J848j0097k0111k4593l4606q822M8090K7036j7226
3695.7A11402535o949K8181L5905J0586k098K0290N1486N6470K5141k2674n5563m7493
3720.1A11495817l1305l6049j7297J2994K1863K0230K563n400J9157M6765O9714O6829
3744.6A11665881J3649r823Q834K360j3518K026K8265J6928j1635n091N424r5l052
3771.1A11700153q821r561n257J121J3351J2994j478j4889j4794j991O139Q536K110
3797.7A11687613k528J8657J9443k194J371J4007J1897o354k4986k9123j0800K0397
$$ plain form
3622.2 111041820 111069024 111108899 111152649 111182475 111194813 111214221 111239767 111260796 111278343 111289859 111297143 111296844
3646.7 111296844 111278486 111279845 111323905 111358416 111343479 111311042 111319029 111367226 111415231 111447740 111466324 111454582
3671.2 111454582 111427617 111426508 111441016 111442864 111432767 111412656 111388063 111353457 111344635 111392725 111419761 111402535
3695.7 111402535 111395586 111423767 111459672 111470258 111468160 111488450 111539936 111596406 111621547 111598873 111543310 111495817
3720.1 111495817 111464512 111428463 111411166 111424160 111446023 111466253 111468816 111463416 111482573 111529338 111599052 111665881
3744.6 111665881 111679530 111669707 111678541 111680901 111667383 111669409 111697674 111714602 111702967 111697876 111703300 111703205 111700153
3771.1 111700153 111691332 111681771 111676514 111677635 111690986 111703980 111702502 111687613 111672819 111670828 111676967 111685503 111687613
3797.7 111687613 111685085 111703742 111723185 111720991 111722362 111736369 111748266 111741912 111716926 111687803 111677003 111697400
3822.1A11697400J4162N36O426J1754l100m4548l5012M4715O4302J8871r978j9622
3846.6A11745906j8954K336N3287N5921j4138l0518N245K3925J133j4615q023l576
3871.1A11797929N007R608j6606j6558O819j3411q595K2077J7369K3675K9397l255
3895.5A11853456k1362q94J3507J5044J4484j979j3805j7976j3590J7452L6430R811
3920A11890578j5032j5485o640o68L195O628j2004j9288N960P439J490P891p307r501
3948.6A11837256J4043K4509J6141N257m947k7263l3188l540J4281Q571K837k956p594
3975.1A11843407o020R90J4698K2340J1480J633r251k4211j2410P975J490
3997.5A11852121
$$ plain form
3822.1 111697400 111711562 111712098 111718524 111730278 111727178 111682630 111647618 111692333 111756635 111775506 111765528 111745906
3846.6 111745906 111726952 111729288 111782575 111838496 111824358 111793840 111799085 111823010 111824143 111809528 111801505 111797929
3871.1 111797929 111802936 111812544 111795938 111779380 111786199 111772788 111764193 111786270 111803639 111827314 111856711 111853456
3895.5 111853456 111832094 111831200 111844707 111859751 111874235 111872256 111858451 111840475 111826885 111844337 111880767 111890578
3920 111890578 111875546 111860061 111853421 111852753 111855948 111862576 111850572 111831284 111837244 111844683 111846173 111854064 111846757 111837256
3948.6 111837256 111851299 111875808 111891949 111897206 111892259 111864996 111831808 111828268 111842549 111851120 111853957 111851001 111843407
3975.1 111843407 111837387 111838377 111853075 111875415 111886895 111888528 111879277 111855066 111842656 111850631 111852121
3997.5 111852121
##END=$$ End of the data block
