##TITLE=$$ Begin of the data block
##JCAMP-DX=5.00 $$ ACD/SpecManager v 10.08
##SPECTROMETER/DATA SYSTEM=Alpha
##DATE=27 Jun 2014 15:13:00
##DATA TYPE=INFRARED SPECTRUM
##DATA CLASS=XYDATA
##ORIGIN=
##OWNER=
##NPOINTS=1667
##FIRSTX=599.63549805
##LASTX=3997.56909180
##MAXX=3997.56909180
##MINX=599.63549805
##MAXY=1.11802304
##MINY=0.18332450
##XFACTOR=1.0000000000
##YFACTOR=0.000000010000000
##FIRSTY=1.07878780
##DELTAX=2.03957605
##XUNITS=1/CM
##YUNITS=ARBITRARY UNITS
##XYDATA=(X++(Y..Y))
$$ plain form
599.6 107878780 107779133 107833207 107940865 108057415 108179510 108294916 108376694 108416247 108440220 108474922 108513403
622.1 108513403 108557594 108593297 108557880 108439326 108294964 108162069 108023119 107861114 107716417 107622886
642.5 107622886 107517278 107345176 107158685 107019949 106919444 106802356 106649017 106482065 106298959 106086087
662.9 106086087 105772185 105185914 104682970 104676318 104592693 104281509 103925538 103607345 103329861 103084314
683.3 103084314 102860713 102646863 102437949 102232087 102027726 101795340 101475477 101041639 100476778 99685097
703.7 99685097 98568118 97181505 95783973 94657010 93807262 93043929 92319721 91884333 92058510
722 92058510 92843807 93954927 95117581 96180981 97132421 98021138 98855078 99620664 100308621 100909400
742.4 100909400 101428628 101893616 102327001 102721131 103039348 103256786 103385699 103470778 103566718 103712213
$$ packed form
599.6A07878780r9647N4074J07658J16550J22095J15406Q1778L9553K3973L4702L8481
622.1A08513403M4191L5703l5417j18554j44362j32895j38950j62005j44697r3531
642.5A07622886j05608j72102j86491j38736j00505j17088j53339j66952j83106k12872
662.9A06086087l13902n86271n02944o652q3625l11184l55971l18193k77484k45547
683.3A03084314k23601k13850k08914k05862k04361k32386l19863m33838n64861p91681
703.7I9685097j116979j386613j397532j126963q49748p63333p24208m35388J74177
722I2058510P85297J111120J162654J063400R51440Q88717Q33940P65586O87957O00779
742.4A00909400N19228M64988M33385L94130L18217K17438J28913Q5079R5940J45495
$$ plain form
762.8 103712213 103895378 104043221 104114461 104158819 104242444 104359603 104465640 104559219 104669833 104776037
783.2 104776037 104842675 104897463 104953444 104982984 104977739 104948032 104900312 104839432 104756486 104629576 104472721
805.6 104472721 104333818 104221559 104084241 103924239 103805912 103717172 103612447 103531706 103523111 103531229 103464961
828.1 103464961 103312850 103118122 102929115 102789474 102696931 102615309 102516556 102405131 102328467 102333736 102408540
850.5 102408540 102498734 102554321 102545106 102487409 102411699 102316463 102181828 101998806 101778460 101547134 101344872
872.9 101344872 101224458 101218283 101286745 101359391 101415420 101484609 101575589 101650250 101664257 101557982 101259482
895.4 101259482 100869453 100651646 100643325 100692546 100735700 100723577 100631332 100517023 100433445 100387192 100352275
917.8 100352275 100268805 100073099 99800986 99598473 99590069 99773824 100008416 100126052 100095332 100024951 100023639
$$ packed form
762.8A03712213J83165J47843P1240M4358Q3625J17159J06037R3579J10614J06204
783.2A04776037O6638N4788N5981K9540n245k9707m7720o0880q2946j26910j56855
805.6A04472721j38903j12259j37318j60002j18327q8740j04725q0741q595Q118o6268
828.1A03464961j52111j94728j89007j39641r2543q1622r8753j11425p6664N269P4804
850.5A02408540R0194N5587r215n7697p5710r5236j34635j83022k20346k31326k02262
872.9A01344872j20414o175O8462P2646N6029O9189R0980P4661J4007j06275k98500
895.4A01259482l90029k17807q321M9221M3154j2123r2245j14309q3578m6253l4917
917.8A00352275q3470j95706k72113k02513q404J83755K34592J17636l0720p0381j312
$$ plain form
940.2 100023639 100091696 100150740 100146496 100072753 99940956 99768257 99576765 99403358 99292123 99248314 99233252
962.7 99233252 99226910 99218541 99167579 99060428 98910475 98717374 98540092 98478651 98522604 98589712 98673987
985.1 98673987 98805815 98965234 99094760 99157220 99171638 99162912 99115741 99006134 98834771 98615170 98355204
1007.5 98355204 98113871 98023510 98090285 98116708 97975600 97751981 97572976 97454989 97357816 97299618 97316110
1030 97316110 97363102 97349042 97179943 96731955 95952392 95090163 94603562 94632214 94909006 95232415 95564437
1052.4 95564437 95858556 96070939 96207613 96311182 96407396 96485555 96523982 96502548 96403474 96205103 95870346
1074.9 95870346 95353299 94641238 93781984 92863852 91965657 91094726 90210152 89314097 88454545 87689173
1095.2 87689173 87107617 86808985 86814445 87053740 87415487 87751603 87894440 87768251 87441307 87081611
$$ packed form
940.2A00023639O8057N9044m244p3743j31797j72699j91492j73407j11235m3809j5062
962.7I9233252o342q369n0962j07151j49953j93101j77282o1441M3953O7108Q4275
985.1I8673987J31828J59419J29526O2460J4418q726m7171j09607j71363k19601k59966
1007.5I8355204k41333r0361O6775K6423j41108k23619j79005j17987r7173n8198J6492
1030I7316110M6992j4060j69099m47988p79563q62229m86601K8652K76792L23409L32022
1052.4I5564437K94119K12383J36674J03569R6214P8159L8427k1434r9074j98371l34757
1074.9I5870346n17047p12061q59254r18132q98195q70931q84574q96055q59552p65372
1095.2H7689173n81556k98632N460K39295L61747L36116J42837j26189l26944l59696
$$ plain form
1115.6 87081611 86908609 87097794 87653452 88360763 88875145 88907707 88414657 87496442 86129653 84288305
1136 84288305 82188445 80167240 78437346 77026618 75841725 74745423 73635614 72485280 71328002
1154.4 71328002 70247155 69354677 68729180 68380648 68267685 68340629 68563187 68936104 69536150 70437580
1174.8 70437580 71592391 72919387 74390316 75921887 77379566 78697193 79873800 80915278
1191.1 80915278 81835574 82681352 83522826 84384656 85213971 85941499 86518049 86925614 87190586 87366074
1211.5 87366074 87503356 87629861 87729490 87753052 87659717 87441337 87136304 86817926 86537069 86286855
1231.9 86286855 86041313 85815901 85679585 85706937 85932440 86350149 86912024 87541533 88156927 88688421
1252.3 88688421 89115250 89472020 89802295 90123773 90419710 90670115 90896672 91141480 91418070 91694957
$$ packed form
1115.6H7081611j73002J89185N55658P07311N14382L2562m93050r18215j366789j841348
1136H4288305k099860k021205j729894j410728j184893j096302j109809j150334j157278
1154.4G1328002j080847q92478o25497l48532j12963P2944K22558L72917O00046R01430
1174.8G0437580J154811J326996J470929J531571J457679J317627J176607J041478
1191.1H0915278R20296Q45778Q41474Q61830Q29315P27528N76550M07565K64972J75488
1211.5H7366074J37282J26505R9629K3562r3335k18380l05033l18378k80857k50214
1231.9H6286855k45542k25412j36316K7352K25503M17709N61875O29509O15394N31494
1252.3H8688421M26829L56770L30275L21478K95937K50405K26557K44808K76590K76887
$$ plain form
1272.7 91694957 91939712 92141896 92305911 92500395 92838478 93338186 93883598 94348282 94690639 94940519
1293.1 94940519 95131201 95267338 95359170 95467138 95667195 95956236 96257299 96529549 96792245 97037709
1313.5 97037709 97223997 97350651 97472203 97642750 97879034 98155987 98415715 98597813 98659235 98584294
1333.9 98584294 98384368 98094136 97795826 97589165 97458565 97321779 97151095 96969205 96801889 96642667
1354.3 96642667 96496505 96408153 96391827 96392959 96362185 96297419 96209919 96066022 95657271 94803029 93949568
1376.7 93949568 93857634 94702941 96006405 97289318 98437881 99371165 99986845 100338662 100552845
1395.1 100552845 100804794 101219940 101790559 102413678 102946603 103162718 102892888 102111328 101053202
1413.4 101053202 100139678 99676663 99798739 100255597 100616300 100616431 100134659 99179494 98014599 96927059
$$ packed form
1272.7I1694957K44755K02184J64015J94484L38083M99708N45412M64684L42357K49880
1293.1I4940519J90682J36137R1832J07968K00057K89041L01063K72250K62696K45464
1313.5I7037709J86288J26654J21552J70547K36284K76953K59728J82098O1422p4941
1333.9I8584294j99926k90232k98310k06661j30600j36786j70684j81890j67316j59222
1354.3I6642667j46162q8352j6326J132l0774o4766q7500j43897m08751q54242q53461
1376.7I3949568r1934Q45307J303464J282913J148563R33284O15680L51817K14183
1395.1A00552845K51949M15146N70619O23119N32925K16115k69830p81560j058126
1413.4A01053202r13524m63015J22076M56858L60703J31m81772r55165j164895j087540
$$ plain form
1433.8 96927059 95785660 94639891 93780196 93015766 92200583 91330844 90288758 89002192 87438858
1452.2 87438858 85694444 83920765 82679832 82171398 81645334 80847251 80987442 83577824 88697535
1470.5 88697535 95267868 100276816 102857053 104382527 105533242 106461608 107155490 107668412 108075893
1488.9 108075893 108394849 108610356 108696032 108607042 108473992 108575916 108907187 109290135 109583235 109760070
1509.3 109760070 109883690 109972763 110034645 110081744 110122800 110142899 110160017 110186315 110212409 110241365 110248446
1531.7 110248446 110214341 110186172 110155749 110048127 109907401 109810209 109740257 109693146 109665072 109671390 109727776
1554.1 109727776 109810078 109857440 109876609 109929180 109976375 110011387 110046458 110094225 110159123 110188270 110165882
1576.6 110165882 110161579 110177207 110172105 110157192 110151315 110151327 110147655 110130322 110083556 110010874 109927046 109827566 109731865
$$ packed form
1433.8I6927059j141399j145769q59695p64430q15183q69739j042086j286566j563334
1452.2H7438858j744414j773679j240933n08434n26064p98083J40191K590382N119711
1470.5H8697535O570333N008948K580237J525474J150715R28366O93882N12922M07481
1488.9A08075893L18956K15507Q5676q8990j33050J01924L31271L82948K93100J76835
1509.3A09760070J23620Q9073O1882M7099M1056K0099J7118K6298K6094K8956P081
1531.7A10248446l4105k8169l0423j07622j40726r7192o9952m7111k8074O318N6386
1554.1A09727776Q2302M7362J9169N2571M7195L5012L5071M7767O4898K9147k2388
1576.6A10165882m303J5628n102j4913n877J2l672j7333m6766p2682q3828r9480r5701
$$ plain form
1603.1 109731865 109670842 109659362 109671569 109678245 109669411 109621024 109528267 109449267 109365618 109232521 109105647
1625.5 109105647 109017229 108966362 108936501 108867311 108700204 108516085 108340240 108112288 107847369 107539630
1645.9 107539630 107281971 107147384 106945014 106586027 106376278 106240964 106069314 105860794 105665827 105543852
1666.3 105543852 105478263 105529106 105728316 106035829 106334364 106509101 106579459 106560040 106416988 106206167
1686.7 106206167 105933952 105557656 105146182 104612815 103974748 103256273 102351248 101544321 100754178 99848932
1707.1 99848932 99034441 98323470 97592914 96631742 95049042 93076921 91071063 88651615 85645592
1725.5 85645592 82148170 78057498 73281425 66618520 59212995 53314656 47590107 42535579
1741.8 42535579 39521623 38681084 40268007 44824469 51977849 59976989 68580759 77272290 84647816
$$ packed form
1603.1A09731865o1023j1480J2207O676q834m8387r2757p9000q3649j33097j26874
1625.5A09105647q8418n0867k9861o9190j67107j84119j75845k27952k64919l07739
1645.9A07539630k57659j34587k02370l58987k09749j35314j71650k08520j94967j21975
1666.3A05543852o5589N0843J99210L07513K98535J74737P0358j9419j43052k10821
1686.7A06206167k72215l76296m11474n33367o38067p18475r05025q06927p90143r05246
1707.1I9848932q14491p10971p30556r61172j582700j972121k005858k419448l006023
1725.5H5645592l497422m090672m776073o662905p405525n898339n724549n054528
1741.8D2535579l013956q40539J586923M556462P153380P999140Q603770Q691531P375526
$$ plain form
1760.1 84647816 90785807 95258611 98206550 100372922 101967573 103194189 104112935 104745567 105229402
1778.5 105229402 105648673 106001985 106306458 106550324 106748891 106920946 107101035 107261550 107390928 107507145
1798.9 107507145 107611179 107714677 107815075 107922602 108018136 108105004 108179080 108250344 108321762 108392119 108456349
1821.3 108456349 108507490 108557212 108603132 108651006 108696401 108739734 108770323 108795595 108822966 108850598 108873069
1843.8 108873069 108896005 108921731 108938587 108953285 108959723 108961308 108966291 108982146 108997273 109002340 108999300 109000969 109009397
1870.3 109009397 109008551 109005260 109004653 109006405 109007263 109016573 109027398 109031487 109031343 109035873 109046757 109055567 109061944 109065068 109070814
1900.9 109070814 109071827 109067762 109062803 109058011 109051979 109044909 109037483 109033668 109036553 109031129 109018779 109012139 109015083 109019113
1929.4 109019113 109022009 109017706 109007609 109003842 108998740 108993709 109002399 109018850 109027696 109031391 109035647 109044075 109055829
$$ packed form
1760.1H4647816O137991M472804K947939K166372J594651J226616R18746O32632M83835
1778.5A05229402M19271L53312L04473K43866J98567J72055J80089J60515J29378J16217
1798.9A07507145J04034J03498J00398J07527R5534Q6868P4076P1264P1418P0357O4230
1821.3A08456349N1141M9722M5920M7874M5395M3333L0589K5272K7371K7632K2471
1843.8A08873069K2936K5726J6856J4698O438J585M983J5855J5127N067l040J669Q428
1870.3A09009397q46l291o07J752Q58R310J0825M089j44M530J0884Q810O377L124N746
1900.9A09070814J013m065m959m792o032p070p426l815K885n424j2350o640K944M030
1929.4A09019113K896m303j0097l767n102n031Q690J6451Q846L695M256Q428J1754
$$ plain form
1955.9 109055829 109064305 109067380 109066486 109063601 109065211 109073746 109076810 109071290 109065437 109062922 109065175 109070826 109069169 109063232
1984.5 109063232 109062135 109061265 109061372 109067237 109074092 109073043 109064221 109054792 109056830 109066296 109062278 109045672 109036696 109035563
2013 109035563 109026146 109010863 108997869 108989847 108989453 108986211 108980060 108985341 108995974 109005666 109021640 109038734 109050941
2039.6 109050941 109059811 109064031 109072030 109090137 109109950 109125113 109138799 109153342 109163094 109170914 109184766 109202635
2064 109202635 109215975 109224141 109235799 109250414 109265006 109280932 109295869 109308767 109324419 109346008 109371030 109392285
2088.5 109392285 109406960 109420967 109438670 109457326 109472620 109483731 109495389 109510684 109526658 109545147 109568739
2110.9 109568739 109592438 109605765 109611928 109623027 109637547 109651268 109663010 109672511 109683633 109694302 109696901 109700525
2135.4 109700525 109712768 109719098 109711552 109707081 109716666 109721231 109713745 109717178 109738302 109757447 109766245 109768462 109769833
$$ packed form
1955.9A09055829Q476L075q94k885J610Q535L064n520n853k515K253N651j657n937
1984.5A09063232j097q70J07N865O855j049q822r429K038R466m018j6606q976j133
2013A09035563r417j5283j2994q022l94l242o151N281J0633R692J5974J7094J2207
2039.6A09050941Q870M220P999J8107J9813J5163J3686J4543R752P820J3852J7869
2064A09202635J3340Q166J1658J4615J4592J5926J4937J2898J5652K1589K5022K1255
2088.5A09392285J4675J4007J7703J8656J5294J1111J1658J5295J5974J8489K3592
2110.9A09568739K3699J3327O163J1099J4520J3721J1742R501J1122J0669K599L624
2135.4A09700525J2243O330p546m471R585M565p486L433K1124J9145Q798K217J371
$$ plain form
2161.9 109769833 109781587 109805572 109830511 109851301 109873331 109896672 109914148 109924781 109934664 109942138 109949350 109965038
2186.4 109965038 109988785 110015166 110037005 110050845 110061228 110074961 110092854 110110259 110121024 110126817 110138309 110156333
2210.9 110156333 110171437 110180044 110186839 110196650 110207713 110217047 110223520 110228956 110239422 110252726 110265970 110281026 110290468
2237.4 110290468 110285580 110277760 110282290 110286689 110281694 110279083 110277641 110272491 110275459 110283744 110281968 110274684 110269117 110265076
2265.9 110265076 110268414 110279465 110289252 110298216 110312390 110331869 110354006 110369444 110365582 110343790 110313559 110275722
2290.4 110275722 110230768 110190344 110153484 110098529 110029233 109962332 109875977 109757054 109634161 109523594 109431708
2312.9 109431708 109352708 109235537 109065330 108904397 108796668 108718443 108625984 108512974 108427668 108393610
2333.3 108393610 108360958 108300614 108235908 108210957 108284831 108522034 108801723 108869338 108640635 108244026 107874084
$$ packed form
2161.9A09769833J1754K3985K4939K0790K2030K3341J7476J0633R883P474P212J5688
2186.4A09965038K3747K6381K1839J3840J0383J3733J7893J7405J0765N793J1492J8024
2210.9A10156333J5104Q607O795R811J1063R334O473N436J0466J3304J3244J5056R442
2237.4A10290468m888p820M530M399m995k611j442n150K968Q285j776p284n567m041
2265.9A10265076L338J1051R787Q964J4174J9479K2137J5438l862k1792l0231l7837
2290.4A10275722m4954m0424l6860n4955o9296o6901q6355j18923j22893j10567r1886
2312.9A09431708p9000j17171j70207j60933j07729p8225r2459j13010q5306l4058
2333.3A08393610l2652o0344o4706k4951P3874K37203K79689O7615k28703l96609l69942
$$ plain form
2355.7 107874084 107622743 107518876 107537496 107651913 107867217 108166623 108504593 108845317 109176278 109492826
2376.1 109492826 109797418 110095894 110364056 110562122 110683620 110752106 110783112 110787606 110785079 110787010 110790992
2398.5 110790992 110796177 110804117 110805953 110801852 110805261 110815787 110820746 110819364 110824037 110837519 110847020 110843647 110836864 110842395
2427.1 110842395 110858476 110863459 110857761 110863006 110872436 110872245 110871315 110873771 110874486 110878766 110889351 110898912 110901594 110896552
2455.6 110896552 110894597 110901213 110901356 110890687 110881186 110878170 110879159 110876381 110870171 110866988 110863066 110854208 110845363 110838830
2484.2 110838830 110832572 110829234 110824335 110813355 110803890 110800195 110794771 110779774 110757041 110737085 110722601 110703325 110682738
2510.7 110682738 110670292 110658514 110639751 110619819 110606575 110595036 110580432 110564244 110544074 110524833 110517573 110517371
2535.2 110517371 110513341 110505891 110499525 110494435 110490751 110495341 110499609 110486472 110466290 110453165 110440338 110418117 110394001
$$ packed form
2355.7A07874084k51341j03867J8620J14417K15304K99406L37970L40724L30961L16548
2376.1A09492826L04592K98476K68162J98066J21498O8486L1006M494k527J931L982
2398.5A10790992N185P940J836m101L409J0526M959j382M673J3482R501l373o783N531
2427.1A10842395J6081M983n698N245R430j91r30K456P15M280J0585R561K682n042
2455.6A10896552j955O616J43j0669r501l016R89k778o210l183l922q858q845o533
2484.2A10838830o258l338m899j0980r465l695n424j4997k2733j9956j4484j9276k0587
2510.7A10682738j2446j1778j8763j9932j3244j1539j4604j6188k0170j9241p260k02
2535.2A10517371m030p450o366n090l684M590M268j3137k0182j3125j2827k2221k4116
$$ plain form
2561.7 110394001 110377896 110363448 110346913 110329151 110306633 110278928 110250306 110225308 110204124 110184157 110156834
2584.1 110156834 110120058 110089779 110070384 110053742 110040927 110029078 110005546 109972656 109944797 109923232 109900081
2606.6 109900081 109870231 109840453 109819031 109796953 109767342 109736896 109705269 109664500 109617984 109580004 109554517
2629 109554517 109527421 109493077 109463727 109446776 109436047 109421039 109397995 109369957 109339571 109313881 109294689 109267163
2653.5 109267163 109217834 109148562 109077930 109021485 108972263 108919835 108871174 108836877 108815920 108802235 108785975
2675.9 108785975 108765006 108761644 108789003 108825636 108855879 108888781 108930135 108971357 109006143 109037673 109072757 109109008
2700.4 109109008 109133172 109139776 109129798 109113693 109102321 109086537 109060228 109030688 108995450 108949280 108895552 108838010
2724.8 108838010 108800972 108803642 108826005 108846581 108857644 108871663 108905363 108942330 108963680 108964181 108947647 108939815
$$ packed form
2561.7A10394001j6105j4448j6535j7762k2518k7705k8622k4998k1184j9967k7323
2584.1A10156834l6776l0279j9395j6642j2815j1849k3532l2890k7859k1565k3151
2606.6A09900081k9850k9778k1422k2078k9611l0446l1627m0769m6516l7980k5487
2629A09554517k7096l4344k9350j6951j0729j5008k3044k8038l0386k5690j9192k7526
2653.5A09267163m9329o9272p0632n6445m9222n2428m8661l4297k0957j3685j6260
2675.9A08785975k0969l362K7359L6633L0243L2902M1354M1222L4786L1530L5084L6251
2700.4A09109008K4164O604r978j6105j1372j5784k6309k9540l5238m6170n3728n7542
2724.8A08838010l7038K670K2363K0576J1063J4019L3700L6967K1350N01j6534p832
$$ plain form
2749.3 108939815 108949959 108957088 108949494 108932066 108909082 108882594 108848238 108802080 108745193 108672833 108580267 108470154
2773.8 108470154 108368075 108278608 108163631 108019233 107863021 107680190 107467651 107269549 107100999 106917751
2794.2 106917751 106695426 106451511 106207466 105959308 105687106 105379570 105030382 104649794 104247713 103795767
2814.6 103795767 103265667 102650881 101936650 101108909 100161469 99070698 97797942 96296048 94482714
2832.9 94482714 92204654 89202738 85133410 79648924 72596371 64315498 55692583 47910219
2849.3 47910219 42196730 39539742 40248719 43805024 49149653 55096668 60625941 65008062 67957389
2867.6 67957389 69835991 71492368 73543447 75819588 77674329 78653532 78691393 77918124 76516861
2886 76516861 74663192 72502232 70163023 67750019 65302426 62787980 60151774 57349753 54322332
$$ packed form
2749.3A08939815J0144P129p594j7428k2984k6488l4356m6158n6887p2360r2566j10113
2773.8A08470154j02079q9467j14977j44398j56212j82831k12539j98102j68550j83248
2794.2A06917751k22325k43915k44045k48158k72202l07536l49188l80588m02081m51946
2814.6A03795767n30100o14786p14231q27741r47440j090771j272756j501894j813334
2832.9I4482714k278060l001916m069328n484486p052553q280873q622915p782364
2849.3D7910219n713489k656988P08977L556305N344629N947015N529273M382121K949327
2867.6F7957389J878602J656377K051079K276141J854741R79203L7861p73269j401263
2886G6516861j853669k160960k339209k413004k447593k514446k636206k802021l027421
$$ plain form
2904.3 54322332 50980604 47243530 43071944 38484883 33615699 28792292 24491453 21160446
2920.6 21160446 19087619 18332450 18788280 20287497 22649515 25808176 29744118 34287089 39130417
2939 39130417 43939704 48356003 52001917 54587257 56062675 56717891 57086802 57737881 59072775
2957.4 59072775 61231107 64161396 67712647 71660954 75709313 79566771 83053964 86092448
2973.7 86092448 88673437 90843791 92656422 94163942 95434576 96504295 97364694 97998816 98383904
2992 98383904 98475105 98192590 97479492 96348745 94904661 93398958 92188692 91613334 91890329 93040842
3012.4 93040842 94869268 97046405 99236006 101193869 102805293 104068947 105043256 105769908 106294501
3030.8 106294501 106688309 107019472 107310283 107518828 107644403 107748747 107877457 108031678 108174312 108296144
$$ packed form
2904.3E4322332l341728l737074m171586m587061m869184m823407m300839l331007
2920.6B1160446k072827p55169M55830J499217K362018L158661L935942M542971M843328
2939C9130417M809287M416299L645914K585340J475418O55216L68911O51079J334894
2957.4E9072775K158332K930289L551251L948307M048359L857458L487193L038484
2973.7H6092448K580989K170354J812631J507520J270634J069719Q60399O34122L85088
2992I8383904R1201k82515p13098j130747j444084j505703j210266n75358K76995J150513
3012.4I3040842J828426K177137K189601J957863J611424J263654R74309P26652N24593
3030.8A06294501L93808L31163K90811K08545J25575J04344J28710J54221J42634J21832
$$ plain form
3051.2 108296144 108418131 108535886 108649087 108751976 108814228 108839428 108863568 108932781 109060836 109204805
3071.6 109204805 109325242 109392166 109410238 109442270 109512258 109592843 109674132 109740353 109790659 109862816 109945285
3094 109945285 109984195 109975278 109971118 109997702 110019708 110007691 109983456 109997237 110028613 110009885 109976208 109996879
3118.5 109996879 110077679 110193121 110292351 110343194 110359776 110378540 110417712 110439897 110406673 110360193 110373688
3140.9 110373688 110433090 110478628 110494447 110475326 110428870 110420668 110483575 110558605 110606170 110634387 110648489 110657001
3165.4 110657001 110671020 110687196 110702360 110717630 110719728 110710537 110708070 110712135 110715079 110710466 110698962 110704637 110738492
3191.9 110738492 110773325 110788047 110785437 110779822 110789108 110810876 110827994 110847175 110876667 110895550 110897326 110898221 110897112
3218.4 110897112 110896337 110905766 110915482 110919034 110915315 110888028 110852790 110864449 110912907 110939860 110943878 110940194 110915780
$$ packed form
3051.2A08296144J21987J17755J13201J02889O2252K5200K4140O9213J28055J43969
3071.6A09204805J20437O6924J8072L2032O9988Q0585Q1289O6221N0306P2157Q2469
3094A09945285L8910q917m160K6584K2006j2017k4235J3781L1376j8728l3677K0671
3118.5A09996879Q0800J15442R9230N0843J6582J8764L9172K2185l3224m6480J3495
3140.9A10373688N9402M5538J5819j9121m6456q202O2907P5030M7565K8217J4102Q512
3165.4A10657001J4019J6176J5164J5270K098r191k467M065K944m613j1504N675L3855
3191.9A10738492L4833J4722k610n615R286K1768J7118J9181K9492J8883J776Q95j109
3218.4A10897112p75R429R716L552l719k7287l5238J1659M8458K6953M018l684k4414
$$ plain form
3244.9 110915780 110894239 110913825 110946596 110951436 110936821 110936284 110956037 110974050 110977709 110964060 110916162 110833251
3269.4 110833251 110786533 110817003 110870469 110903347 110915899 110913837 110908699 110903084 110871506 110815167 110771382 110758591
3293.9 110758591 110781670 110831189 110854053 110801256 110697269 110622585 110630345 110700774 110776258 110813880 110820413 110825169
3318.4 110825169 110829437 110804856 110755372 110743046 110786629 110820639 110798526 110732269 110657668 110629404 110648203 110667598
3342.8 110667598 110687125 110685027 110625064 110575104 110598075 110640562 110638261 110589695 110537910 110496747 110429084 110345614
3367.3 110345614 110322058 110384178 110453916 110475945 110479319 110496902 110532486 110557067 110550535 110509026 110422623 110355389
3391.8 110355389 110375285 110408986 110361266 110274744 110273874 110362685 110407376 110373640 110342681 110345781 110370386 110396123
3416.3 110396123 110389733 110357881 110332191 110302126 110236454 110135722 110048306 109992623 109937358 109909785 109946334
$$ packed form
3244.9A10915780k1541J9586L2771M840j4615n37J9753J8013L659j3649m7898q2911
3269.4A10833251m6718L0470N3466L2878J2552k062n138n615l1578n6339m3785j2791
3293.9A10758591K3079M9519K2864n2797j03987p4684P760P0429P5484L7622O533M756
3318.4A10825169M268k4581m9484j2326M3583L4010k2113o6257p4601k8264J8799J9395
3342.8A10667598J9527k098n9963m9960K2971M2487k301m8566n1785m1163o7663q3470
3367.3A10345614k3556O2120O9738K2029L374J7583L5584K4581o532m1509q6403o7234
3391.8A10355389J9896L3701m7720q6522q70Q8811M4691l3736l0959L100K4605K5737
3416.3A10396123o390l1852k5690l0065o5672j00732q7416n5683n5265k7573L6549
$$ plain form
3438.7 109946334 109999430 110007596 109961355 109899485 109862697 109842360 109812438 109767807 109685707 109571373 109506023
3461.1 109506023 109471190 109343958 109163797 109133923 109305167 109483874 109530318 109468746 109428775 109545851
3481.5 109545851 109698951 109735131 109758294 109823883 109838772 109782422 109715664 109688485 109660923 109590471 109591770
3504 109591770 109684706 109721875 109650564 109515560 109412384 109391201 109391403 109343803 109247744 109180963 109191275 109223318
3528.4 109223318 109230053 109210622 109170425 109154224 109188151 109212375 109196591 109209633 109312916 109449291 109539294
3550.9 109539294 109608042 109697449 109778178 109821212 109855866 109923804 110024297 110116291 110169089 110223472 110298729
3573.3 110298729 110364175 110407758 110429156 110435152 110440481 110451341 110469317 110472739 110436642 110380232 110337031 110322917
3597.8 110322917 110367692 110468793 110570991 110679531 110823262 110952771 111020207 111042368 111046576 111040771 111026645
$$ packed form
3438.7A09946334N3096Q166m6241o1870l6788k0337k9922m4631q2100j14334o5350
3461.1A09506023l4833j27232j80161k9874J71244J78707M6444o1572l9971J17076
3481.5A09545851J53100L6180K3163O5589J4889n6350o6758k7179k7562p0452J299
3504A09591770R2936L7169p1311j35004j03176k1183K02m7600r6059o6781J0312L2043
3528.4A09223318O735j9431m0197j6201L3927K4224j5784J3042J03283J36375R0003
3550.9A09539294O8748Q9407Q0729M3034L4654O7938J00493R1994N2798N4383P5257
3573.3A10298729O5446M3583K1398N996N329J0860J7976L422l6097n6410m3201j4114
3597.8A10322917M4775J01101J02198J08540J43731J29509O7436K2161M208n805j4126
$$ plain form
3620.2 111026645 111029184 111062419 111104226 111143792 111176014 111189580 111202621 111217034 111220729 111222899 111237156 111259413
3644.7 111259413 111264288 111237383 111234939 111285114 111330938 111324310 111287689 111285114 111322534 111361170 111383212 111391056
3669.2 111391056 111387146 111381245 111383021 111377764 111373365 111376107 111364090 111346149 111324823 111310685 111342502 111369896 111355746
3695.7 111355746 111346376 111370444 111397958 111402595 111402369 111426377 111475420 111521208 111534607 111508870 111462116 111422193
3720.1 111422193 111390722 111358321 111339200 111339092 111355531 111379874 111385763 111388052 111417651 111466336 111528134 111572802
3744.6 111572802 111562788 111553288 111572707 111575806 111560130 111557925 111582708 111602986 111592877 111583042 111585915 111588717 111592484
3771.1 111592484 111593401 111592567 111585999 111573708 111578429 111592555 111595845 111586261 111568248 111560416 111567628 111576664 111581337 111587358
3799.7 111587358 111614716 111640489 111640990 111644721 111654472 111649537 111625588 111596572 111572456 111562145 111587131 111612201
$$ packed form
3620.2A11026645K539L3235M1807L9566L2222J3566J3041J4413L695K170J4257K2257
3644.7A11259413M875k6905k444N0175M5824o628l6621k575L7420L8636K2042P844
3669.2A11391056l910n901J776n257m399K742j2017j7941k1326j4138L1817K7394j4150
3695.7A11355746r370K4068K7514M637k26K4008M9043M5788J3399k5737m6754l9923
3720.1A11422193l1471l2401j9121j08J6439K4343N889K289K9599M8685O1798M4668
3744.6A11572802j0014r500J9419L099j5676k205K4783K0278j0109r835K873K802L767
3771.1A11592484R17q34o568j2291M721J4126L290r584j8013p832P212R036M673O021
3799.7A11587358K7358K5773N01L731R751m935k3949k9016k4116j0311K4986K5070
$$ plain form
3824.2 111612201 111620760 111633503 111643612 111631477 111593807 111582243 111630082 111676133 111676157 111654091 111650801 111669958
3848.6 111669958 111700118 111746299 111760736 111714768 111679387 111694098 111726856 111737585 111730063 111722672 111725247 111735857
3873.1 111735857 111747301 111739612 111717319 111697471 111678493 111684012 111711144 111722875 111729753 111735213 111723483 111711895
3897.6 111711895 111713386 111723161 111746264 111758029 111736715 111714196 111712980 111723793 111742246 111758137 111758268 111751735 111745346
3924.1 111745346 111749303 111765873 111772132 111763918 111749363 111739457 111742210 111738920 111730695 111728823 111729968 111740541 111752594
3950.6 111752594 111762357 111782897 111802304 111789930 111743140 111699092 111692297 111710858 111722708 111722326 111713338 111701035
3975.1 111701035 111695516 111698461 111709118 111725402 111743093 111760390 111763370 111735988 111706591 111700094 111695766
3997.5 111695766
$$ packed form
3824.2A11612201Q559J2743J0109j2135l7670j1564M7839M6051K4k2066l290J9157
3848.6A11669958L0160M6181J4437m5968l5381J4711L2758J0729p522p391K575J0610
3873.1A11735857J1444p689k2293j9848j8978N519K7132J1731O878N460j1730j1588
3897.6A11711895J491R775K3103J1765k1314k2519j216J0813J8453J5891J31o533o389
3924.1A11745346L957J6570O259q214j4555r906K753l290q225j872J145J0573J2053
3950.6A11752594R763K0540J9407j2374m6790m4048o795J8561J1850l82q988j2303
3975.1A11701035n519K945J0657J6284J7691J7297K980k7382k9397o497m328
3997.5A11695766
##END=$$ End of the data block
