##TITLE=$$ Begin of the data block
##JCAMP-DX=5.00 $$ ACD/SpecManager v 10.08
##SPECTROMETER/DATA SYSTEM=Alpha
##DATE=27 Jun 2014 15:13:00
##DATA TYPE=INFRARED SPECTRUM
##DATA CLASS=XYDATA
##ORIGIN=
##OWNER=
##NPOINTS=1667
##FIRSTX=599.63549805
##LASTX=3997.56909180
##MAXX=3997.56909180
##MINX=599.63549805
##MAXY=1.12034106
##MINY=0.52522606
##XFACTOR=1.0000000000
##YFACTOR=0.000000010000000
##FIRSTY=1.07736754
##DELTAX=2.03957605
##XUNITS=1/CM
##YUNITS=ARBITRARY UNITS
##XYDATA=(X++(Y..Y))
$$ plain form
599.6 107736754 107812500 107937074 108017576 108085930 108168352 108265626 108400130 108536649 108617628 108659768 108702469
622.1 108702469 108742523 108753443 108756268 108792460 108831716 108851314 108861423 108841860 108819354 108834398 108833957 108798385
646.5 108798385 108798766 108833992 108840966 108809376 108759868 108707166 108655405 108580971 108496010 108450198 108418787 108340728
671 108340728 108235765 108117890 107988918 107849908 107714760 107599127 107519519 107454228 107367885 107270801 107181644
693.5 107181644 107094491 106983209 106820905 106592345 106263173 105782640 105160594 104523706 104000854 103576291
713.9 103576291 103178155 102814031 102572525 102582312 102913523 103463411 104052210 104594696 105086517 105553019
734.2 105553019 106014693 106446040 106826460 107181084 107521808 107817960 108059406 108274806 108474898 108642936
754.6 108642936 108757389 108812094 108847475 108934808 109093058 109246516 109335411 109392130 109450841 109514976 109587765
$$ packed form
599.6A07736754P5746J24574Q0502O8354Q2422R7274J34504J36519Q0979M2140M2701
622.1A08702469M0054J0920K825L6192L9256J9598J0109j9563k2506J5044m41l5572
646.5A08798385L81L5226O974l1590m9508n2702n1761p4434q4961m5812l1411p8059
671A08340728j04963j17875j28972j39010j35148j15633p9608o5291q6343r7084q9157
693.5A07181644q7153j11282j62304k28560l29172m80533o22046o36888n22852m24563
713.9A03576291l98136l64124k41506R787L31211N49888N88799N42486M91821M66502
734.2A05553019M61674M31347L80420L54624L40724K96152K41446K15400K00092J68038
754.6A08642936J14453N4705L5381Q7333J58250J53458Q8895N6719N8711O4135P2789
$$ plain form
777.1 109587765 109662509 109738314 109822845 109906530 109982419 110049868 110098386 110136354 110179925 110211837 110203195 110159612
801.6 110159612 110108662 110065484 110040975 110031748 110011709 109980643 109956813 109928775 109889710 109862030 109853435 109856462
826 109856462 109866726 109855115 109795702 109715199 109653568 109615850 109590399 109575450 109564972 109555721 109565556 109603834
850.5 109603834 109650850 109688818 109717131 109717286 109678924 109630919 109588969 109546876 109493387 109412992 109322107 109273255
875 109273255 109287381 109333467 109372997 109393334 109420717 109472728 109519744 109529364 109485102 109360206 109191012 109096050
899.4 109096050 109095204 109112895 109127295 109130263 109100413 109057605 109031963 109026039 109032333 109028959 108971918 108867466 108797622
926 108797622 108815002 108901489 109002531 109056580 109046125 109016526 109019256 109048831 109064829 109048069 109003508 108931851
950.4 108931851 108837616 108745778 108676124 108631766 108612704 108614004 108618855 108613026 108594680 108567345 108522475 108446455
$$ packed form
777.1A09587765P4744P5805Q4531Q3685P5889O7449M8518L7968M3571L1912q642m3583
801.6A10159612n0950m3178k4509r227k0039l1066k3830k8038l9065k7680q595L027
826A09856462J0264j1611n9413q0503o1631l7718k5451j4949j0478r251R835L8278
850.5A09603834M7016L7968K8313J55l8362m8005m1950m2093n3489q0395r0885m8852
875A09273255J4126M6086L9530K0337K7383N2011M7016R620m4262j24896j69194r4962
899.4A09096050q46J7691J4400K968k9850m2808k5642n924O294l374n7041j04452o9844
926A08797622J7380Q6487J01042N4049j0455k9599K730K9575J5998j6760m4561p1657
950.4A08931851r4235r1838o9654m4358j9062J300M851n829j8346k7335m4870p6020
$$ plain form
974.9 108446455 108370411 108342457 108357728 108393121 108444786 108500767 108552897 108600926 108624935 108611155 108576202 108532691
999.4 108532691 108474362 108399808 108306050 108182335 108056366 107998192 108007574 107991910 107897949 107768035 107665026
1021.8 107665026 107597721 107542908 107492352 107469690 107482386 107478106 107396603 107198203 106868792 106500304 106290197
1044.3 106290197 106306887 106422877 106534719 106633818 106719148 106765783 106773591 106779575 106807923 106842387 106857610
1066.7 106857610 106843257 106781459 106660914 106481886 106228244 105881727 105450022 104972041 104493618 104026437
1087.1 104026437 103553402 103073502 102614796 102216017 101918960 101766133 101765215 101870918 102019811 102152193
1107.5 102152193 102199388 102115405 101931953 101742184 101649392 101731253 101994765 102343237 102607453 102630258
1127.9 102630258 102371705 101882899 101161575 100193167 99084687 98012716 97095603 96345133 95695961
$$ packed form
974.9A08446455p6044k7954J5271L5393N1665N5981N2130M8029K4009j3780l4953m3511
999.4A08532691n8329p4554r3758j23715j25969n8174R382j5664r3961j29914j03009
1021.8A07665026o7305n4813n0556k2662J2696m280q1503j98400l29411l68488k10107
1044.3A06290197J6690J15990J11842R9099Q5330M6635P808N984K8348L4464J5223
1066.7A06857610j4353o1798j20545j79028k53642l46517m31705m77981m78423m67181
1087.1A04026437m73035m79900m58706l98779k97057j52827r18J05703J48893J32382
1107.5A02152193M7195q3983j83452j89769r2792Q1861K63512L48472K64216K2805
1127.9A02630258k58553m88806p21324r68408j108480j071971r17113p50470o49172
$$ plain form
1146.2 95695961 95071614 94424385 93750238 93079144 92455035 91934925 91562277 91342002 91261661 91308481
1166.6 91308481 91461790 91713315 92089397 92611188 93252116 93973649 94755894 95559675 96326882 97018409
1187 97018409 97628427 98172373 98660982 99102449 99518067 99923742 100306666 100640070 100903094 101088512
1207.4 101088512 101208580 101289093 101349187 101396132 101431358 101437473 101387250 101272023 101107097 100925553 100759256
1229.9 100759256 100610662 100471151 100355268 100292301 100314212 100435197 100637627 100895786 101186681 101472521
1250.3 101472521 101712012 101895797 102044618 102185988 102329361 102453947 102547669 102636600 102747035 102870715
1270.6 102870715 102984869 103085315 103177309 103261518 103365600 103541517 103792882 104057384 104272366 104417372
1291 104417372 104511476 104582667 104637122 104672205 104711974 104794526 104915643 105039239 105152369 105262673 105363178
$$ packed form
1146.2I5695961o24347o47229o74147o71094o24109n20110l72648k20275q0341M6820
1166.6I1308481J53309K51525L76082N21791O40928P21533P82245Q03781P67207O91527
1187I7018409O10018N43946M88609M41467M15618M05675L82924L33404K63024J85418
1207.4A01088512J20068Q0513O0094M6945L5226O115n0223j15227j64926j81544j66297
1229.9A00759256j48594j39511j15883o2967K1911J20985K02430K58159K90895K85840
1250.3A01472521K39491J83785J48821J41370J43373J24586R3722Q8931J10435J23680
1270.6A02870715J14154J00446R1994Q4209J04082J75917K51365K64502K14982J45006
1291A04417372R4104P1191N4455L5083L9769Q2552J21117J23596J13130J10304J00505
$$ plain form
1313.5 105363178 105432236 105469036 105504394 105569351 105668283 105782259 105886614 105957174 105973792 105936015 105857682
1335.9 105857682 105741894 105593741 105457449 105360460 105282354 105199528 105105591 105014277 104932225 104859042 104817367
1358.3 104817367 104816699 104804897 104751825 104698706 104654634 104593158 104420817 104025471 103604913 103545463 103939772
1380.8 103939772 104560113 105179954 105715990 106113231 106373405 106539798 106629300 106707489 106843412 107046378
1401.2 107046378 107294154 107513273 107592165 107464147 107114065 106651461 106282437 106127393 106176698 106329203
1421.6 106329203 106458235 106444621 106236815 105833697 105331755 104873300 104372597 103791249 103331399 102969515
1442 102969515 102624750 102268589 101809943 101196074 100444138 99635768 98810613 98133898 97773623 97469711
1462.4 97469711 97072256 97128695 98398209 100921190 104075360 106339586 107414985 108039463 108519208
$$ packed form
1313.5A05363178O9058L6800L5358O4957R8932J13976J04355P0560J6618l7777p8333
1335.9A05857682j15788j48153j36292r6989p8106q2826r3937r1314q2052p3183m1675
1358.3A04817367o68j1802n3072n3119m4072o1476j72341l95346m20558n9450L94309
1380.8A03939772O20341O19841N36036L97241K60174J66393Q9502P8189J35923K02966
1401.2A07046378K47776K19119P8892j28018l50082m62604l69024j55044M9305J52505
1421.6A06329203J29032j3614k07806m03118n01942m58455n00703n81348m59850l61884
1442A02969515l44765l56161m58646o13869p51936q08370q25155o76715l60275l03912
1462.4I7469711l97455N6439J269514K522981L154170K264226J075399O24478M79745
$$ plain form
1480.7 108519208 108904338 109212339 109482491 109696352 109795833 109848607 109917474 109922063 109842610 109853971 110035372
1503.2 110035372 110315013 110463524 110411692 110379386 110413694 110495758 110579920 110643327 110666132 110633075 110594952
1525.6 110594952 110569799 110581017 110633373 110661268 110681522 110772955 110853827 110776436 110637832 110532928 110492611
1548 110492611 110492098 110511672 110583782 110732758 110843670 110710311 110584378 110563123 110590255 110635912 110636282 110635591
1572.5 110635591 110683036 110684752 110627520 110600221 110590208 110579431 110577178 110577071 110567629 110558128 110550821 110534537 110505688
1599 110505688 110464334 110426366 110413539 110428488 110444486 110455370 110492778 110541654 110516191 110462368 110454428 110426307
1623.5 110426307 110364807 110312414 110276425 110290682 110355389 110339332 110187888 110045934 109953439 109909093 109864438
1645.9 109864438 109778678 109752798 109765875 109581196 109355569 109266984 109256375 109242105 109182858 109155715 109177089
$$ packed form
1480.7A08519208L85130L08001K70152K13861R9481N2774O8867M589p9453J1361J81401
1503.2A10035372K79641J48511n1832l2306L4308Q2064Q4162O3407K2805l3057l8123
1525.6A10594952k5153J1218N2356K7895K0254R1433Q0872p7391j38604j04904m0317
1548A10492611n13J9574P2110J48976J10912j33359j25933k1255K7132M5657L70o91
1572.5A10635591M7445J716n7232k7299j0013j0777k253j07r442r501p307j6284k8849
1599A10505688m1354l7968j2827J4949J5998J0884L7408M8876k5463n3823p940k8121
1623.5A10426307o1500n2393l5989J4257O4707j6057j51444j41954r2495m4346m4655
1645.9A09864438q5760k5880J3077j84679k25627q8585j0609j4270n9247k7143K1374
$$ plain form
1668.4 109177089 109191751 109221947 109312820 109399199 109461164 109548450 109629786 109542274 109333694 109169352 109016001
1690.8 109016001 108887613 108735347 108515835 108211100 107729900 107259572 106831932 106346929 105908537 105565989
1711.2 105565989 105281174 104944789 104288471 103346574 102367568 101219857 99782002 98073077 96020848
1729.5 96020848 93509859 89742815 85272598 81476390 77588922 74001169 71752298 71065307 72154546
1747.9 72154546 75277710 79948288 84856337 89825881 94608164 98486060 101581919 103770971
1764.2 103770971 105215800 106317282 107154298 107760918 108146203 108405590 108642578 108867466 109041154
1782.6 109041154 109175670 109297192 109443665 109604144 109715915 109764409 109823346 109906030 109973133 110015666
1803 110015666 110049510 110100400 110161114 110212445 110244179 110280252 110318458 110350406 110392511 110450256 110507548 110552406
$$ packed form
1668.4A09177089J4662L0196R0873Q6379O1965Q7286Q1336q7512k08580j64342j53351
1690.8A09016001j28388j52266k19512l04735m81200m70328m27640m85003m38392l42548
1711.2A05565989k84815l36385o56318r41897r79006j147711j437855j708925k052229
1729.5I6020848k510989l767044m470217l796208l887468l587753k248871o86991J089239
1747.9G2154546L123164M670578M908049M969544M782283L877896L095859K189052
1764.2A03770971J444829J101482Q37016O06620L85285K59387K36988K24888J73688
1782.6A09041154J34516J21522J46473J60479J11771M8494N8937Q2684O7103M2533
1803A10015666L3844N0890O0714N1331L1734L6073L8206L1948M2105N7745N7292M4858
$$ plain form
1827.4 110552406 110579240 110563183 110547268 110560918 110583806 110610449 110664070 110725272 110732436 110700190 110677326 110678685
1851.9 110678685 110689986 110705042 110718906 110733449 110747886 110766840 110803425 110836530 110821497 110780334 110762978
1874.4 110762978 110761344 110758042 110758984 110774326 110791266 110804856 110819745 110823095 110821700 110828853 110834122 110833466 110836673 110837042
1902.9 110837042 110835588 110842943 110853255 110853827 110852420 110861003 110867596 110861945 110860360 110862589 110850668 110842502 110845828 110846388
1931.5 110846388 110841393 110834932 110833097 110843301 110863829 110873568 110865080 110850775 110845292 110853720 110864282 110863531 110855615
1958 110855615 110852253 110853958 110859525 110864592 110860360 110848403 110842633 110844302 110844183 110848343 110857487 110856533 110845959 110838675 110843027
1988.6 110843027 110856259 110858738 110844827 110832477 110829997 110829258 110827160 110828495 110824811 110812867 110807598 110808206 110807133 110805213
2017.1 110805213 110795176 110777915 110764217 110757291 110758555 110761678 110756385 110749543 110754871 110769975 110778868 110773861 110763264
$$ packed form
1827.4A10552406K6834j6057j5915J3650K2888K6643N3621O1202P164l2246k2864J359
1851.9A10678685J1301J5056J3864J4543J4437J8954L6585L3105j5033m1163j7356
1874.4A10762978j634l302R42J5342J6940J3590J4889L350j395P153N269o56L207L69
1902.9A10837042j454P355J0312N72j407Q583O593n651j585K229j1921q166L326N60
1931.5A10846388m995o461j835J0204K0528R739q488j4305n483Q428J0562p51p916
1958A10855615l362J705N567N067m232j1957n770J669j19M160R144r54j0574p284M352
1988.6A10843027J3232K479j3911j2350k480p39k098J335l684j1944n269O08j073j920
2017.1A10805213j0037j7261j3698o926J264L123n293o842N328J5104Q893n007j0597
$$ plain form
2043.6 110763264 110757303 110758436 110760915 110757828 110752892 110753870 110758722 110764182 110773158 110783172 110788548 110790074 110786784 110783756
2072.2 110783756 110788107 110790598 110787940 110790622 110794806 110794854 110798740 110802710 110802376 110807252 110817409 110822260 110819924 110817254 110816598
2102.8 110816598 110819626 110828364 110833097 110827935 110821712 110817623 110818195 110825670 110831308 110833645 110841465 110848594 110841572 110828531
2131.3 110828531 110823584 110825610 110825431 110822487 110817707 110810959 110809731 110810280 110800731 110784984 110776019 110776126 110778797 110782552 110789979
2161.9 110789979 110792935 110788858 110791254 110800493 110802472 110796607 110793686 110791886 110787559 110785580 110786891 110791600 110799611 110804808
2190.5 110804808 110805357 110807216 110809791 110805941 110798562 110798013 110800993 110799730 110796833 110794139 110793293 110796833 110800314 110799611 110796487
2221.1 110796487 110793316 110788178 110786605 110800040 110811710 110801768 110784090 110776305 110771537 110760748 110754693 110757685 110761058
2247.6 110761058 110760856 110753214 110738826 110732138 110738361 110742438 110737145 110731506 110732102 110736358 110733247 110720170 110714674 110721505
$$ packed form
2043.6A10763264n961J133K479l087m936R78M852N460Q976J0014N376J526l290l028
2072.2A10783756M351K491k658K682M184M8L886L970l34M876J0157M851k336k670o56
2102.8A10816598L028Q738M733n162o223m089N72P475N638K337P820P129p022j3041
2131.3A10828531m947K026j79k944m780o748j228N49r549j5747q965J07K671L755P427
2161.9A10789979K956m077K396R239J979n865k921j800m327j979J311M709Q011N197
2190.5A10804808N49J859K575l850p379n49K980j263k897k694q46L540L481p03l124
2221.1A10796487l171n138j573J3435J1670r942j7678p785m768j0789o055K992L373
2247.6A10761058k02p642j4388o688O223M077n293n639N96M256l111j3077n496O831
$$ plain form
2276.1 110721505 110722089 110712361 110704994 110700047 110695553 110699844 110710597 110712993 110704494 110701191 110707545 110709059 110706735 110714650
2304.7 110714650 110730207 110745227 110756266 110767770 110793793 110828376 110853171 110876822 110921025 110968840 110995150
2327.1 110995150 111014640 111044967 111075521 111090648 111107242 111132324 111133218 111098552 111034727 110963321 110937214 110988057
2351.6 110988057 111087584 111179090 111245263 111287844 111313450 111307836 111246383 111142695 111042798 110966074 110892987
2374 110892987 110821140 110762167 110710502 110664988 110635972 110617030 110596192 110579669 110573971 110575414 110578215 110582697 110589957
2400.6 110589957 110585427 110566938 110557675 110563803 110571456 110573184 110569263 110561478 110555029 110553396 110552990 110552764 110554504 110556567
2429.1 110556567 110554218 110544598 110534358 110527301 110517943 110513282 110522711 110533285 110531378 110523450 110520208 110521269 110517621 110510170
2457.7 110510170 110509002 110515916 110524440 110521972 110504353 110484350 110474765 110473871 110473549 110479081 110489595 110486412 110471272 110459459
$$ packed form
2276.1A10721505N84r728p367m947m494M291J0753K396q499l303O354J514k324P915
2304.7A10714650J5557J5020J1039J1504K6023L4583K4795K3651M4203M7815K6310
2327.1A10995150J9490L0327L0554J5127J6594K5082Q94l4666o3825p1406k6107N0843
2351.6A10988057R9527R1506O6173M2581K5606n614o1453j03688r9897p6724p3087
2374A10892987p1847n8973n1665m5514k9016j8942k0838j6523n698J443K801M482P260
2400.6A10589957m530j8489r263O128P653J728l921p785o449j633m06k26J740K063
2429.1A10556567k349r620j0240p057r358m661R429J0574j907p928l242J061l648p451
2457.7A10510170j168O914Q524k468j7619k0003r585q94l22N532J0514l183j5140j1813
$$ plain form
2486.2 110459459 110448945 110437703 110426903 110420537 110422623 110424459 110422552 110418522 110407865 110389423 110372543 110369599 110374320
2512.7 110374320 110365748 110344911 110328269 110311651 110294628 110289443 110286951 110279357 110276270 110277927 110279715 110280728 110283613
2539.2 110283613 110286784 110285628 110283828 110281527 110278773 110276461 110266912 110249662 110240877 110245848 110246813 110234070 110215557 110204089
2567.8 110204089 110199118 110186815 110165846 110149086 110141897 110132158 110117805 110113513 110112810 110102522 110090744 110083163 110077047
2594.3 110077047 110067797 110054576 110043025 110034657 110028195 110021138 110013497 110006857 109997988 109983146 109966087 109950352 109932792
2620.8 109932792 109916413 109904552 109894574 109881794 109864211 109848094 109834337 109820342 109812295 109813213 109814215 109810150 109806931
2647.3 109806931 109800148 109777224 109749699 109733808 109719956 109699345 109674120 109646106 109619987 109597480 109578574 109566867
2671.8 109566867 109557569 109544194 109532535 109538841 109570873 109602892 109612429 109616518 109631228 109650970 109670949 109687185
$$ packed form
2486.2A10459459j0514j1242j0800o366K086J836j907m030j0657j8442j6880k944M721
2512.7A10374320q572k0837j6642j6618j7023n185k492p594l087J657J788J013K885
2539.2A10283613L171j156j800k301k754k312r549j7250q785M971R65j2743j8513j1468
2567.8A10204089m971j2303k0969j6760p189r739j4353m292p03j0288j1778p581o116
2594.3A10077047r250j3221j1551q368o462p057p641o640q869j4842j7059j5735j7560
2620.8A09932792j6379j1861r978j2780j7583j6117j3757j3995q047R18J002m065l219
2647.3A09806931o783k2924k7525j5891j3852k0611k5225k8014k6119k2507j8906j1707
2671.8A09566867r298j3375j1659O306L2032L2019R537M089J4710J9742J9979J6236
$$ plain form
2696.3 109687185 109698832 109715426 109736264 109747803 109745407 109738171 109735441 109733605 109725666 109713662 109699392 109681451
2720.8 109681451 109653831 109615457 109593499 109608161 109633815 109640634 109632921 109635937 109666467 109705341 109720302 109710264
2745.2 109710264 109697556 109696090 109706628 109719276 109716034 109700751 109691691 109687614 109683549 109680080 109667099 109635544 109589088
2771.8 109589088 109533691 109488714 109462440 109420204 109350955 109283268 109210181 109114921 109021580 108950245 108879459
2794.2 108879459 108784759 108683550 108599949 108513999 108399427 108259785 108096504 107923579 107758117 107574928
2814.6 107574928 107350886 107087564 106780672 106417811 105996084 105508614 104934573 104249716 103412545 102341092
2835 102341092 100898755 98915583 96170998 92458868 87812459 82616979 77571374 73603779 71621984
2853.3 71621984 72029841 74466419 78067809 81932342 85385668 88020498 89741462 90801030 91683853
$$ packed form
2696.3A09687185J1647J6594K0838J1539k396p236k730j836p939j2004j4270j7941
2720.8A09681451k7620l8374k1958J4662K5654O819p713L016L0530L8874J4961j0038
2745.2A09710264j2708j466J0538J2648l242j5283r060m077m065l469j2981l1555m6456
2771.8A09589088n5397m4977k6274m2236o9249o7687p3087r5260r3341p1335p0786
2794.2A08879459r4700j01209q3601q5950j14572j39642j63281j72925j65462j83189
2814.6A07574928k24042k63322l06892l62861m21727m87470n74041o84857q37171j071453
2835A02341092j442337j983172k744585l712130m646409n195480n045605l967595j981795
2853.3G1621984M07857K436578L601390L864533L453326K634830J720964J059568Q82823
$$ plain form
2871.7 91683853 92774737 94019282 95040584 95573217 95603913 95213389 94494027 93530834 92384213
2890.1 92384213 91112107 89767861 88379830 86932665 85376203 83674216 81786311 79635525
2906.4 79635525 77136648 74204791 70786566 66932410 62839246 58882827 55571330 53374606
2922.7 53374606 52522606 52960646 54475170 56824297 59831035 63337755 67113292 70882255 74396288
2941 74396288 77446955 79871261 81560642 82508612 82909322 83124566 83504975 84277278 85519779
2959.4 85519779 87186486 89174944 91350222 93544048 95596296 97399694 98914379 100173533
2975.7 100173533 101229870 102103674 102838862 103483069 104022205 104436433 104724765 104888296 104926920 104797912
2996.1 104797912 104466915 103955066 103292620 102573836 101977646 101666868 101745272 102246833 103094602 104118836
$$ packed form
2871.7I1683853J090884J244545J021302N32633L0696l90524p19362r63193j146621
2890.1I2384213j272106j344246j388031j447165j556462j701987j887905k150786
2906.4G9635525k498877k931857l418225l854156m093164l956419l311497k196724
2922.7E3374606q52000M38040J514524K349127L006738L506720L775537L768963L514033
2941G4396288L050667K424306J689381R47970M00710K15244L80409P72303J242501
2959.4H5519779J666707J988458K175278K193826K052248J803398J514685J259154
2975.7A00173533J056337Q73804P35188O44207N39136M14228K88332J63531L8624j29008
2996.1A04797912l30997n11849o62446p18784n96190l10778P8404N01561Q47769J024234
$$ plain form
3016.5 104118836 105148566 106074274 106834304 107419205 107871401 108209586 108441365 108615112 108778512
3034.9 108778512 108923101 109004319 109038281 109083533 109160209 109251153 109319592 109365797 109421444 109479904 109539378
3057.3 109539378 109604549 109645569 109655738 109657776 109683466 109747982 109814501 109851038 109852159 109840453 109869230 109925079
3081.8 109925079 109959328 109995437 110043895 110080147 110122478 110177481 110207498 110203254 110209155 110243785 110262144 110236633
3106.2 110236633 110212398 110236442 110258639 110222137 110178280 110186887 110250103 110340130 110411501 110435426 110425603 110430539
3130.7 110430539 110464728 110476911 110436642 110394776 110414803 110471594 110509503 110518062 110485697 110433447 110434759 110497797
3155.2 110497797 110558474 110588539 110594320 110590327 110597885 110615230 110634518 110659707 110680544 110680807 110669279 110669887 110684419
3181.7 110684419 110692334 110691726 110691512 110688722 110690284 110700107 110715318 110733616 110740590 110738921 110744917 110752773 110758400 110776103
$$ packed form
3016.5A04118836J029730R25708P60030N84901M52196L38185K31779J73747J63400
3034.9A08778512J44589Q1218L3962M5252P6676R0944O8439M6205N5647N8460N9474
3057.3A09539378O5171M1020J0169K038K5690O4516O6519L6537J121j1706K8777N5849
3081.8A09925079L4249L6109M8458L6252M2331N5003L0017m244N901L4630J8359k5511
3106.2A10236633k4235K4044K2197l6502m3857Q607O3216R0027P1371K3925r823M936
3130.7A10430539L4189J2183m0269m1866K0027N6791L7909Q559l2365n2250J312O3038
3155.2A10497797O0677L0065N781l993P558J7345J9288K5189K0837K63j1528O08J4532
3181.7A10684419P915o08k14k790J562R823J5211J8298O974j669N996P856N627J7703
$$ plain form
3210.3 110776103 110803175 110820413 110823262 110824513 110840738 110859609 110861492 110859466 110856187 110822666 110773575 110778892 110832644
3236.8 110832644 110866857 110876012 110874510 110853457 110828960 110836399 110872018 110897207 110895431 110897899 110924065 110942769
3261.2 110942769 110937643 110918999 110879874 110825002 110804880 110835147 110875571 110912848 110941291 110954559 110962451 110963547
3285.7 110963547 110942471 110891891 110843098 110829377 110849404 110889792 110912263 110873115 110795462 110754752 110790288
3308.2 110790288 110874963 110944724 110959291 110951889 110961413 110971081 110953391 110917258 110912907 110956347 110995483 110997009
3332.6 110997009 110971045 110930729 110902417 110903740 110916638 110934079 110940349 110905445 110879362 110918355 110973597 110983109
3357.1 110983109 110956609 110940170 110933697 110887277 110811913 110782492 110832572 110906076 110935676 110939765 110953522 110976279
3381.6 110976279 110996389 110994065 110956120 110880458 110822380 110840523 110872328 110832250 110756493 110758460 110848534 110909402
$$ packed form
3210.3A10776103K7072J7238K849J251J6225J8871J883k026l279l3521m9091N317N3752
3236.8A10832644L4213R155j502k1053k4497P439L5619K5189j776K468K6166J8704
3261.2A10942769n126j8644l9125n4872k0122L0267M0424L7277K8443J3268P892J096
3285.7A10963547k1076n0580m8793j3721K0027M0388K2471l9148p7653m0710L5536
3308.2A10790288Q4675O9761J4567p402R524R668j7690l6133m351M3440L9136J526
3332.6A10997009k5964m0316k8312J323J2898J7441O270l4904k6083L8993N5242R512
3357.1A10983109k6500j6439o473m6420p5364k9421N0080P3504K9600M089J3757K2757
3381.6A10976279K0110k324l7945p5662n8078J8143L1805m0078p5757J967R0074O0868
$$ plain form
3406.1 110909402 110894954 110860610 110850585 110874307 110909939 110929596 110936534 110942173 110937870 110903859 110842621 110803318
3430.5 110803318 110785890 110737884 110709810 110768914 110853374 110887575 110880280 110869014 110857904 110832632 110806346 110786915
3455 110786915 110745931 110683596 110647190 110624588 110548449 110449910 110448837 110568309 110695159 110744822 110719383 110696006
3479.5 110696006 110764122 110849142 110857880 110870731 110928893 110950685 110907280 110851097 110831821 110826886 110803342 110827672
3504 110827672 110900295 110913551 110846508 110757160 110712874 110726547 110737705 110703242 110642004 110621798 110662961 110698104
3528.4 110698104 110686231 110645509 110607636 110600138 110627186 110653389 110653353 110663128 110709679 110761356 110804653 110841477
3552.9 110841477 110858905 110874498 110908258 110959196 111044168 111141324 111161339 111112475 111105776 111150765 111190581 111202669
3577.4 111202669 111198175 111204469 111238790 111296976 111347365 111344635 111326718 111323774 111298585 111265862 111284447 111343443
$$ packed form
3406.1A10909402j4448l4344j0025K3722L5632J9657O938N639m303l4011o1238l9303
3430.5A10803318j7428m8006k8074N9104Q4460L4201p295j1266j1110k5272k6286j9431
3455A10786915m0984o2335l6406k2602p6139r8539j073J19472J26850M9663k5439k3377
3479.5A10696006O8116Q5020Q738J2851N8162K1792m3405n6183j9276m935k3544K4330
3504A10827672P2623J3256o7043q9348m4286J3673J1158l4463o1238k0206M1163L5143
3528.4A10698104j1873m0722l7873p498K7048K6203l6R775M6551N1677M3297L6824
3552.9A10841477J7428J5593L3760N0938Q4972R7156K0015m8864o699M4989L9816J2088
3577.4A11202669m494O294L4321N8186N0389k730j7917k944k5189l2723J8585N8996
$$ plain form
3601.9 111343443 111406195 111484635 111557519 111590683 111619902 111642230 111642396 111641955 111622703 111590588 111596727 111666214
3626.3 111666214 111744523 111720157 111646903 111602032 111587703 111595261 111608732 111637139 111717105 111837327 111869264
3648.8 111869264 111761177 111677551 111652398 111614466 111571360 111563325 111580694 111622453 111704111 111796331 111840236
3671.2 111840236 111868143 111879337 111803055 111706603 111655378 111653447 111697197 111750770 111770499 111756945 111721826 111696219
3695.7 111696219 111712682 111754048 111770368 111756349 111773324 111847150 111911058 111871052 111787546 111764491 111798036
3718.1 111798036 111840022 111850321 111834812 111815906 111819482 111873364 111959064 111987221 111896253 111806130 111845636 111967921
3742.6 111967921 112021339 111998618 112014937 112009144 111908972 111823440 111813772 111825430 111807036 111790216 111788571 111788595
3767.1 111788595 111782134 111748052 111716270 111725688 111753845 111766171 111762524 111750555 111734474 111720979 111705458 111698735
$$ packed form
3601.9A11343443O2752P8440P2884L3164K9219K2328J66m41j9252l2115O139O9487
3626.3A11666214P8309k4366p3254m4871j4329P558J3471K8407P9966J20222L1937
3648.8A11869264j08087q3626k5153l7932m3106q035J7369M1759Q1658R2220M3905
3671.2A11840236K7907J1194p6282r6452n1225j931M3750N3573J9729j3554l5119k5607
3695.7A11696219J6463M1366J6320j4019J6975P3826O3908m0006q3506k3055L3545
3718.1A11798036M1986J0299j5509j8906L576N3882Q5700K8157r0968r0123L9506J22285
3742.6A11967921N3418k2721J6319n793j00172q5532r668J1658j8394j6820j645K4
3767.1A11788595o461l4082l1782R418K8157J2326l647j1969j6081j3495j5521o723
$$ plain form
3791.5 111698735 111732209 111802161 111867344 111906016 111901999 111879444 111855578 111783397 111710119 111718607 111788023 111844623
3816 111844623 111884141 111916804 111891580 111837518 111798108 111777568 111791909 111827385 111852324 111877847 111900818 111884439
3840.5 111884439 111831832 111752415 111703897 111776817 111949885 112034106 111894321 111757290 111730182 111772919 111835408
3862.9 111835408 111867738 111877823 111867201 111827087 111800289 111780417 111771059 111785185 111785340 111762500 111729789 111722577
3887.4 111722577 111747408 111739016 111697173 111696947 111761212 111848462 111880064 111818814 111716664 111650348 111636639 111650705
3911.9 111650705 111680806 111706519 111697638 111667025 111651766 111663544 111678779 111688137 111696398 111676788 111631393 111609507
3936.3 111609507 111617994 111635399 111651075 111651444 111634994 111616564 111609840 111611295 111610425 111605477 111601627 111592126 111578500
3962.9 111578500 111581373 111588001 111582661 111570776 111555469 111550391 111570609 111596453 111594737 111568987 111549544 111559725
$$ packed form
3791.5A11698735L3474O9952O5183L8672m017k2555k3866p2181p3278Q488O9416N6600
3816A11844623L9518L2663k5224n4062l9410k0540J4341L5476K4939K5523K2971j6379
3840.5A11884439n2607p9417m8518P2920J73068Q4221j39785j37031k7108M2737O2489
3862.9A11835408L2330J0085j0622m0114k6798j9872r358J4126J55k2840l2711p212
3887.4A11722577K4831q392m1843k26O4265Q7250L1602o1250j02150o6316j3709J4066
3911.9A11650705L0101K5713q881l0613j5259J1778J5235R358Q261j9610m5395k1886
3936.3A11609507Q487J7405J5676L69j6450j8430o724J455q70m948l850r501j3626
3962.9A11578500K873O628n340j1885j5307n078K0218K5844j716k5750j9443J0181
$$ plain form
3987.3 111559725 111576200 111570072 111554837 111530864 111502612
3997.5 111502612
$$ packed form
3987.3A11559725J6475o128j5235k3973k8252
3997.5A11502612
##END=$$ End of the data block
