##TITLE=$$ Begin of the data block
##JCAMP-DX=5.00 $$ ACD/SpecManager v 10.08
##SPECTROMETER/DATA SYSTEM=Alpha
##DATE=27 Jun 2014 15:13:00
##DATA TYPE=INFRARED SPECTRUM
##DATA CLASS=XYDATA
##ORIGIN=
##OWNER=
##NPOINTS=1667
##FIRSTX=599.63549805
##LASTX=3997.56909180
##MAXX=3997.56909180
##MINX=599.63549805
##MAXY=1.12038469
##MINY=0.52569622
##XFACTOR=1.0000000000
##YFACTOR=0.000000010000000
##FIRSTY=1.07676351
##DELTAX=2.03957605
##XUNITS=1/CM
##YUNITS=ARBITRARY UNITS
##XYDATA=(X++(Y..Y))
599.6 107676351 107684457 107770038 107888913 108001983 108104038 108204544 108298528 108364570 108409417 108466184 108537352
622.1 108537352 108580637 108588016 108610535 108656693 108692062 108722460 108752978 108757508 108741033 108730686 108720744 108699870
646.5 108699870 108688402 108699119 108711135 108705068 108687520 108653784 108586478 108483136 108381975 108337879 108310962
669 108310962 108206582 108079803 107975912 107869291 107741201 107625318 107526004 107427371 107327950 107238650 107163107
691.4 107163107 107080829 106982720 106862044 106697047 106472993 106158483 105693543 105067086 104417253 103897548
711.8 103897548 103479040 103084290 102733457 102512980 102537870 102863109 103396714 103978682 104514849 104992664
732.2 104992664 105439651 105879712 106304932 106695223 107051885 107389021 107689726 107931244 108143532 108346379
752.6 108346379 108505917 108611822 108692729 108774722 108877397 109004951 109122944 109199345 109259713 109333849 109423745
775 109423745 109524703 109607303 109661317 109716630 109787619 109877682 109972095 110034597 110063338 110093105 110130656 110137570
799.5 110137570 110098267 110040295 109986615 109947264 109929955 109921992 109898102 109857225 109817326 109789193 109770739 109760070
824 109760070 109762108 109766245 109738410 109664333 109573722 109508073 109484756 109489024 109491122 109475696 109461355 109479177 109529316
850.5 109529316 109581888 109620392 109645677 109641016 109598613 109548664 109512448 109480476 109432638 109356999 109273314 109229338
875 109229338 109239614 109270704 109296703 109318244 109355140 109408700 109455359 109476495 109439099 109309506 109135306 109034991
899.4 109034991 109037995 109065819 109070194 109053957 109024131 108990681 108968878 108966100 108978438 108975625 108914018 108809114
923.9 108809114 108738506 108756971 108848441 108950841 109008217 109004509 108978939 108981049 109005773 109022498 109012604 108967316
948.4 108967316 108893168 108807325 108722055 108647394 108597529 108574474 108565354 108563745 108561158 108543396 108516610 108473003
972.9 108473003 108395422 108323407 108305180 108328676 108362794 108407629 108469224 108537209 108590782 108604920 108576822 108536077
997.3 108536077 108497596 108444369 108371937 108275199 108143616 108019972 107972264 107987082 107976782 107894087 107770753
1019.8 107770753 107663834 107589829 107527649 107474399 107454777 107473385 107481432 107409549 107209837 106872964 106492805
1042.2 106492805 106271589 106291437 106419718 106536424 106632555 106712544 106756234 106764638 106775594 106808400 106841743
1064.7 106841743 106852722 106828725 106763411 106655335 106485188 106229877 105881858 105453646 104986262 104514873
1085 104514873 104043508 103562224 103082407 102634764 102240145 101933563 101768434 101764047 101880717 102043080
1105.4 102043080 102175653 102218807 102139497 101961529 101771164 101672459 101748323 102010441 102360106 102627099
1125.8 102627099 102653289 102398574 101915705 101198411 100232410 99128330 98054343 97127903 96372437
1144.2 96372437 95723599 95098621 94451165 93779427 93112147 92493165 91972524 91592282 91366941 91284442
1164.6 91284442 91327870 91479421 91729915 92100453 92618728 93264228 93994397 94786406 95595932 96360177
1185 96360177 97045588 97654575 98201704 98689520 99124938 99538434 99946541 100327706 100656188 100916767
1205.4 100916767 101101756 101224065 101311922 101382291 101436114 101471066 101470399 101412737 101297128 101133323 100947618
1227.8 100947618 100781512 100642741 100510192 100391078 100321746 100336289 100451100 100660229 100932574 101224136
1248.2 101224136 101499188 101735008 101927233 102087903 102229679 102364492 102489495 102589297 102679217 102788937
1268.6 102788937 102912819 103026700 103127182 103219473 103306007 103414977 103592682 103840578 104100990 104316866
1289 104316866 104467225 104565132 104637206 104694390 104735792 104777932 104853809 104970884 105101395 105217493 105316794
1311.4 105316794 105406678 105476868 105516970 105551362 105616558 105719078 105841887 105956984 106031239 106043613 105997705
1333.9 105997705 105914128 105799425 105651402 105511653 105413806 105335891 105250716 105154896 105064666 104985034 104912567
1356.3 104912567 104871106 104873466 104867125 104815960 104759824 104713726 104654002 104486871 104095972 103673685 103607464
1378.7 103607464 103997993 104623735 105253065 105793858 106186998 106440079 106602991 106694055 106773198 106904185
1399.1 106904185 107105672 107360578 107584858 107661808 107531655 107182586 106722820 106357265 106202996 106247652
1419.5 106247652 106396687 106525767 106513298 106307232 105905402 105404186 104942405 104436946 103859639 103404164
1439.9 103404164 103036535 102681744 102321100 101866245 101259124 100511646 99705422 98879242 98202205 97846609
1460.3 97846609 97546852 97147477 97196788 98462445 100985384 104143357 106418335 107501161 108124709
1478.7 108124709 108603728 108990204 109298384 109569597 109786665 109890962 109948289 110017192 110019112 109938478
1499.1 109938478 109942758 110114729 110397124 110559666 110509634 110472000 110504568 110586298 110670400 110735857 110758770
1521.5 110758770 110724294 110684764 110654902 110662258 110715306 110748291 110774636 110867023 110945225 110869372 110731280
1543.9 110731280 110620070 110571015 110566628 110588503 110660470 110804701 110918581 110795236 110674047 110659206 110688388
1566.4 110688388 110722041 110712326 110716558 110769796 110770512 110712266 110684979 110674572 110664177 110661638 110665703 110666060 110655713
1592.9 110655713 110631526 110601437 110574508 110543215 110510325 110494590 110508251 110528851 110544991 110582733 110625303
1615.3 110625303 110592759 110535908 110527134 110502148 110447848 110400593 110360146 110364163 110425341 110415757 110268843 110123730
1639.8 110123730 110027194 109982383 109938228 109850550 109820795 109832418 109656131 109434068 109335756 109315586 109304798
1662.2 109304798 109254324 109229517 109252048 109272385 109305716 109395850 109480655 109539664 109623587 109704030 109618771
1684.7 109618771 109412515 109250271 109098685 108972621 108824027 108604252 108299816 107821345 107341683 106900883
1705.1 106900883 106413233 105981398 105641854 105350184 105004442 104343402 103402364 102424395 101273274
1723.4 101273274 99830854 98118299 96061158 93548077 89787233 85325146 81536466 77657813
1739.7 77657813 74073744 71822125 71135616 72231847 75361401 80030483 84927559 89887506 94675368
1758.1 94675368 98570210 101676071 103859818 105295897 106392527 107223082 107820046 108204436 108471799
1776.5 108471799 108714211 108939552 109117091 109259021 109384084 109528196 109683096 109791422 109837401 109893346
1796.9 109893346 109977365 110048592 110093474 110130179 110185194 110244048 110284591 110306573 110340726 110385585 110426617
1819.3 110426617 110467589 110514712 110562956 110608327 110644555 110637867 110626364 110639107 110658193 110686457 110741961 110792744
1843.8 110792744 110792506 110768819 110753095 110752487 110761666 110777056 110788655 110800767 110816228 110836208 110870361 110896850
1868.2 110896850 110879600 110845518 110831761 110825050 110818028 110818803 110834503 110854948 110871422 110883939 110886753 110888195 110892653
1894.8 110892653 110892069 110888827 110889542 110889935 110894382 110905671 110913301 110908258 110904157 110914338 110924375 110922122 110918081 110914505
1923.3 110914505 110900092 110885656 110882819 110885334 110881400 110873795 110872161 110880637 110896087 110902131 110898256 110894239 110893941 110893989
1951.9 110893989 110892034 110889757 110886514 110887861 110896075 110904109 110903513 110894918 110887611 110885394 110885561 110887611 110890448 110890257 110884869
1982.5 110884869 110878956 110878444 110884893 110894775 110892415 110877025 110868561 110867596 110861695 110854423 110854769 110854781 110846376 110836697 110827494
2013 110827494 110821867 110823858 110818613 110800993 110783386 110771227 110765803 110767245 110766745 110761535 110765958 110781896 110789132 110779417
2041.6 110779417 110769403 110770798 110777271 110779595 110775447 110771346 110768247 110763347 110761511 110765815 110773480 110778725 110783160 110786998
2070.2 110786998 110785604 110784471 110786593 110787892 110790396 110793841 110794652 110798204 110804784 110808194 110808933 110808563 110808969 110812247 110816300
2100.7 110816300 110815811 110811400 110814011 110822189 110820436 110810387 110803938 110804284 110807335 110810161 110814416 110819399 110822070 110818875
2129.3 110818875 110808575 110798860 110796714 110795987 110794163 110793078 110789454 110787535 110789847 110783613 110766768 110756052 110755074 110755205
2157.9 110755205 110753250 110753918 110758150 110759902 110757852 110754275 110749555 110746253 110749388 110752702 110752487 110756552 110759628 110752118 110746896
2188.4 110746896 110754049 110761368 110762823 110760772 110756934 110757089 110762310 110764551 110762715 110761988 110764027 110768366 110766757 110758328 110753584
2219 110753584 110750556 110747600 110746229 110742271 110742640 110747409 110742760 110730350 110723209 110724366 110728014 110728276 110720813 110714579 110715413
2249.6 110715413 110708344 110691476 110680258 110681522 110689461 110693860 110691869 110685968 110680521 110675871 110669565 110667384 110669529 110666263
2278.2 110666263 110658288 110651457 110642540 110635865 110642099 110652912 110654497 110649920 110647273 110648048 110649002 110652888 110665417 110680556
2306.7 110680556 110694587 110709858 110725164 110743821 110772991 110808623 110844159 110885739 110927308 110959792 110987949
2329.2 110987949 111010551 111023891 111030936 111045301 111064482 111065364 111042857 110982370 110899448 110863101 110903430 110997128
2353.6 110997128 111108387 111207247 111269438 111288345 111252892 111179268 111098778 111012733 110918939 110827494 110748947
2376.1 110748947 110687816 110641611 110609567 110591269 110576081 110556722 110540771 110534775 110532951 110527146 110522044 110527468
2400.6 110527468 110531759 110520971 110510147 110509753 110509777 110507238 110504639 110501266 110498774 110496867 110494184 110497057 110506046 110509372
2429.1 110509372 110503542 110495591 110486460 110476422 110469472 110469258 110478294 110484588 110475707 110465491 110470188 110482585 110484695 110476208
2457.7 110476208 110473406 110476005 110471213 110461676 110456860 110454559 110450029 110441029 110433209 110440648 110453451 110449409 110433197 110422432
2486.2 110422432 110420513 110413599 110396075 110384703 110385895 110388780 110388672 110383928 110376644 110369635 110358548 110347497 110343397
2512.7 110343397 110337305 110323894 110309434 110295522 110284388 110279393 110276294 110272336 110270977 110271561 110272491 110273182 110272169 110268283
2541.3 110268283 110263169 110260904 110262227 110268080 110270739 110259593 110244370 110244858 110252309 110241508 110222137 110210145 110202396
2567.8 110202396 110194969 110182393 110164833 110150826 110147071 110144031 110130191 110115016 110105050 110094488 110084438 110082412
2592.3 110082412 110089445 110091507 110080040 110063303 110046983 110036635 110034227 110027277 110013509 110005271 109998870 109987521 109971535
2618.8 109971535 109951973 109938514 109927785 109914017 109905088 109896672 109885311 109877431 109869730 109863603 109864283 109863746 109857678
2645.3 109857678 109848678 109832883 109807181 109780800 109762907 109750962 109737170 109715843 109693348 109674704 109655213 109635866
2669.8 109635866 109618866 109604514 109592485 109583223 109591353 109622526 109650385 109664690 109680808 109696114 109706151 109721577
2694.3 109721577 109739900 109753096 109767318 109783399 109794545 109797144 109792399 109789371 109789109 109782314 109773088 109766662 109753120
2720.8 109753120 109722829 109678924 109654927 109673715 109703612 109713912 109709740 109716010 109746432 109780729 109789133 109767258
2745.2 109767258 109745598 109751749 109776902 109796023 109796715 109784222 109769630 109763157 109761643 109755874 109744787 109719265 109667265
2771.8 109667265 109601700 109558320 109536314 109494424 109430563 109368038 109293675 109198403 109112620 109043002 108959687
2794.2 108959687 108855617 108756220 108679163 108599102 108486235 108344316 108179557 108005047 107833171 107649326
2814.6 107649326 107434499 107174003 106856012 106480563 106054413 105568206 104996598 104313517 103474581 102400100
2835 102400100 100961816 98982018 96234035 92518163 87868863 82668102 77612770 73640072 71660596
2853.3 71660596 72069287 74504805 78108531 81977588 85433835 88073415 89800745 90866053 91752785
2871.7 91752785 92838645 94077629 95106053 95646703 95673084 95271331 94542080 93574762 92428553
2890.1 92428553 91154057 89803839 88409138 86958402 85406470 83708048 81817234 79666626
2906.4 79666626 77171695 74240106 70819694 66964030 62869549 58916152 55611056 53417563
2922.7 53417563 52569622 53019959 54547435 56896836 59892786 63389611 67166179 70945859 74470091
2941 74470091 77521455 79933631 81608009 82553262 82958919 83174181 83551854 84321892 85568219
2959.4 85568219 87248933 89249969 91427886 93617105 95660400 97453439 98966521 100231910
2975.7 100231910 101292765 102175701 102922010 103566682 104100776 104510212 104793656 104957223 104997849 104866076
2996.1 104866076 104527080 104007065 103345263 102631938 102038562 101731384 101812017 102312076 103160369 104186559
3016.5 104186559 105223238 106160808 106923997 107501531 107938099 108260131 108490050 108670390 108834481
3034.9 108834481 108979154 109065378 109097958 109139669 109218717 109305465 109366107 109416425 109480309 109540045 109596181
3057.3 109596181 109656203 109694445 109705496 109711862 109745228 109813023 109878087 109917712 109927034 109914267 109925759 109967303
3081.8 109967303 110000610 110038662 110089028 110132158 110182166 110231268 110245717 110233140 110239303 110281813 110309064 110280466
3106.2 110280466 110246217 110266352 110289383 110253394 110216832 110230947 110285532 110364354 110427642 110448670 110445249 110461998
3130.7 110461998 110503507 110510778 110464859 110424805 110446906 110504460 110536909 110536861 110506439 110456800 110453081 110507917
3155.2 110507917 110557437 110584462 110604203 110616577 110630143 110650218 110668123 110684562 110696948 110692382 110675132 110666168
3179.7 110666168 110677373 110690486 110693717 110696316 110700309 110706878 110713589 110716093 110715604 110717320 110725951 110735738 110744023 110756552
3208.2 110756552 110773027 110787368 110794055 110791779 110790718 110806608 110829771 110840750 110841453 110827816 110784328 110736740
3232.7 110736740 110747659 110807693 110850668 110860991 110848355 110818613 110799325 110813439 110844779 110861754 110853219 110851908
3257.2 110851908 110879862 110901558 110896993 110879743 110844815 110790205 110767055 110800481 110842109 110869801 110893929 110908127
3281.6 110908127 110910189 110910416 110898876 110859466 110820472 110810542 110819912 110842764 110855949 110817218 110744298 110707176
3306.1 110707176 110741544 110820353 110887957 110909021 110908377 110916710 110915029 110882068 110844982 110861528 110919678 110945797
3330.6 110945797 110931230 110902178 110856891 110821426 110824847 110851681 110882759 110882425 110828793 110795951 110837841 110893595
3355.1 110893595 110904324 110883355 110874784 110873151 110827672 110748303 110709059 110758305 110841572 110874844 110869360 110868299
3379.5 110868299 110884905 110908794 110911179 110875165 110806179 110755610 110773039 110804152 110760605 110676014 110672998 110759068
3404 110759068 110818601 110809374 110782683 110775733 110799253 110840154 110862112 110863459 110859263 110840571 110803843 110757375 110720634
3430.5 110720634 110680640 110615265 110596108 110673094 110760176 110777867 110755742 110748935 110754478 110749042 110731781 110706854
3455 110706854 110668242 110616493 110583329 110556400 110474324 110371280 110372376 110500562 110629523 110673189 110645449
3477.4 110645449 110627198 110702610 110788655 110788560 110793316 110849786 110872161 110834646 110778177 110745060 110726154 110689795
3501.9 110689795 110704720 110779011 110810316 110772908 110690713 110628676 110639703 110663390 110629332 110560477 110536301
3524.4 110536301 110569239 110593259 110580254 110550117 110518610 110503483 110520220 110536885 110530686 110541546 110590756 110654211
3548.8 110654211 110713804 110755384 110776126 110798800 110832608 110882056 110971498 111072040 111093450 111048079 111037409
3571.3 111037409 111067331 111094356 111105072 111107898 111127794 111173129 111232066 111275196 111260569 111237264 111242330 111228907
3595.7 111228907 111197996 111202824 111243367 111301279 111390352 111479259 111519456 111538625 111555040 111569691 111575568 111535406
3620.2 111535406 111485171 111496627 111589134 111685801 111657310 111580420 111540127 111526859 111533403 111540079 111551321 111624920
3644.7 111624920 111759925 111799908 111681211 111599612 111595714 111572075 111519122 111503375 111533988 111595654 111693156
3667.1 111693156 111787820 111812949 111822128 111823750 111743104 111643898 111588895 111585355 111632061 111693656 111723411 111714232
3691.6 111714232 111678553 111654150 111669421 111702871 111718643 111712158 111726129 111797023 111872900 111835670 111738431 111708343
3716.1 111708343 111737788 111773157 111787772 111781514 111762285 111765754 111826563 111923277 111956072 111854291 111755836 111796606
3740.5 111796606 111921823 111982167 111969638 111989200 111974764 111866140 111776137 111756623 111752236 111715055 111698413
3763 111698413 111723006 111738992 111723328 111684179 111664510 111685097 111709273 111711597 111706924 111702752 111691117 111676264
3787.5 111676264 111665475 111665428 111696076 111755538 111816347 111861324 111855853 111825430 111804080 111742306 111680818 111701655
3811.9 111701655 111782265 111844039 111885214 111910701 111859453 111787093 111747098 111733127 111764765 111823440 111862147
3834.4 111862147 111882913 111888075 111851251 111782861 111705327 111674035 111764205 111945570 112038469 111912334 111769438
3856.8 111769438 111728311 111763728 111815202 111835730 111856890 111870360 111829865 111776495 111741304 111739552 111762023 111763585
3881.3 111763585 111746848 111714041 111697114 111722744 111723614 111694825 111709988 111772728 111843181 111880219 111840034 111743724
3905.7 111743724 111674547 111648393 111637247 111645961 111671889 111673224 111645973 111638308 111663067 111680508 111675310 111664283
3930.2 111664283 111632001 111591554 111590517 111614251 111636186 111648822 111641824 111631918 111631930 111628652 111615634 111599445 111588240
3956.7 111588240 111588001 111590064 111584866 111582100 111581981 111579871 111575997 111564541 111556017 111558414 111558151 111551023 111543536 111544728 111564565
3987.3 111564565 111589134 111591136 111569107 111541903 111526692
3997.5 111526692
##END=$$ End of the data block
