##TITLE=$$ Begin of the data block
##JCAMP-DX=5.00 $$ ACD/SpecManager v 10.08
##SPECTROMETER/DATA SYSTEM=Alpha
##DATE=27 Jun 2014 15:13:00
##DATA TYPE=INFRARED SPECTRUM
##DATA CLASS=XYDATA
##ORIGIN=
##OWNER=
##NPOINTS=1667
##FIRSTX=599.63549805
##LASTX=3997.56909180
##MAXX=3997.56909180
##MINX=599.63549805
##MAXY=1.12045753
##MINY=0.52685058
##XFACTOR=1.0000000000
##YFACTOR=0.000000010000000
##FIRSTY=1.07554650
##DELTAX=2.03957605
##XUNITS=1/CM
##YUNITS=ARBITRARY UNITS
##XYDATA=(X++(Y..Y))
599.6A07554650K9350O0773N3179Q4209J16825J09864J12617J08373P8499N7721M7398
622.1A08413458K9445r06J1682O2728N1844J2243O401n388j2409J1849K539m6742m0007
648.6A08496737K540J2314P093j1838m8434p3731q6618q5783n7399k9671p2301j18816
673.1A07934093j20651j14954j17266j04916j03903r2530p2551q8417j03808q8930
693.5A06926167p7152j02926j64616k29644l17789m74727o28912o31833n11563m30894
713.9A03356111m04584l54481k28024J0074L19194N44215N89990N38719M82929M50849
734.2A05304992M49002M38249L87967L43871L36611L10326K44808K00820J84452J55104
754.6A08356202J14953Q1420O6805Q4126J22356J36400J06847O4921M6754P0870J00565
$$ plain form
599.6 107554650 107584000 107644773 107697952 107782161 107898986 108008850 108121467 108229840 108308339 108366060 108413458
622.1 108413458 108442903 108441997 108453679 108516407 108568251 108580494 108586895 108581507 108569098 108580947 108583486 108536744 108496737
648.6 108496737 108499277 108511591 108518684 108506846 108458412 108384681 108298063 108212280 108154881 108125210 108052909 107934093
673.1 107934093 107813442 107698488 107581222 107476306 107372403 107279873 107207322 107118905 107015097 106926167
693.5 106926167 106849015 106746089 106581473 106351829 106034040 105559313 104930401 104298568 103787005 103356111
713.9 103356111 102951527 102597046 102369022 102379096 102698290 103242505 103832495 104371214 104854143 105304992
734.2 105304992 105753994 106192243 106580210 106924081 107260692 107571018 107815826 108016646 108201098 108356202
754.6 108356202 108471155 108552575 108619380 108703506 108825862 108962262 109069109 109134030 109180784 109251654 109352219
777.1A09352219Q2278N6970O7568Q4102R2137Q0932N4359L8934L9386K9028j3387m8495
801.6A09916031n1450m3977k9301q738n043j8489k6799l1518l6514k1565L910Q118
826A09654665j0526m3953p3099q4936p0203k2733J2171j704k4856j2731K1410N1963
850.5A09395468O5696N0462K3257J014k8670m8983m0794l1352m9591q5914r6583n0414
875A09103596J2171L5537L0732K5558L3868N2607N5909K4772m4561j38521j73581q0669
899.4A08937418J9205K4438M983l851k4616m2641l7575j7369K170m804n1356r0158
923.9A08715844o1989K0266Q8251J00517O2597J847k7787l10L0482K2101j0276m7803
948.4A08893740p7569q5366p4089n8221m1736k2924q571l731j454m411j7715m8709
$$ plain form
777.1 109352219 109434497 109491467 109559035 109643137 109735274 109816206 109870565 109909499 109948885 109977913 109964526 109916031
801.6 109916031 109864581 109820604 109791303 109782565 109777522 109759033 109732234 109700716 109664202 109642637 109646547 109654665
826 109654665 109644139 109600186 109527087 109442151 109371948 109349215 109361386 109359682 109334826 109322095 109343505 109395468
850.5 109395468 109461164 109511626 109534883 109535897 109507227 109458244 109417450 109386098 109336507 109250593 109154010 109103596
875 109103596 109115767 109151304 109182036 109207594 109241462 109294069 109349978 109374750 109330189 109191668 109018087 108937418
899.4 108937418 108956623 108981061 108986044 108982193 108957577 108914936 108877361 108859992 108862162 108857358 108806002 108715844
923.9 108715844 108653855 108674121 108762372 108862889 108925486 108927333 108899546 108899236 108929718 108951819 108941543 108893740
948.4 108893740 108816171 108730805 108656716 108598495 108556759 108533835 108525264 108521533 108520079 108515668 108497953 108449244
972.9A08449244q4817p6306k3865K0933L8278M6789N7066N9700N1045K6167r394k5117
997.3A08529723k8420n5659q7797j08171j32918j22345m3523K1911j0395r1172j25694
1019.8A07745540j02293o8772n4372m6598j7918J3280k336p4887j93584l32118l72684
1042.2A06493258k10011K0540J25015J20163R9134P7868M2570J5735J8776L6740L9852
1064.7A06879640J7821k2828p8261j26183j64902k36428l44801m36115m76051m78434
1085A04533458m77135m86124m78435m39667l85297k99453j61445p678J08982J61135
1105.4A02068341J39916M7934q0288j79648j92571r6667Q1635K62999L44182K61354
1125.8A02657187K7513k51841m87351p17068r57012j104468j078779r21619p50720
$$ plain form
972.9 108449244 108364427 108288121 108264256 108285189 108323467 108370256 108427322 108487022 108538067 108564234 108554840 108529723
997.3 108529723 108501303 108445644 108357847 108249676 108116758 107994413 107950890 107972801 107962406 107871234 107745540
1019.8 107745540 107643247 107574475 107520103 107473505 107455587 107468867 107466531 107391644 107198060 106865942 106493258
1042.2 106493258 106283247 106303787 106428802 106548965 106648099 106725967 106768537 106784272 106803048 106839788 106879640
1064.7 106879640 106897461 106874633 106796372 106670189 106505287 106268859 105924058 105487943 105011892 104533458
1085 104533458 104056323 103570199 103091764 102652097 102266800 101967347 101805902 101798224 101907206 102068341
1105.4 102068341 102208257 102256191 102175903 101996255 101803684 101707017 101788652 102051651 102395833 102657187
1125.8 102657187 102684700 102432859 101945508 101228440 100271428 99166960 98088181 97166562 96415842
1144.2I6415842o49947o22869o39421o62261o63930o25527n26911l78895k19202p6330
1164.6I1350549M3887J46133K47055L72804N20759O46377P29954P84785P98100P61914
1185I6402317O93733O17665N47778M84240M36414M18156M15671L93689L36265K55597
1205.4A01001525J77646J19912Q6510O8844N3382L4547P15n4121j15133j63304j80078
1227.8A01030445j58012j33276j34635j27995p4863J9562J21725K05659K63811K92813
1248.2A01305234K86305K46716J94156J52576J35446J33550J24132J04797R7466J09815
1268.6A02890193J18423J12998J05679R4474Q5616J07765J75774K47562K60973K17557
1289A04417014J55687J03379P1108M9663L4308M2617Q0848J19519J29641J17695J07932
$$ plain form
1144.2 96415842 95765895 95143026 94503605 93841344 93177414 92551887 92024976 91646081 91426879 91350549
1164.6 91350549 91394436 91540569 91787624 92160428 92681187 93327564 94057518 94842303 95640403 96402317
1185 96402317 97096050 97713715 98261493 98745733 99182147 99600303 100015974 100409663 100745928 101001525
1205.4 101001525 101179171 101299083 101385593 101454437 101507819 101542366 101543081 101488960 101373827 101210523 101030445
1227.8 101030445 100872433 100739157 100604522 100476527 100401664 100421226 100542951 100748610 101012421 101305234
1248.2 101305234 101591539 101838255 102032411 102184987 102320433 102453983 102578115 102682912 102780378 102890193
1268.6 102890193 103008616 103121614 103227293 103321767 103407383 103515148 103690922 103938484 104199457 104417014
1289 104417014 104572701 104676080 104747188 104796851 104831159 104873776 104954624 105074143 105203784 105321479 105429411
1311.4A05429411R7716O9332L8099L9244O8569R6476J13213J10579P5793J4019m6480
1333.9A06105971q2600j07217j37674j36471j01829q1813q2994r2578r3102q0979o8402
1356.3A05040312m1974n483j4043n0473m8483m0626o1310j70040l90684m23289o7234
1378.7A03726673L92270O25646O22189N33951L97682K60746J69146R9600Q3601J30999
1399.1A07042503K04230K60639K26819P3111j34086l50237m60780l70347j60325M8781
1419.5A06380308J62327J39368j2815k12837m09674n11742m66490m94873n66304m58670
1439.9A03548598l68929l48913l59321m62973o17731p53045q04621q16607o72591l65138
1460.3I7978729l09974m01556N6606J274985K530265L166461K281690J078593O13845
$$ plain form
1311.4 105429411 105527127 105596459 105634558 105673802 105742371 105838847 105952060 106062639 106138432 106152451 106105971
1333.9 106105971 106023371 105916154 105778480 105642009 105540180 105458367 105375373 105282795 105189693 105108714 105040312
1356.3 105040312 104998338 104992855 104978812 104928339 104879856 104839230 104777920 104607880 104217196 103793907 103726673
1378.7 103726673 104118943 104744589 105366778 105900729 106298411 106559157 106728303 106827903 106911504 107042503
1399.1 107042503 107246733 107507372 107734191 107807302 107673216 107322979 106862199 106491852 106331527 106380308
1419.5 106380308 106542635 106682003 106669188 106456351 106046677 105534935 105068445 104573572 104007268 103548598
1439.9 103548598 103179669 102830756 102471435 102008462 101390731 100637686 99833065 99016458 98343867 97978729
1460.3 97978729 97668755 97267199 97323805 98598790 101129055 104295516 106577206 107655799 108269644
1478.7A08269644M76634L92533L16107K78473K20883J03342N4109O4290n353q9252
1499.1A10081410J240J74189K86305J68705m3106l3689K9731P5698Q1348O3861K1827
1521.5A10907519l3641l7479k4951J0514N3883L4237K0134Q0681P3934p0608j27423
1543.9A10886800r8192m3476r370J2922P0918J51050J22893j21224j34218l2174J6534
1566.4A10822463L1138m614P510N5361P200n0807k4116j0621j0801n054r78N85l756
1592.9A10813510j7345k6762k8467l6121l5524j3232J5712J8751J1015L1150M0578
1615.3A10773265k7012n0545l529k2137n7948n1546l7825Q714N9164j7178j50371j41573
1639.8A10281479r4735n2333n1010q5842k8837J5747j66821k21646r8276j7202j2588
$$ plain form
1478.7 108269644 108746278 109138811 109454918 109733391 109954274 110057616 110111725 110176015 110170662 110081410
1499.1 110081410 110082650 110256839 110543144 110711849 110668743 110635054 110664785 110740483 110821831 110885692 110907519
1521.5 110907519 110873878 110836399 110811448 110821962 110875845 110910082 110930216 111010897 111084831 111014223 110886800
1543.9 110886800 110788608 110745132 110735762 110748684 110819602 110970652 111093545 110972321 110838103 110805929 110822463
1566.4 110822463 110853601 110848987 110856497 110911858 110919058 110868251 110844135 110833514 110822713 110817659 110816681 110817266 110813510
1592.9 110813510 110796165 110769403 110740936 110704815 110669291 110656059 110671771 110690522 110701537 110732687 110773265
1615.3 110773265 110746253 110695708 110692179 110670042 110612094 110560548 110522723 110531437 110590601 110573423 110423052 110281479
1639.8 110281479 110186744 110134411 110083401 109997559 109968722 109984469 109817648 109596002 109497726 109480524 109467936
1662.2A09467936o0213l6240J4389J4150K8980R2399R3710O5101Q2004P5364q3113
1684.7A09754467k01154j63746j57594j33241j55186k24543l08919m81045m75943m34804
1705.1A07018292m89402m40490l40080k82860l40986o67334r51028r84037j150667
1723.4A01371408j440186j718420k064740k512098l759044m470420l799969l881830
1739.7G7724701l576720k240586o77383J100725L127450M666960M904163M968905M786492
1758.1I4784707L889519L112471K195167J438725J094830Q36993O15573L91328K52664
1776.5A08611977K26343K19834J80149J49762J29629J41310J50764J06871M9484N7829
1796.9A10023952P9929O7497M2236L0732M8184N7578M6241K7574L4618L7694L1340
$$ plain form
1662.2 109467936 109407723 109371483 109385872 109400022 109429002 109521401 109615111 109680212 109762216 109837580 109754467
1684.7 109754467 109553313 109389567 109231973 109098732 108943546 108719003 108410084 107929039 107453096 107018292
1705.1 107018292 106528890 106088400 105748320 105465460 105124474 104457140 103506112 102522075 101371408
1723.4 101371408 99931222 98212802 96148062 93635964 89876920 85406500 81606531 77724701
1739.7 77724701 74147981 71907395 71230012 72330737 75458187 80125147 85029310 89998215 94784707
1758.1 94784707 98674226 101786697 103981864 105420589 106515419 107352412 107967985 108359313 108611977
1776.5 108611977 108838320 109058154 109238303 109388065 109517694 109659004 109809768 109916639 109966123 110023952
1796.9 110023952 110103881 110171378 110213614 110244346 110292530 110350108 110396349 110423923 110458541 110496235 110527575
1819.3A10527575M1175N3418N0759M3106L1400j0336j3399J5175K2913K4056N0008
1841.7A10835850N3144P63k7788j8597j382P379J0979J0574J4579J6355K1017L4690
1866.2A10957563K5690j6475l6407k1779j2434p617J096J3984J8871K0635J5974n031
1890.7A10954070r036L421K849j07M387j061j681P272N281m876k002O795J239q773
1919.2A10957778l112L851o104r179n901q130p153r17J955N245J1098O128k599j1242
1947.8A10931718j2767l22R990M232p093o497K241Q297M184p534j1611n996o342p510
1976.3A10894990K813R239m29j0777q475M327R978p141k1672j2779p04k432o151l195
2004.9A10847592n173q881o307p522j0156o998r799j3745r286o879o830l100j001n96
$$ plain form
1819.3 110527575 110568750 110622168 110672927 110716033 110747433 110737097 110723698 110738873 110761786 110785842 110835850
1841.7 110835850 110888994 110889757 110861969 110843372 110841990 110849369 110860348 110870922 110885501 110901856 110922873 110957563
1866.2 110957563 110983253 110966778 110930371 110908592 110896158 110888541 110889637 110903621 110922492 110943127 110959101 110954070
1890.7 110954070 110945034 110948455 110951304 110951197 110955584 110954523 110952842 110960114 110965395 110960519 110958517 110965312 110966551 110957778
1919.2 110957778 110954666 110958517 110952413 110943234 110937333 110929203 110922050 110921133 110923088 110928333 110939431 110945559 110942960 110931718
1947.8 110931718 110918951 110918629 110928619 110932851 110925758 110919261 110921502 110929799 110933983 110926449 110914838 110908842 110902500 110894990
1976.3 110894990 110897803 110907042 110906613 110895836 110887361 110891688 110901666 110894525 110872853 110860074 110859370 110856938 110850787 110847592
2004.9 110847592 110842419 110833538 110827231 110819709 110809553 110802555 110792756 110779011 110769725 110762846 110756016 110752916 110751915 110751319
2033.4A10751319M888Q749O80j0204q130o56n84j407j383k861k885m720o092J133N650
2064A10733497j144k170L362L505J943J490L409O521J562o044o521l088J407N579O521
2094.6A10749829j323m673K598K003m125m7O354R41q702j2135k253R739O604l46Q35
2125.2A10745299K849k408q988q703m935l242l94n388j4317o175J168q261j3316o306
2153.8A10666883N01K157m506q654m351J513O819M125n233o462J562L266M030O807
2182.3A10668457p51p582l350J19k253J347R084O211l886p415m781p62K503j216q297
2212.9A10647428o306L993O462k659m291j43k242M185R691o127k1589j5223m375n293
2241.5A10603511n209k158R6M947n37j6975j6379J931R596K503m971m267K539M828
$$ plain form
2033.4 110751319 110756207 110764956 110765636 110755432 110747302 110746646 110746062 110744655 110743272 110740411 110737526 110732806 110726714 110727847 110733497
2064 110733497 110732353 110730183 110733545 110737050 110738993 110740483 110743892 110750413 110751975 110745931 110739410 110736322 110737729 110743308 110749829
2094.6 110749829 110748506 110743833 110746431 110748434 110744309 110744262 110750616 110751557 110742855 110730720 110728467 110738206 110744810 110744464 110745299
2125.2 110745299 110748148 110745740 110736752 110728049 110723114 110719872 110719478 110714090 110699773 110693598 110694766 110686505 110673189 110666883
2153.8 110666883 110667384 110669541 110665035 110656381 110652030 110653543 110660362 110664487 110659254 110652792 110654354 110657620 110661650 110668457
2182.3 110668457 110667706 110660124 110656774 110656893 110654640 110655987 110665071 110671282 110667396 110659981 110655200 110654438 110656941 110655725 110647428
2212.9 110647428 110641122 110645115 110651577 110648918 110644627 110644484 110642242 110646427 110656118 110649991 110628402 110613179 110608804 110603511
2241.5 110603511 110598302 110596144 110596240 110601187 110600650 110583675 110567296 110569227 110578823 110581326 110576355 110572088 110574627 110579455
2270A10579455m65j800L93o401j2124q142o592n066N519R978k837j0491j383L839l398
2300.6A10540485l385J1051K0647K1720J8739J6356K9886M2462K8598J3518K1387K5451
2325.1A10786915J7619J6761K2292K3734K0910L4618L9339K337l3856n9712p3456l1829
2349.6A10765672N0711J09482J04082P2396M6777J8347k7502n7256o9881r0849j03176
2372A10818803r2601o5041m2355m1330m2319k9207j8763j6630j2779o163L81L302K659
2398.5A10457957M232R5r763n615L541j121n293J454M173k39j001k62j168j002p15
2429.1A10445273l243n793l827k110m589J311J0312K110p296m137K897J1575P701n281
2457.7A10444903j180R835O771n233j1683j0800n543J192P75L10J370l993q416p308
$$ plain form
2270 110579455 110578990 110577190 110577583 110571182 110559058 110550916 110544324 110539258 110544777 110554755 110551918 110541427 110540044 110543883 110540485
2300.6 110540485 110537100 110548151 110568798 110590518 110609257 110625613 110655499 110697961 110726559 110740077 110761464 110786915
2325.1 110786915 110804534 110821295 110843587 110867321 110888231 110922849 110962188 110964525 110930669 110870957 110797501 110765672
2349.6 110765672 110816383 110925865 111029947 111102343 111149120 111167467 111139965 111082709 111012828 110921979 110818803
2372 110818803 110726202 110661161 110618806 110577476 110535157 110505950 110487187 110470557 110457778 110451615 110451996 110455298 110457957
2398.5 110457957 110462189 110462284 110452521 110446906 110450447 110449326 110444033 110445487 110449660 110449421 110448420 110448158 110446990 110445988 110445273
2429.1 110445273 110442030 110436237 110432410 110430300 110425711 110427022 110437334 110439444 110432148 110428011 110430908 110442483 110450184 110444903
2457.7 110444903 110443723 110453558 110460329 110455096 110443413 110432613 110427070 110428262 110429037 110429347 110430717 110426724 110418308 110411000
2486.2A10411000n972p880p641k4K730m518o676k682j299m638p784n043k384q309j7559
2516.8A10331321j5664r430j0693j0228o151l58O461L743m17N245O175k968n007O20
2545.4A10292649L70l362m601m173j824M375L839r167j4019r942p141o783j3268j7893
2573.9A10209060j4687m244K945l541p725o413r561j0120l005K313n400j1218p200
2600.4A10131204j0705j3876o020n722j3208p737j121n924j5140j9979j2386r537j6177
2626.9A09993672j8394j4269n591m768j1003o831O044Q774n25j0121j8811k7585k7001
2653.5A09863591j3339r859k0313k2125j7381j3161j1325j6582j8716j5616j5366o926
2677.9A09682882J7738L4928K2960Q452J1897J4889J6106K1124J7333J0013J2636J5974
$$ plain form
2486.2 110411000 110405028 110397148 110389507 110389483 110392213 110387695 110381019 110378337 110377038 110372400 110364616 110359573 110357189 110348880 110331321
2516.8 110331321 110315657 110306227 110295534 110285306 110279155 110278797 110285258 110289001 110288584 110293829 110300004 110297036 110292029 110292649
2545.4 110292649 110293019 110289657 110285056 110280883 110279059 110283434 110287273 110278106 110264087 110254145 110247004 110240221 110226953 110209060
2573.9 110209060 110194373 110190129 110193074 110189533 110181808 110175395 110165834 110155714 110152709 110155022 110149622 110138404 110131204
2600.4 110131204 110120499 110106623 110100603 110094881 110081673 110073936 110072815 110066891 110051751 110031772 110019386 110009849 109993672
2626.9 109993672 109975278 109961009 109955418 109950650 109939647 109932816 109938860 109947634 109947109 109936988 109918177 109890592 109863591
2653.5 109863591 109850252 109840393 109820080 109797955 109780574 109767413 109756088 109739506 109720790 109705174 109689808 109682882
2677.9 109682882 109700620 109735548 109758508 109766960 109778857 109793746 109809852 109830976 109848309 109858322 109870958 109886932
2702.4A09886932J1456J91o938j240L672n162j4400j4067j7035k4295k9325j6642J3578
2728.9A09786725K4021J2099L195J1897L3093L3283N341k0242j9991J025J6892J2004
2753.4A09899342j156m387k229J716L016q893k5344l9529n4586o2049l9744j3983l5286
2779.9A09616888o7437o9559p7665j00243r5892p2777p5126r8705r9695p7521q3423
2802.4A08698845j15538j41167j66095j75810j71458j88518k23374k65074l16071l69478
2822.7A06566262m22680m88413n77855o95419q49640j078451j447391j989770k752382
2841.1I6264261l721982m650319n184197n033857l962856j969427M20201K433961L596753
2859.5G8192538L867161L453774K631849J718074J059049Q86643J085621J228756J018166
$$ plain form
2702.4 109886932 109898388 109898579 109891641 109890401 109894073 109888911 109874511 109860444 109843409 109819114 109789789 109773147 109786725
2728.9 109786725 109810746 109822845 109826040 109837937 109871030 109904313 109909654 109889412 109869421 109870446 109887338 109899342
2753.4 109899342 109898186 109893799 109891570 109893286 109896302 109887409 109862065 109822536 109767950 109705901 109666157 109652174 109616888
2779.9 109616888 109549451 109479892 109402227 109301984 109206092 109133315 109058189 108959484 108859789 108782268 108698845
2802.4 108698845 108583307 108442140 108276045 108100235 107928777 107740259 107516885 107251811 106935740 106566262
2822.7 106566262 106143582 105655169 105077314 104381895 103532255 102453804 101006413 99016643 96264261
2841.1 96264261 92542279 87891960 82707763 77673906 73711050 71741623 72161824 74595785 78192538
2859.5 78192538 82059699 85513473 88145322 89863396 90922445 91809088 92894709 94123465 95141631
2877.8I5141631N44054L7211l93266p26008r73046j156634j280445j351851j394069
2896.2H8447577j447791j548249j692551j881564k145350k500605k935988l410172
2912.5G0885307l838849m081983l947943l302253k185493q43728M35293J507157K342617
2930.8E6970125L000737L510171L784072L766674L504586L044421K415889J678545
2947.2H1675220R46772M06909K18373L81494P72184J241547J670909J999396K189916
2965.5I1502720K200151K043253J792341J515901J272112J065088Q68714P25150O38699
2983.9A03624129N39542M15325K86591J65212M1366j31393l33917n22089o82163p26104
3004.3A02676499n85270k98715Q7333N09226Q48079J016688J025594R32026P63917
$$ plain form
2877.8 95141631 95685685 95722896 95329630 94603622 93630576 92473942 91193497 89841646 88447577
2896.2 88447577 86999786 85451537 83758986 81877422 79732072 77231467 74295479 70885307
2912.5 70885307 67046458 62964475 59016532 55714279 53528786 52685058 53120351 54627508 56970125
2930.8 56970125 59970862 63481033 67265105 71031779 74536365 77580786 79996675 81675220
2947.2 81675220 82621992 83028901 83247274 83628768 84400952 85642499 87313408 89312804 91502720
2965.5 91502720 93702871 95746124 97538465 99054366 100326478 101391566 102260280 102985430 103624129
2983.9 103624129 104163671 104578996 104865587 105030799 105072165 104940772 104606855 104084766 103402603 102676499
3004.3 102676499 102091229 101792514 101879847 102389073 103237152 104253840 105279434 106211460 106975377
3022.6A06975377N75983M40800L33572K29954J71876J62757J46985Q5950L0756L6859
3043A09190869P5305R1207O5863M4751N1677N1773N1975N8198M0364J2208M947L1173
3067.5A09770310O7806O9869M0447%k0647J6761N2488M0662M2439M7207L1078L8933
3092A10197353M4322J4472o389J1384L4666J8061k6846l3343J4305K0242l7229m9770
3116.4A10201228M017O5076Q9562O1322J7988K098J9968K8264n161l7682k3461K1017
3140.9A10444236L9434L0530J1873l5191o3192j1003N7983O2621L2055J1361Q714J8382
3165.4A10607803J8394P295P332J0562n234j7464l433J0526L338n233m554J764J0050
3191.9A10641146R405Q107O413l052k122Q238J4090K1494K1696J0562M494l433o593
$$ plain form
3022.6 106975377 107551360 107992160 108325732 108555686 108727562 108890319 109037304 109123254 109154010 109190869
3043 109190869 109266174 109357381 109423244 109467995 109519672 109571445 109623420 109681618 109721982 109734190 109739137 109770310
3067.5 109770310 109838116 109907985 109948432 109948432 109927785 109944546 109997034 110037696 110080135 110127342 110158420 110197353
3092 110197353 110241675 110256147 110249758 110261142 110295808 110313869 110287023 110253680 110267985 110288227 110250998 110201228
3116.4 110201228 110205245 110270321 110359883 110421205 110439193 110441291 110461259 110489523 110484362 110446680 110423219 110444236
3140.9 110444236 110483670 110514200 110526073 110490882 110427690 110416687 110474670 110537291 110569346 110580707 110589421 110607803
3165.4 110607803 110626197 110633492 110640824 110651386 110646152 110628688 110625255 110635781 110639119 110633886 110629332 110631096 110641146
3191.9 110641146 110650551 110658658 110665071 110662019 110659897 110668135 110682225 110703719 110725415 110735977 110740471 110737038 110730445
3218.4A10730445J6332K8169N436j2231k2709m6647m5550J5140N7459L0768R286K659
3242.9A10768557k0445k1124P677K5905J7428p665l791K7084K2126n293j5104l1161
3267.4A10764194n3609k6202K7049L7229K5498K0528J1778N01q11j0299m0043m3154
3291.8A10712659j1050J4972L4547K8956l2103q7547n8091L1674Q8501P1669K3365
3314.3A10817552L826R167j323k7799l6586K361L9279K4021n174k5225m0865k9063
3338.8A10730171N663K7370L4046P832m7469m0126L0041O0487K8121j8942l4428k8419
3363.2A10754347m7958o3443k1935N1737P1430K3127k778J2470K7394J9777j0217m5347
3387.7A10768604p6663n4419J5962K3496m5133o9618J0622Q4197N1153j2505k5606
$$ plain form
3218.4 110730445 110746777 110774946 110780382 110768151 110745442 110698795 110653245 110668385 110725844 110756612 110765898 110768557
3242.9 110768557 110748112 110726988 110734665 110760570 110777998 110770333 110766542 110793626 110815752 110810459 110795355 110764194
3267.4 110764194 110710585 110684383 110711432 110748661 110774159 110794687 110806465 110806966 110806155 110795856 110755813 110712659
3291.8 110712659 110701609 110716581 110751128 110780084 110747981 110660434 110602343 110634017 110722518 110794187 110817552
3314.3 110817552 110821378 110830545 110829222 110801423 110764837 110767198 110806477 110830498 110825324 110800099 110759234 110730171
3338.8 110730171 110735834 110763204 110797250 110805082 110757613 110717487 110747528 110808015 110836136 110817194 110782766 110754347
3363.2 110754347 110706389 110642946 110621011 110672748 110744178 110767305 110764527 110776997 110804391 110824168 110813951 110768604
3387.7 110768604 110691941 110637522 110653484 110676980 110631847 110562229 110572851 110657048 110708201 110695696 110670090
3410.1A10670090r30L0494M1151K0373n734j0491q380k7967n1796l5882k9528o2371
3434.6A10529029l0446N7030Q0609L7218j526l255M959p224k5022l4058n2309n9426
3459.1A10495579k0385j1014p7618j04510n115J20795J21224K9218l3843p439Q6200
3481.5A10593092Q6189m292N794O1834K8824l3283n1296k5522k3425n0235J2064Q7357
3506A10687101M4656m4108j00851p0452J2147L1018j3554m7779k5845K2805K6846j1396
3530.5A10510588m0388l8481j0681K7072L0816o80L82L5047M7815M5371M8018M2021
3554.9A10696900K5856K0850M7457R9385J10924K5285n3215k0516K9874L6180K0575
3577.4A11039555P391J8239L9411N2476M1031p212p701J5390k7728n2798O771N0617
$$ plain form
3410.1 110670090 110669160 110699654 110740805 110761178 110755444 110744953 110736573 110708606 110656810 110620928 110591400 110529029
3434.6 110529029 110498583 110555613 110636222 110673440 110671914 110668659 110673618 110666394 110641372 110607314 110555005 110495579
3459.1 110495579 110475194 110464180 110386562 110282052 110276937 110397732 110518956 110548174 110514331 110506892 110593092
3481.5 110593092 110679281 110674989 110680783 110742617 110771441 110738158 110686862 110661340 110637915 110587680 110599744 110687101
3506 110687101 110731757 110687649 110586798 110516346 110528493 110559511 110545957 110498178 110472333 110495138 110521984 110510588
3530.5 110510588 110470200 110431719 110421038 110448110 110478926 110478246 110478628 110513675 110561490 110606861 110654879 110696900
3554.9 110696900 110722756 110743606 110791063 110890448 111001372 111026657 110973442 110952926 110982800 111018980 111039555
3577.4 111039555 111046946 111065185 111104596 111157072 111198103 111190891 111183190 111198580 111170852 111118054 111124825 111175442
3601.9A11175442N1558P2586Q7726O2967L6573J6952J4806J5890k8133m4692J2946
3624.3A11474621P7093O3693l9541p1609l8362r441M363O103K7752Q8835J35601M2116
3648.8A11761224j13511q6915j3352l3760n8460r346L1495N3060R7299J04093L9828
3671.2A11771655J8323m936r2041r4521l9423K432L5691L9745J9014m042l5154k3365
3695.7A11593378L1185M8470K909k8658P927O7115P0346j7202o6769k3640K3270K7990
3720.1A11736321O617m304o401J3780O0046Q3184J2291j12248r4986M2677J16122M3857
3744.6A11896956j2302M6682J3769j08171r3126r120R287k8837k7442N603J0872j7131
3769.1A11687040m2390k8492M340J9860J6487N972n436j1337j1670r740N019M0269
$$ plain form
3601.9 111175442 111227000 111299586 111387312 111450279 111486852 111503804 111518610 111534500 111506367 111461675 111474621
3624.3 111474621 111551714 111615407 111575866 111504257 111465895 111456454 111460817 111466920 111494672 111583507 111719108 111761224
3648.8 111761224 111647713 111560798 111547446 111513686 111455226 111445880 111477375 111530435 111627734 111731827 111771655
3671.2 111771655 111789978 111785042 111693001 111598480 111559057 111561489 111597180 111636925 111655939 111651897 111616743 111593378
3695.7 111593378 111624563 111673033 111675942 111647284 111655211 111722326 111792672 111775470 111708701 111685061 111708331 111736321
3720.1 111736321 111742938 111738634 111732233 111746013 111806059 111889243 111901534 111789286 111694300 111736977 111853099 111896956
3744.6 111896956 111884654 111931336 111945105 111836934 111743808 111734688 111743975 111715138 111687696 111693299 111704171 111687040
3769.1 111687040 111644650 111616158 111620498 111640358 111656845 111662817 111657381 111646044 111634374 111624634 111629653 111669922
3793.6A11669922O3825N9211M6682J037k7704k8110p6842o8056K7287Q6236O0939L9161
3818A11853588L7431l6072p6533m4250j8275R429K6954J7774K8813L8206m303m9579
3842.5A11783183p8869m5324P8154J87576J21033j13642j53494o0630J5640N1856L1734
3865A11817217J1313k62k4987k7287k8407j9038P594J1217j657k8491k0969K2304J169
3891.5A11719716l7551k635M9508O6483M5109k4164r0838p3349k1601R811L2151K5046
3915.9A11697686k4092m5574j2458K1971J9204M590R596q213m2820k9016J0336K9552
3940.4A11630762K0039k74o915o580j2588j7024j0836o151j812J919q678j5271n567
3966.9A11561024J7619K6775k444j6749P033J6654m578k0683j1408N782P117p344j3733
$$ plain form
3793.6 111669922 111733747 111792958 111839640 111840677 111812973 111784863 111708021 111639965 111667252 111753488 111814427 111853588
3818 111853588 111891019 111854947 111778414 111734164 111715889 111725318 111752272 111770046 111798859 111837065 111832762 111783183
3842.5 111783183 111704314 111658990 111737144 111924720 112045753 111932111 111778617 111717987 111733627 111785483 111817217
3865 111817217 111828530 111828268 111803281 111775994 111747587 111728549 111736143 111747360 111745703 111717212 111696243 111718547 111719716
3891.5 111719716 111682165 111679530 111729038 111795521 111840630 111816466 111725628 111652279 111630678 111640489 111672640 111697686
3915.9 111697686 111673594 111628020 111615562 111637533 111656737 111661327 111670923 111662710 111619890 111590874 111601210 111630762
3940.4 111630762 111650801 111650527 111643612 111637032 111624444 111607420 111596584 111590433 111588621 111590540 111581862 111566591 111561024
3966.9 111561024 111578643 111605418 111602974 111586225 111593258 111609912 111605334 111584651 111573243 111579025 111586142 111578798 111565065
3993.4A11565065j2660n448
3997.5A11546957
$$ plain form
3993.4 111565065 111552405 111546957
3997.5 111546957
##END=$$ End of the data block
