##TITLE=$$ Begin of the data block
##JCAMP-DX=5.00 $$ ACD/SpecManager v 10.08
##SPECTROMETER/DATA SYSTEM=Alpha
##DATE=27 Jun 2014 15:13:00
##DATA TYPE=INFRARED SPECTRUM
##DATA CLASS=XYDATA
##ORIGIN=
##OWNER=
##NPOINTS=1667
##FIRSTX=599.63549805
##LASTX=3997.56909180
##MAXX=3997.56909180
##MINX=599.63549805
##MAXY=1.11698937
##MINY=0.32175058
##XFACTOR=1.0000000000
##YFACTOR=0.000000010000000
##FIRSTY=1.04191923
##DELTAX=2.03957605
##XUNITS=1/CM
##YUNITS=ARBITRARY UNITS
##XYDATA=(X++(Y..Y))
$$ plain form
599.6 104191923 104174376 104288602 104443622 104606521 104754591 104895949 105044329 105206621 105342579 105429268
620 105429268 105502832 105545831 105567062 105625641 105697834 105717158 105694890 105674958 105639827 105578530 105530334 105510771
644.5 105510771 105485642 105433524 105378091 105344415 105309248 105215776 105054975 104873729 104708326 104560184 104364884
666.9 104364884 104107094 103922963 103747487 103492153 103185403 102899384 102657163 102439356 102226770 101996684
687.3 101996684 101760793 101567447 101396835 101168501 100863028 100479984 99972993 99274522 98298126 97056133
707.7 97056133 95789844 94750291 93914527 93146461 92445207 91979975 92030519 92698729 93745577 94868594
728.1 94868594 95905560 96841943 97749418 98645610 99488515 100267768 100975502 101593351 102134323 102592003
748.5 102592003 102973711 103316343 103609431 103838575 104009104 104144740 104316270 104527593 104688931 104795372
$$ packed form
599.6A04191923j7547J14226J55020J62899J48070J41358J48380J62292J35958Q6689
620A05429268P3564M2999K1231N8579P2193J9324k2268j9932l5131o1297m8196j9563
644.5A05510771k5129n2118n5433l3676l5167r3472j60801j81246j65403j48142j95300
666.9A04364884k57790j84131j75476k55334l06750k86019k42221k17807k12586k30086
687.3A01996684k35891j93346j70612k28334l05473l83044n06991o98471r76396j241993
707.7I7056133j266289j039553q35764p68066p01254m65232N0544O68210J046848J123017
728.1I4868594J036966R36383R07475Q96192Q42905P79253P07734O17849N40972M57680
748.5A02592003L81708L42632K93088K29144J70529J35636J71530K11323J61338J06441
$$ plain form
768.9 104795372 104912853 105055976 105201817 105337632 105467296 105584884 105700397 105836964 105984318 106116259
789.3 106116259 106223595 106306922 106344819 106316686 106251466 106183088 106098890 105992186 105887771 105795240 105693352
811.7 105693352 105577719 105478442 105401218 105332816 105291331 105287087 105282152 105229342 105107331 104937160 104775214
834.2 104775214 104666436 104603648 104547131 104481983 104419005 104373348 104373074 104432225 104508793 104553676 104560256 104529893
858.7 104529893 104461610 104368126 104266882 104156256 104011440 103829896 103654420 103547716 103545356 103613687 103676951
881.1 103676951 103704166 103744090 103828561 103916311 103945422 103846502 103566110 103220117 103038645 103028846 103050041
903.5 103050041 103054404 103014612 102917373 102803326 102725852 102701330 102693522 102645016 102508438 102309859 102159071
926 102159071 102156055 102312028 102522266 102636492 102612591 102543569 102523398 102551925 102572012 102537596 102435446
$$ packed form
768.9A04795372J17481J43123J45841J35815J29664J17588J15513J36567J47354J31941
789.3A06116259J07336Q3327L7897k8133o5220o8378q4198j06704j04415r2531j01888
811.7A05693352j15633r9277p7224o8402m1485m244m935n2810j22011j70171j61946
834.2A04775214j08778o2788n6517o5148o2978m5657k74N9151P6568M4883O580l0363
858.7A04529893o8283r3484j01244j10626j44816j81544j75476j06704k360O8331O3264
881.1A03676951K7215L9924Q4471Q7750K9111r8920k80392l45993j81472r799K1195
903.5A03050041M363l9792r7239j14047p7474k4522p808m8506j36578j98579j50788
926A02159071l016J55973K10238J14226k3901o9022k0171K8527K0087l4416j02150
$$ plain form
948.4 102435446 102277315 102085817 101891267 101729167 101617229 101548409 101520097 101520944 101514637 101478970 101416266
970.8 101416266 101315320 101170886 101043463 101003110 101034033 101077402 101137614 101246548 101373303 101461780 101484442
993.3 101484442 101448870 101389039 101315284 101204717 101050174 100853455 100613785 100391769 100296605 100309324 100261343
1015.7 100261343 100071251 99833012 99655938 99548358 99467105 99394679 99367505 99408740 99437833 99326485
1036.1 99326485 98965961 98328799 97631508 97258770 97319514 97566909 97807854 98012900 98164254 98242372
1056.5 98242372 98260778 98270565 98326814 98419547 98471230 98432219 98309326 98092580 97743994 97236514 96553266
1078.9 96553266 95705402 94758749 93791288 92836905 91896063 90982205 90134746 89401263 88851947 88567954
1099.3 88567954 88561761 88764709 89071178 89345664 89438295 89279383 88936365 88575310 88409090 88588351
$$ packed form
948.4A02435446j58131j91498j94550j62100j11938o8820k8312Q47o307l5667o2704
970.8A01416266j00946j44434j27423m0353L0923M3369O0212J08934J26755Q8477K2662
993.3A01484442l5572n9831p3755j10567j54543j96719k39670k22016r5164J2719m7981
1015.7A00261343j90092k38239j77074j07580q1253p2426k7174M1235K9093j11348
1036.1I9326485l60524o37162o97291l72738O0744K47395K40945K05046J51354P8118
1056.5I8242372J8406R787N6249R2733N1683l9011j22893k16746l48586n07480o83248
1078.9I6553266q47864r46653r67461r54383r40842r13858q47459p33483n49316k83993
1099.3H8567954o193K02948L06469K74486R2631j58912l43018l61055j66220J79261
$$ plain form
1119.7 88588351 89101261 89762032 90252709 90280843 89798278 88906825 87591523 85847270 83892119
1138.1 83892119 82026941 80438179 79155731 78075683 77054328 76015693 74949390 73885417
1154.4 73885417 72901249 72089261 71508914 71175605 71068776 71151412 71391273 71790242 72395414 73238492
1174.8 73238492 74276292 75452840 76742649 78076863 79351026 80507636 81549746 82492286 83337682
1193.1 83337682 84110516 84864116 85618800 86332756 86946136 87424487 87767380 87999237 88162172 88295817
1213.5 88295817 88413692 88496441 88502479 88399071 88188094 87901336 87586451 87296212 87043017 86799890
1233.9 86799890 86582154 86464608 86514527 86744875 87132603 87643152 88214314 88758606 89212811 89565670
1254.3 89565670 89853615 90128464 90402567 90642321 90831667 91006291 91208684 91442829 91672367 91869450
$$ packed form
1119.7H8588351N12910O60771M90677K8134m82565q91453j315302j744253j955151
1138.1H3892119j865178j588762j282448j080048j021355j038635j066303j063973
1154.4G3885417r84168q11988n80347l33309j06829Q2636K39861L98969O05172Q43078
1174.8G3238492J037800J176548J289809J334214J274163J156610J042110R42540Q45396
1193.1H3337682P72834P53600P54684P13956O13380M78351L42893K31857J62935J33645
1213.5H8295817J17875Q2749O038j03408k10977k86758l14885k90239k53195k43127
1233.9H6799890k17736j17546M9919K30348L87728N10549N71162N44292M54205L52859
1254.3H9565670K87945K74849K74103K39754J89346J74624K02393K34145K29538J97083
$$ plain form
1274.7 91869450 92042702 92215598 92438406 92791015 93280464 93796730 94223720 94524044 94737101 94908708
1295.1 94908708 95040786 95129573 95219040 95378906 95614845 95862460 96083009 96285242 96461499 96585917
1315.5 96585917 96665323 96755505 96914965 97147334 97407484 97637683 97788298 97825879 97738051 97527206
1335.9 97527206 97218978 96907228 96699250 96561342 96407485 96222842 96031719 95855784 95698249 95568234
1356.3 95568234 95481807 95422059 95355427 95294279 95231503 95145082 95006591 94610977 93813008 93071663 93063468
1378.7 93063468 93915093 95169485 96359724 97379541 98202419 98744071 99003267 99092019 99231559
1397.1 99231559 99573302 100092161 100645125 101095855 101256847 100966358 100207984 99214858 98349327 97866595
1417.5 97866595 97953331 98405468 98751628 98747665 98305207 97441632 96411252 95433128 94348830 93289232
$$ packed form
1274.7I1869450J73252J72896K22808L52609M89449N16266M26990L00324K13057J71607
1295.1I4908708J32078Q8787Q9467J59866K35939K47615K20549K02233J76257J24418
1315.5I6585917P9406R0182J59460K32369K60150K30199J50615L7581q7828k10845
1335.9I7527206l08228l11750k07978j37908j53857j84643j91123j75935j57535j30015
1356.3I5568234q6427n9748o6632o1148o2776q6421j38491l95614p97969p41345q195
1378.7I3063468Q51625J254392J190239J019817Q22878N41652K59196Q8752J39540
1397.1I9231559L41743N18859N52964M50730J60992k90489p58374r93126q65531m82732
1417.5I7866595Q6736M52137L46160l963m42458q63575j030380r78124j084298j059598
$$ plain form
1437.9 93289232 92562413 91926736 91242963 90510845 89621252 88509589 87131673 85547489 83822459
1456.2 83822459 82593280 82232821 81880504 81215757 81439698 83909535 88539702 94342536 98785102
1474.6 98785102 101134145 102526736 103535914 104329848 104908788 105301154 105599535 105880773 106089771
1493 106089771 106140447 106047881 105970037 106069207 106274474 106450045 106648362 106899369 107073963 107148981 107147348
1515.4 107147348 107139993 107163167 107215226 107318723 107430351 107528019 107579708 107563090 107546628 107552111 107471037
1537.8 107471037 107315707 107276809 107318127 107349730 107348514 107328808 107327795 107331538 107284963 107226121 107377160 107566750
1562.3 107566750 107638943 107655740 107666743 107720482 107784331 107784736 107799661 107882583 107942271 107961118 107965565 107960618
1586.8 107960618 107950830 107938457 107913256 107875693 107833874 107778883 107702017 107632113 107594645 107588899 107612145 107653272
$$ packed form
1437.9I3289232p26819o35677o83773p32118q89593j111663j377916j584184j725030
1456.2H3822459j229179l60459l52317o64747K23941K469837M630167N802834M442566
1474.6I8785102K349043J392591J009178P93934N78940L92366K98381K81238K08998
1493A06089771N0676r2566p7844R9170K05267J75571J98317K51007J74594P5018j633
1515.4A07147348p355K3174N2059J03497J11628R7668N1689j6618j6462N483q1074
1537.8A07471037j55330l8898M1318L1603j216j9706j013L743m6575n8842J51039J89590
1562.3A07566750P2193J6797J1003N3739O3849M05J4925Q2922N9688J8847M447m947
1586.8A07960618r788j2373k5201l7563m1819n4991p6866o9904l7468n746K3246M1127
$$ plain form
1611.3 107653272 107653141 107585323 107540226 107546353 107494354 107391393 107327342 107292688 107286024 107268941 107155704 106969178
1635.7 106969178 106851482 106742752 106550848 106270683 105919325 105695391 105611145 105404973 105165887 105171382
1656.1 105171382 105190754 105125177 105011415 104921484 104834712 104696441 104666126 104831886 105105484 105400097
1676.5 105400097 105584252 105602121 105453229 105228913 105093074 104923642 104635644 104271805 103698444 102965021
1696.9 102965021 102146137 101162744 100332880 99486500 98507524 97683626 97008741 96342885 95474464 94094151
1717.3 94094151 92517084 90968823 88990694 86448669 83460164 79951680 75821298 69932830
1733.6 69932830 63556641 58742094 54060346 49911305 47484666 46795270 47987038 51503336 57242554
1752 57242554 63926035 71257466 78778780 85320961 90888137 95040435 97824216 99867225 101385796
$$ packed form
1611.3A07653272j31o7818m5097O127n1999j02961o4051l4654o664j7083j13237j86526
1635.7A06969178j17696j08730j91904k80165l51358k23934q4246k06172k39086N495
1656.1A05171382J9372o5577j13762q9931q6772j38271l0315J65760K73598K94613
1676.5A05400097J84155J7869j48892k24316j35839j69432k87998l63839n73361p33423
1696.9A02965021q18884r83393q29864q46380r78976q23898o74885o65856q68421j380313
1717.3I4094151j577067j548261j978129k542025k988505l508484m130382n888468
1733.6F9932830o376189m814547m681748m149041k426639o89396J191768L516298N739218
1752E7242554O683481P331431P521314O542181N567176M152298K783781K043009J518571
$$ plain form
1770.3 101385796 102602506 103576458 104277027 104808950 105265903 105664051 106021583 106324697 106558585
1788.7 106558585 106739426 106953871 107185555 107370961 107516754 107664812 107836998 107987261 108105934 108202624
1809.1 108202624 108310390 108421934 108521771 108611095 108699751 108774900 108824086 108871758 108917558 108975375 109067059
1831.5 109067059 109161508 109215295 109246767 109271073 109277225 109280801 109328556 109403694 109464478 109507036 109528875 109546757
1856 109546757 109566271 109587836 109608793 109613442 109583402 109558821 109595001 109650207 109681261 109692574 109703374 109713113
1880.5 109713113 109720838 109726453 109726262 109724855 109745872 109777105 109792900 109808004 109821820 109827495 109828901 109831190 109828377
1907 109828377 109823728 109826100 109828162 109811795 109787619 109791434 109806263 109814155 109824014 109831452 109828973 109823370 109822536 109825552
1935.5 109825552 109829116 109821022 109799361 109800231 109830487 109852409 109860063 109864986 109871495 109873164 109867418 109866810 109874201 109871995
$$ packed form
1770.3A01385796J216710R73952P00569N31923M56953L98148L57532L03114K33888
1788.7A06558585J80841K14445K31684J85406J45793J48058J72186J50263J18673R6690
1809.1A08202624J07766J11544R9837Q9324Q8656P5149M9186M7672M5800N7817R1684
1831.5A09067059R4449N3787L1472K4306O152L576M7755P5138O0784M2558K1839J7882
1856A09546757J9514K1565K0957M649l0040k4581L6180N5206L1054J1313J0800R739
1880.5A09713113P725N615j91j407K1017L1233J5795J5104J3816N675J406K289k813
1907A09828377m649K372K062j6367k4176L815J4829P892R859P438k479n603q34L016
1935.5A09825552L564q094k1661Q70L0256K1922P654M923O509J669n746o08P391k206
$$ plain form
1964.1 109871995 109857368 109849668 109846187 109842193 109846258 109856820 109864962 109864783 109856355 109846199 109837711 109830725 109824789 109823644
1992.6 109823644 109829354 109829175 109821606 109816623 109815872 109813261 109808731 109809148 109810436 109804118 109787619 109764600 109742558 109728348
2021.2 109728348 109723890 109726012 109726560 109722781 109719598 109716332 109719646 109733570 109743166 109745300 109752536 109766626 109778798 109789526
2049.8 109789526 109801924 109811103 109814835 109813941 109811413 109810030 109815955 109830916 109840441 109838045 109839451 109854710 109870076
2076.3 109870076 109875548 109880972 109896839 109920287 109940541 109953320 109965372 109979260 109988427 109990811 109996057 110009861
2100.7 110009861 110022330 110027921 110035861 110048759 110059726 110071290 110085154 110099888 110114253 110122287 110124195 110126197
2125.2 110126197 110131526 110135865 110138249 110144055 110150623 110153711 110153258 110150731 110151005 110149336 110143268 110136521 110129285 110132456 110144019
2155.8 110144019 110149121 110149455 110156000 110170126 110180247 110181737 110183322 110193062 110205698 110210049 110213804 110230100 110249269
$$ packed form
1964.1A09871995j4627p700l481l994M065J0562Q142j79q428j0156q488o986n936j145
1992.6A09823644N710j79p569m983p51k611m530M17J288o318j6499k3019k2042j4210
2021.2A09728348m458K122N48l779l183l266L314J3924R596K134P236J4090J2172J0728
2049.8A09789526J2398R179L732q94k528j383N925J4961R525k396J406J5259J5366
2076.3A09870076N472N424J5867K3448K0254J2779J2052J3888R167K384N246J3804
2100.7A10009861J2469N591P940J2898J0967J1564J3864J4734J4365Q034J908K002
2125.2A10126197N329M339K384N806O568L088m53k527K74j669o068o747p236L171J1563
2155.8A10144019N102L34O545J4126J0121J490J585R740J2636M351L755J6296J9169
$$ plain form
2182.3 110249269 110260868 110267580 110274315 110281861 110289490 110301077 110316038 110326004 110329425 110336435 110349166 110361111 110367429
2208.8 110367429 110368145 110369182 110372472 110376453 110383487 110391390 110392249 110392272 110398841 110402215 110400856 110404265 110404253 110394204 110388851
2239.4 110388851 110391033 110392582 110399508 110408175 110403192 110388291 110377872 110377765 110381830 110385036 110389876 110395575 110398984 110396361
2268 110396361 110388637 110389912 110405338 110417080 110416150 110411155 110408175 110407519 110408485 110407722 110397363 110376787 110362303 110369241
2296.5 110369241 110381413 110377657 110369146 110369730 110378742 110388517 110395145 110410118 110436428 110459745 110474157 110494208 110529304
2323.1 110529304 110563064 110586989 110615182 110652113 110672891 110668111 110669851 110687530 110696197 110693145 110670161 110624540
2347.5 110624540 110601735 110639775 110723126 110798800 110852325 110882246 110881186 110847521 110794413 110748959 110695195 110621035
2372 110621035 110553682 110510063 110485804 110471869 110465789 110463965 110458195 110449004 110441744 110442173 110448802 110451114 110448313 110442889
$$ packed form
2182.3A10249269J1599O712O735P546P629J1587J4961R966L421P010J2731J1945O318
2208.8A10367429P16J037L290L981P034P903Q59K3O569L374j359L409j2j0049n353
2239.4A10388851K182J549O926Q667m983j4901j0419j07M065L206M840N699L409k623
2268A10396361p724J275J5426J1742r30m995k980o56R66p63j0359k0576j4484O938
2296.5A10369241J2172l756q511N84R012R775O628J4973K6310K3317J4412K0051L5096
2323.1A10529304L3760K3925K8193L6931K0778m780J740J7679Q667l052k2984m5621
2347.5A10624540k2805L8040Q3351P5674N3525K9921j060l3665n3108m5454n3764p4160
2372A10621035o7353m3619k4259j3935o080j824n770r191p260M29O629K312k801n424
$$ plain form
2400.6 110442889 110429716 110415339 110416269 110427594 110433292 110436225 110441303 110447407 110458565 110465813 110456967 110446525 110451806
2427.1 110451806 110465300 110470796 110463727 110449588 110442352 110443807 110440111 110435033 110440111 110451639 110460246 110463703 110459375
2453.6 110459375 110449564 110447407 110449815 110446727 110444164 110444188 110442936 110446799 110455561 110453093 110437667 110433114 110442364 110442984 110428882
2484.2 110428882 110409665 110396934 110394073 110394752 110391629 110385036 110377729 110364723 110352910 110353649 110352564 110335028 110309994
2510.7 110309994 110285401 110263324 110249007 110236073 110221100 110211599 110200727 110185158 110173607 110170209 110173476 110176575
2535.2 110176575 110173547 110164583 110155284 110150385 110152173 110158098 110159767 110155582 110150695 110145843 110136306 110125327 110117459 110110080
2563.7 110110080 110099602 110083103 110064495 110048878 110034513 110019064 110002100 109977126 109949720 109935451 109925115
2586.2 109925115 109908593 109889925 109874678 109866369 109855986 109840167 109826565 109811914 109789717 109767079 109753788 109744310
$$ packed form
2400.6A10442889j3173j4377R30J1325N698K933N078O104J1158P248q846j0442N281
2427.1A10451806J3494N496p069j4139p236J455l696n078N078J1528Q607L457m328
2453.6A10459375r811k157K408l088k563K4j252L863Q762k468j5426m553R250O20j4102
2484.2A10428882j9217j2731k861O79l123o593p307j3006j1813P39j085j7536k5034
2510.7A10309994k4593k2077j4317j2934j4973r501j0872j5569j1551l398L267L099
2535.2A10176575l028q964r299m899J788N925J669m185m887m852r537j0979p868p379
2563.7A10110080j0478j6499j8608j5617j4365j5449j6964k4974k7406j4269j0336
2586.2A09925115j6522j8668j5247q309j0383j5819j3602j4651k2197k2638j3291r478
$$ plain form
2610.6 109744310 109726167 109702790 109681559 109659004 109636283 109613109 109582901 109550655 109523904 109498000 109472799
2633.1 109472799 109452581 109440064 109436738 109433091 109424949 109417868 109409487 109391546 109365463 109341204 109316254 109280121
2657.5 109280121 109228516 109163868 109098911 109046257 109013832 109000838 108995044 108988202 108978951 108972800 108980584 109008837
2682 109008837 109051478 109096158 109130251 109155357 109195077 109252727 109301412 109331107 109358442 109391320 109416974 109422135
2706.5 109422135 109410310 109393215 109376514 109358895 109338319 109314132 109280360 109233463 109180105 109143996 109137142 109146810
2731 109146810 109171939 109202111 109227383 109260368 109295809 109318411 109322488 109315479 109320307 109339464 109348702 109333777 109306765
2757.5 109306765 109287977 109275067 109246147 109199679 109148920 109083176 108992410 108895981 108814001 108725345 108598399
2779.9 108598399 108449960 108295977 108123755 107937825 107756960 107585466 107409084 107207203 106985629 106767464
$$ packed form
2610.6A09744310j8143k3377k1231k2555k2721k3174l0208l2246k6751k5904k5201
2633.1A09472799k0218j2517l326l647q142p081q381j7941k6083k4259k4950l6133
2657.5A09280121n1605o4648o4957n2654l2425j2994n794o842r251o151P784K8253
2682A09008837M2641M4680L4093K5106L9720N7650M8685K9695K7335L2878K5654N161
2706.5A09422135j1825j7095j6701j7619k0576k4187l3772m6897n3358l6109o854R668
2731A09146810K5129L0172K5272L2985L5441K2602M077p009M828J9157R238j4925k7012
2757.5A09306765j8788j2910k8920m6468n0759o5744r0766r6429q1980q8656j26946
2779.9A08598399j48439j53983j72222j85930j80865j71494j76382k01881k21574k18165
$$ plain form
2800.3 106767464 106541419 106280887 105973971 105624878 105259216 104885519 104462528 103955114 103367817 102694392
2820.7 102694392 101922321 101049745 100048757 98874426 97491515 95841628 93791860 91115743 87524420
2839.1 87524420 82743961 76708722 69773054 62658060 56261176 51528347 49238676 49669057 52470779
2857.4 52470779 56839114 61804646 66484433 70222402 72747266 74354029 75775743 77546459
2873.7 77546459 79512250 81112778 81944150 81949008 81266898 80061096 78467453 76618308 74629039
2892.1 74629039 72577012 70499170 68379229 66172773 63840717 61341006 58620763 55624884
2908.4 55624884 52308148 48672801 44818825 40969759 37466720 34681213 32888103 32175058 32476670
2926.8 32476670 33642238 35501084 38003969 41146299 44795063 48720351 52659315 56299400
$$ packed form
2800.3A06767464k26045k60532l06916l49093l65662l73697m22991n07414n87297o73425
2820.7A02694392p72071q72576j000988j174331j382911j649887k049768k676117l591323
2839.1H7524420m780459o035239o935668p114994o396884m732829k289671M30381K801722
2857.4E2470779M368335M965532M679787L737969K524864J606763J421714J770716
2873.7G7546459J965791J600528Q31372M858o82110j205802j593643j849145j989269
2892.1G4629039k052027k077842k119941k206456k332056k499711k720243k995879
2908.4E5624884l316736l635347l853976l849066l503039k785507j793110p13045L01612
2926.8C2476670J165568J858846K502885L142330L648764L925288L938964L640085
$$ plain form
2943.1 56299400 59308904 61437839 62638998 63152373 63424498 63928348 65008587 66790926 69238138
2961.4 69238138 72253186 75673777 79243100 82686120 85807645 88521773 90838993 92803115
2977.8 92803115 94443566 95811599 96974719 97957921 98747450 99306446 99609149 99635434 99309665
2996.1 99309665 98573732 97456801 96069831 94651020 93532646 93014824 93275744 94322926 95990688
3014.5 95990688 97985160 99978048 101747632 103208220 104357493 105242658 105905628 106390011 106752217
3032.8 106752217 107044756 107295895 107481968 107602608 107702708 107808244 107923341 108029664 108124185 108224189
3053.2 108224189 108322275 108418536 108505297 108557200 108585477 108616281 108679473 108791983 108916056 109004092 109047759
3075.7 109047759 109079850 109135294 109203112 109266651 109334934 109396708 109443450 109494555 109543252 109565628 109563720 109564793
$$ packed form
2943.1E6299400L009504K128935J201159N13375K72125N03850J080239J782339K447212
2961.4F9238138L015048L420591L569323L443020L121525K714128K317220J964122
2977.8I2803115J640451J368033J163120R83202P89529N58996L02703K6285l25769
2996.1I9309665p35933j116931j386970j418811j118374n17822K60920J047182J667762
3014.5I5990688J994472J992888J769584J460588J149273Q85165O62970M84383L62206
3032.8A06752217K92539K51139J86073J20640J00100J05536J15097J06323R4521J00004
3053.2A08224189R8086R6261Q6761N1903K8277L0804O3192J12510J24073Q8036M3667
3075.7A09047759L2091N5444O7818O3539O8283O1774M6742N1105M8697K2376j908J073
$$ plain form
3100.1 109564793 109588432 109610701 109596241 109566224 109571767 109599686 109601009 109587717 109601891 109656799 109739089 109814656
3124.6 109814656 109852827 109862089 109879899 109913719 109925616 109899843 109877610 109891844 109920931 109940338 109950972 109943795
3149.1 109943795 109924626 109939146 109990323 110039043 110073960 110090530 110088646 110086405 110098410 110122573 110140288 110140932
3173.5 110140932 110136998 110136867 110138476 110140145 110142612 110150671 110158217 110164189 110177863 110186124 110178268 110178053 110193002 110200739
3202.1 110200739 110198271 110198748 110211802 110235178 110255158 110262597 110256195 110246277 110256040 110283387 110304129 110308015 110292804
3228.6 110292804 110258555 110221827 110226655 110273254 110308027 110314083 110299253 110271049 110255289 110271335 110300553 110309839
3253.1 110309839 110298324 110301030 110321188 110325956 110319185 110314691 110287654 110230052 110197878 110230303 110292161 110330820
3277.6 110330820 110328758 110311651 110311651 110324597 110320127 110279298 110229278 110216796 110239816 110277450 110311425 110296071 110222161
$$ packed form
3100.1A09564793K3639K2269j4460l0017N543K7919J323j3292J4174N4908Q2290P5567
3124.6A09814656L8171R262J7810L3820J1897k5773k2233J4234K9087J9407J0634p177
3149.1A09943795j9169J4520N1177M8720L4917J6570j884k241J2005K4163J7715O44
3173.5A10140932l934j31J609J669K467Q059P546N972J3674Q261p856k15J4949P737
3202.1A10200739k468M77J3054K3376J9980P439o402r918R763K7347K0742L886j5211
3228.6A10292804l4249l6728M828M6599L4773O056j4830k8204j5760J6046K9218R286
3253.1A10309839j1515K706K0158M768o771m494k7037n7602l2174L2425O1858L8659
3277.6A10330820k062j7107%J2946m470m0829n0020j2482K3020L7634L3975j5354p3910
$$ plain form
3304.1 110222161 110158801 110166550 110224676 110277331 110304153 110322022 110342360 110344064 110301435 110247898 110237336 110256100
3328.6 110256100 110272491 110277951 110253465 110201001 110172331 110189915 110225654 110257077 110247135 110184991 110149360 110189664
3353 110189664 110241532 110241747 110203433 110166860 110139775 110084295 110002911 109973550 110028565 110101974 110130870 110122848
3377.5 110122848 110115123 110117817 110116434 110110986 110091400 110030127 109977353 109998918 110026562 109977221 109903681 109904408 109967244
3404 109967244 109998667 109982324 109960520 109949791 109973967 110027039 110042691 110015631 109991515 109965432 109922087 109873581
3428.5 109873581 109840524 109799540 109723020 109681356 109731042 109806454 109828067 109784615 109730577 109711874 109700656
3450.9 109700656 109676301 109635794 109552169 109446049 109394097 109374726 109270334 109116495 109108710 109274256 109417725
3473.4 109417725 109436214 109375703 109343052 109445918 109584498 109618115 109638703 109718978 109763741 109722972 109651637
$$ packed form
3304.1A10222161o3360P749N8126N2655K6822J7869K0338J704m2629n3537j0562J8764
3328.6A10256100J6391N460k4486n2464k8670J7584L5739L1423r942o2144l5631M0304
3353A10189664N1868K15l8314l6573k7085n5480q1384k9361N5015P3409K8896q022
3377.5A10122848p725K694j383n448j9586o1273n2774K1565K7644m9341p3540P27O2836
3404A09967244L1423j6343k1804j0729K4176N3072J5652k7060k4116k6083m3345m8506
3428.5A09873581l3057m0984p6520m1664M9686P5412K1613m3452n4038j8703j1218
3450.9A09700656k4355m0507q3625j06120n1952j9371j04392j53839p785J65546J43469
3473.4A09417725J8489o0511l2651J02866J38580L3617K0588Q0275M4763m0769p1335
$$ plain form
3495.8 109651637 109614718 109585512 109528887 109557128 109675109 109722543 109660447 109555078 109490466 109491944 109496248
3518.2 109496248 109455812 109374309 109316278 109332442 109378743 109407270 109401405 109363544 109351599 109397650 109428596 109405148
3542.7 109405148 109392703 109457195 109569180 109657228 109728360 109807694 109876025 109925020 109972274 110026729 110082507
3565.1 110082507 110165095 110280252 110386527 110466075 110516119 110552490 110588408 110602796 110577333 110556686 110614991
3587.6 110614991 110685027 110671890 110640693 110648179 110671282 110716093 110795486 110870659 110925436 110986924 111041546 111069465
3612.1 111069465 111097932 111131275 111170661 111221719 111252666 111239469 111199880 111218834 111306834 111354148 111364746
3634.5 111364746 111377084 111403644 111434150 111427033 111358953 111279809 111280596 111370504 111445498 111468160 111469197 111476457
3659 111476457 111514533 111569083 111578119 111535060 111509109 111501896 111472845 111487341 111525869 111542332 111578977 111597168
$$ packed form
3495.8A09651637l6919k9206n6625K8241J17981M7434o2096j05369o4612J478M304
3518.2A09496248m0436q1503n8031J6164M6301K8527n865l7861j1945M6051L0946k3448
3542.7A09405148j2445O4492J11985Q8048P1132P9334O8331M8995M7254N4455N5778
3565.1A10082507Q2588J15157J06275P9548N0044L6371L5918J4388k5463k0647N8305
3587.6A10614991P0036j3137l1197P486K3103M4811P9393P5173N4777O1488N4622K7919
3612.1A11069465K8467L3343L9386N1058L0947j3197l9589J8954Q8000M7314J0598
3634.5A11364746J2338K6560L0506p117o8080p9144P87Q9908P4994K2662J037P260
3659A11476457L8076N4550R036m3059k5951p213k9051J4496L8528J6463L6645J8191
$$ plain form
3683.4 111597168 111538649 111447930 111458087 111563015 111625266 111633182 111632228 111643815 111678946 111698937 111666274 111596060
3707.9 111596060 111529052 111550689 111625373 111644208 111626434 111613238 111590636 111572027 111588228 111593091 111545253 111460710
3732.4 111460710 111403394 111430788 111473823 111459887 111435366 111463702 111463463 111412859 111414862 111459005 111462307 111442959
3756.9 111442959 111461735 111497831 111490285 111463654 111448193 111465633 111525798 111572456 111565351 111518681 111491752 111511004
3781.3 111511004 111533916 111547589 111550629 111542964 111544144 111536133 111506283 111465335 111423564 111426747 111450255 111458600 111481464
3807.8 111481464 111502755 111487103 111448932 111437416 111406040 111350870 111366653 111397171 111391199 111390579 111407578 111406505
3832.3 111406505 111351120 111297464 111338222 111417174 111451662 111461878 111469352 111453331 111398971 111398697 111494899 111520123
3856.8 111520123 111478961 111445951 111452818 111475992 111462414 111453211 111478484 111505902 111545098 111554229 111534774 111527836
$$ packed form
3683.4A11597168n8519r0719J0157J04928O2251P916r54J1587L5131J9991l2663p0214
3707.9A11596060o7008K1637P4684J8835j7774j3196k2602j8609J6201M863m7838q4543
3732.4A11460710n7316K7394M3035j3936k4521K8336k39n0604K003M4143L302j9348
3756.9A11442959J8776L6096p546k6631j5461J7440O0165M6658p105m6670k6929J9252
3781.3A11511004K2912J3673L040p665J180q011k9850m0948m1771L183K3508Q345K2864
3807.8A11481464K1291j5652l8171j1516l1376n5170J5783L0518n972o20J6999j073
3832.3A11406505n5385n3656M0758P8952L4488J0216P474j6021n4360k74R6202K5224
3856.8A11520123m1162l3010O867K3174j3578r203K5273K7418L9196R131j9455o938
$$ plain form
3881.3 111527836 111499798 111489987 111523175 111542130 111561477 111586952 111575210 111533666 111503148 111504197 111546159 111608195
3905.7 111608195 111638546 111637259 111622310 111600029 111598670 111615241 111614799 111609590 111617410 111620808 111607182 111590302 111580694
3932.3 111580694 111579502 111585748 111588073 111584961 111594474 111611831 111613274 111610544 111625385 111647356 111650622 111635816 111631334
3958.8 111631334 111637390 111637771 111632895 111625540 111613739 111597788 111594689 111611819 111628461 111632514 111628962 111622560 111619222
3985.3 111619222 111625195 111631060 111625230 111621583 111618984 111611831
3997.5 111611831
$$ packed form
3881.3A11527836k8038r811L3188J8955J9347K5475j1742m1544l0518J049M1962O2036
3905.7A11608195L0351j287j4949k2281j359J6571m42n209P820L398j3626j6880r608
3932.3A11580694j192O246K325l112R513J7357J443k730J4841K1971L266j4806m482
3958.8A11631334O056L81m876p355j1801j5951l099J7130J6642M053l552o402l338
3985.3A11619222N973N865n830l647k599p153
3997.5A11611831
##END=$$ End of the data block
