##TITLE=$$ Begin of the data block
##JCAMP-DX=5.00 $$ ACD/SpecManager v 10.08
##SPECTROMETER/DATA SYSTEM=Alpha
##DATE=27 Jun 2014 15:13:00
##DATA TYPE=INFRARED SPECTRUM
##DATA CLASS=XYDATA
##ORIGIN=
##OWNER=
##NPOINTS=1667
##FIRSTX=599.63549805
##LASTX=3997.56909180
##MAXX=3997.56909180
##MINX=599.63549805
##MAXY=1.11734140
##MINY=0.32636070
##XFACTOR=1.0000000000
##YFACTOR=0.000000010000000
##FIRSTY=1.04345715
##DELTAX=2.03957605
##XUNITS=1/CM
##YUNITS=ARBITRARY UNITS
##XYDATA=(X++(Y..Y))
599.6A04345715l5870J10984J63817J84155J55794J14954J20938J57666J30558P1645
$$ 104345715 104309845 104420829 104584646 104768801 104924595 105039549 105160487 105318153 105448711 105520356
620A05520356O5851M6730M2605P8702M7553k2006m9198n0807l8564k7347l2901k5630
$$ 105520356 105586207 105632937 105675542 105754244 105801797 105779791 105730593 105679786 105641222 105613875 105580974 105555344
644.5A05555344k6358o9654q2576l5143j6677n9319j30462j84703j84572j50490j73485
$$ 105555344 105528986 105459332 105376756 105341613 105324936 105265617 105135155 104950452 104765880 104615390 104441905
666.9A04441905k47610k04444j89268k38121k68197k71654k61664k35987k04349j93464
$$ 104441905 104194295 103989851 103800583 103562462 103294265 103022611 102760947 102524960 102320611 102127147
687.3A02127147k07222k20823k17521k34664k85518l59964m84443o94954r87184j240087
$$ 102127147 101919925 101699102 101481581 101246917 100961399 100601435 100116992 99422038 98434854 97194767
707.7I7194767j261318j038307q21590p54637p02554m58973N5515O46472J022619J114852
$$ 97194767 95933449 94895142 94073552 93318915 92616361 92157388 92212903 92859375 93881994 94996846
728.1I4996846J045274R52769R02354Q61466Q01135P49909O90973O05166N28646M62138
$$ 94996846 96042120 96994889 97897243 98758709 99559844 100309753 101000726 101605892 102134538 102596676
748.5A02596676M15421L76177K95543K09177J55854J32477J62387K05529J73879J13511
$$ 102596676 103012097 103388274 103683817 103892994 104048848 104181325 104343712 104549241 104723120 104836631
768.9A04836631J18089J48022J34515J17720J32751J38676J35017J36256J27757J13618
$$ 104836631 104954720 105102742 105237257 105354977 105487728 105626404 105761421 105897677 106025434 106139052
789.3A06139052J04320Q9920L9684l0219n3668m1473o5232j09171j13273r5499r8466
$$ 106139052 106243372 106333292 106372976 106342757 106289089 106247616 106182384 106073213 105959940 105864441 105765975
811.7A05765975j02163q3065p1847p9167n8639q261J072n4061j32084j75130j55485
$$ 105765975 105663812 105580747 105508900 105429733 105371094 105362833 105363905 105309844 105177760 105002630 104847145
834.2A04847145j08659p7772p0620o2108m4513k7919J2661P5256R2483N6505J9515
$$ 104847145 104738486 104660714 104590094 104527986 104483473 104455554 104468215 104543471 104635954 104692459 104711974
856.6A04711974j9455o6054r4795r8169j03593j29199j53673j51813r9671j1182M8411
$$ 104711974 104692519 104626465 104531670 104433501 104329908 104200709 104047036 103895223 103795552 103784370 103832781
879.1A03832781M3536K3520N1546R5546R1410K6071r4784k53606l25119k03037m5586
$$ 103832781 103876317 103899837 103951383 104046929 104138339 104164410 104069626 103816020 103490901 103287864 103242278
901.5A03242278J2457K0123k4617r5463j11758p1335k0552m244n0199j42049j98317
$$ 103242278 103254735 103274858 103250241 103154778 103043020 102971685 102951133 102946889 102896690 102754641 102556324
923.9A02556324j44565k766J47510K05421J09613l2532o9189j7035K4629J5687l3903
$$ 102556324 102411759 102408993 102556503 102761924 102871537 102839005 102769816 102752781 102777410 102793097 102759194
946.4A02759194r8180j51742j87099j96314j66118j13547n8055r775j79k8467m9662
$$ 102759194 102661014 102509272 102322173 102125859 101959741 101846194 101788139 101778364 101778185 101749718 101700056
968.8A01700056n6672r3115j48904j37592m5895L2055M5765N4025R3258J15287Q9467
$$ 101700056 101643384 101550269 101401365 101263773 101217878 101249933 101295698 101349723 101442981 101558268 101647735
991.2A01647735L0195k4080n0569q1121j28973j65939j99390k42018k22135q8084K1434
$$ 101647735 101677930 101653850 101603281 101522160 101393187 101227248 101027858 100785840 100563705 100475621 100497055
1013.7A00497055m3058j86301k34711j79857j16777q8066o9910k3806L7372K6571j12789
$$ 100497055 100453997 100267696 100032985 99853128 99736351 99648285 99578375 99554569 99591941 99618512 99505723
1036.1I9505723l62427o32679o89602l66396O3795K43861K33102J94984J43516P3606
$$ 99505723 99143296 98510617 97821015 97454619 97518414 97762275 97995377 98190361 98333877 98407483
1056.5I8407483O956r66O1340J03086N0848m9388j26749k06638l38995n08893o84881
$$ 98407483 98414439 98413473 98474813 98577899 98628747 98579359 98452610 98245972 97906977 97398084 96713203
1078.9I6713203q43304r39322r56648r43923r32485r04489q43352p29757n36549k77412
$$ 96713203 95869899 94930577 93973929 93030006 92097521 91193032 90349680 89619923 89083374 88805962
1099.3H8805962j3894J92225K96867K72005J02973j50311l47739l66700j64145J80107
$$ 88805962 88792068 88984293 89281160 89553165 89656138 89505827 89158088 88791388 88627243 88807350
1119.7H8807350N08279O54280M84330K3383m82679q82995j299393j724333j934826
$$ 88807350 89315629 89969909 90454239 90477622 89994943 89111948 87812555 86088222 84153396
1138.1H4153396j847750j571357j263285j065922j015955j035315j060807j060033
$$ 84153396 82305646 80734289 79471004 78405082 77389127 76353812 75293005 74232972
1154.4G4232972r83972q10843n75310l31259j12838P6491K41929M04942O04284Q29643
$$ 74232972 73249000 72438157 71862847 71531588 71418750 71495241 71737170 72142112 72746396 73576039
1174.8G3576039J020724J162982J274526J322061J272255J161086J045758R37795Q32618
$$ 73576039 74596763 75759745 77034271 78356332 79628587 80789673 81835431 82773226 83605844
1193.1H3605844P59703P40683P39747P04634O15448M84568L48151K33215J54888J22929
$$ 83605844 84365547 85106230 85845977 86550611 87166059 87650627 87998778 88231993 88386881 88509810
1213.5H8509810J11753P8839M166j02651k09677k84821l08764k83456k55608k49166
$$ 88509810 88621563 88700402 88704568 88601917 88392240 88107419 87798655 87515199 87259591 87010425
1233.9H7010425k11054j00636O0159K27809L76534M98420N66739N45663M56088L54463
$$ 87010425 86799371 86698735 86758894 86986703 87363237 87861657 88428396 88974059 89430147 89784610
1254.3H9784610K85590K68608K67726K38294J92851J75786K01660K28763K16818J90180
$$ 89784610 90070200 90338808 90606534 90844828 91037679 91213465 91415125 91643888 91860706 92050886
1274.7I2050886J77258J77885K23833L47870M80271N11640M32998L10868K15852J64324
$$ 92050886 92228144 92406029 92629862 92977732 93458003 93969643 94402641 94713509 94929361 95093685
1295.1I5093685J21832Q4216R6523J73068K42860K45785K16478K00618J79386J29503
$$ 95093685 95215517 95299733 95396256 95569324 95812184 96057969 96274447 96475065 96654451 96783954
1315.5I6783954Q1229Q7297J53774K26790K55751K29729J58727M6784q9407k14798
$$ 96783954 96865183 96952480 97106254 97333044 97588795 97818524 97977251 98024035 97934628 97719830
1335.9I7719830l04180l07500k09558j38951j49089j77509j88487j78141j59466j29223
$$ 97719830 97415650 97108150 96898592 96759641 96610552 96433043 96244556 96066415 95906949 95777726
1356.3I5777726q5002n8568o1881n8079o5434q9717j41984l94756p88891p30604m166
$$ 95777726 95692724 95634156 95572275 95514196 95448762 95359045 95217061 94822305 94033414 93302810 93298644
1378.7I3298644Q46422J244270J182896J019109Q17954N28616K50643R0665J41179
$$ 93298644 94145066 95389336 96572232 97591341 98409295 98937911 99188554 99279219 99420398
1397.1I9420398L26109M98790N49614M55380J63174k91300p61438r96524q69512m87143
$$ 99420398 99746507 100245297 100794911 101250291 101413465 101122165 100360727 99364203 98494691 98007548
1417.5I8007548P8964M43053L41118j341m30507q48341j019025r71657j079350j054150
$$ 98007548 98086512 98529565 98870683 98869342 98438835 97590494 96571469 95599812 94520462 93466312
1437.9I3466312p20573o32047o86074p37715q93312j106465j363462j563776j698589
$$ 93466312 92745739 92113692 91427618 90689903 89796591 88690126 87326664 85762888 84064299
1456.2H4064299j212305l63469l57151o62440K25895K461911M609245N770015M411728
$$ 84064299 82851994 82488525 82131374 81468934 81694829 84156740 88765985 94536000 98947728
1474.6I8947728K327382J381505J003098P84755N73027L92091K99561K83826K13635
$$ 98947728 101275110 102656615 103659713 104444468 105017495 105409586 105709147 105992973 106206608
1493A06206608N5313r4676q4210R7359K13337J95920K00522K22147J53875O6328l70
$$ 106206608 106261921 106167245 106083035 106180394 106393731 106589651 106790173 107012320 107166195 107232523 107232153
1515.4A07232153O044L6967M9651Q8692J00564R4569N9760n889j8454M304o2108j33157
$$ 107232153 107238197 107275164 107324815 107413507 107514071 107608640 107668400 107662511 107644057 107648361 107586253 107453096
1539.9A07453096n1141J8120J8251q392k2555k849M506k8050k2805J47474J55831N0223
$$ 107453096 107401955 107420075 107438326 107429934 107407379 107404530 107409036 107380986 107358181 107505655 107661486 107711709
1564.3A07711709J2886K2328O2788O3896K324J3519P6162N8961K2722P927n662j3078
$$ 107711709 107724595 107746923 107809711 107873607 107875931 107889450 107965612 108024573 108047295 108055222 108049560 108036482
1588.8A08036482j5056k9814m3058m2880n3036p6819p0345l6609R5L0983L7646m876
$$ 108036482 108021426 107991612 107948554 107905674 107852638 107775819 107705474 107668865 107668960 107699943 107737589 107732713
1613.3A07732713n6529l5858L34n1844j02866p5114l9947j19r489j06573j82152j23072
$$ 107732713 107676184 107640326 107640660 107588816 107485950 107410836 107370889 107370770 107361281 107254708 107072556 106949484
1637.8A06949484j14822j92511k73967l36945k17450q8286k01285k39849j0395J1909
$$ 106949484 106834662 106642151 106368184 106031239 105813789 105725503 105524218 105284369 105273974 105285883
1658.2A05285883o4528j11699r4998r3341j35791k2626J71351K71809K82479J76513
$$ 105285883 105221355 105109656 105014658 104921317 104785526 104762900 104934251 105206060 105488539 105665052
1678.6A05665052K5153j32251k21204j56141j85191k90358l57485n60677p21610q10027
$$ 105665052 105690205 105557954 105336750 105180609 104995418 104705060 104347575 103786898 103065288 102255261
1699A02255261r84943q39817q42214r65124q17180o75810o68573q66020j371991j570076
$$ 102255261 101270318 100430501 99588287 98623163 97805983 97130173 96461600 95595580 94223589 92653513
1719.3I2653513j542288j965779k518594k958787l475213m085785n826253o327516
$$ 92653513 91111225 89145446 86626852 83668065 80192852 76107067 70280814 63953298
1735.7F3953298m789310m653097m118180k408486o88041J179967L492233N697799O632787
$$ 63953298 59163988 54510891 50392711 47984225 47296184 48476151 51968384 57666183 64298970
1754F4298970P282137P477337O502766N523986M111313K758080K027309J504189J204491
$$ 64298970 71581107 79058444 85561210 91085196 95196509 97954589 99981898 101486087 102690578
1772.4A02690578R61720O87898N22518M51147L97551L59238K98786K28250J82199K14398
$$ 102690578 103652298 104340196 104862714 105313861 105711412 106070650 106369436 106597686 106779885 106994283
1792.8A06994283K24424J79398J44052J47093J68180J44815J13857R1076J02711J13904
$$ 106994283 107218707 107398105 107542157 107689250 107857430 108002245 108116102 108207178 108309889 108423793
1813.2A08423793J05834Q7416Q2255P4863N4336N0998M4059N1022P8130Q1539N3370
$$ 108423793 108529627 108617043 108699298 108774161 108828497 108879495 108923554 108974576 109052706 109134245 109187615
1835.6A09187615M1795L1256R191J0920N4252P7737N7411L1340J5247K1338K3973K1470
$$ 109187615 109229410 109260666 109269857 109280777 109335029 109412766 109470177 109501517 109516764 109538102 109562075 109583545
1860.1A09583545J3852j180k0922j1384L1424L9815K3115J0765J2076J5652J3971N722
$$ 109583545 109597397 109596217 109575295 109563911 109595335 109635150 109658265 109669030 109681106 109696758 109710729 109716451
1884.6A09716451J526K718J8120K7144J6427J4317J1897J0014R441K801j0049n722
$$ 109716451 109717977 109720695 109738815 109765959 109782386 109796703 109808600 109818614 109828055 109830856 109820807 109815085
1909A09815085J1802R179j3948k1636R5P260O664R942J967q667o532L683P701M578
$$ 109815085 109826887 109836066 109822118 109800482 109800577 109807837 109814501 109824443 109826410 109817743 109811211 109814894 109822595 109827173
1937.6A09827173r763k2340M172L2949J7906K694M840Q464P414K051O20L242k372q309
$$ 109827173 109817410 109795070 109799242 109832191 109850097 109852791 109857631 109866095 109873509 109875560 109876180 109879422 109877050 109868741
1966.1A09868741K146N817m577o748N01N722O938L326m053j0860j3864j0145J371N245
$$ 109868741 109870887 109876704 109872127 109865379 109865880 109871602 109878540 109881866 109877813 109866953 109853089 109842944 109844315 109849560
1994.7A09849560m887n067J967N61o152j0419o103j323n913j6415k3151k0206j3578
$$ 109849560 109844673 109839606 109841573 109842134 109835982 109825563 109819460 109818137 109812224 109795809 109772658 109752452 109738874
2021.2A09738874p522j2o79o366r06P010P438P809Q368L910K480J1313J6415J3601
$$ 109738874 109731352 109731340 109730661 109724295 109723389 109730399 109737837 109745646 109754014 109757924 109760404 109771717 109788132 109801733
2049.8A09801733J2231R632O462M804J752J717J2707J8526M577q237m89J5736J7988
$$ 109801733 109813964 109823596 109830058 109834862 109836614 109838331 109851038 109869564 109874141 109865904 109865415 109881151 109899139
2076.3A09899139P153O68J0013K1243K0111J6129J3387R429O617L206K861P046O461
$$ 109899139 109906292 109906960 109916973 109938216 109958327 109974456 109987843 109997272 110003889 110007095 110009956 110017002 110023463
2102.8A10023463N662J6225K5582J8477O700J728N246J2386J5449J2779K432n162k432
$$ 110023463 110029125 110045350 110070932 110089409 110096109 110097837 110103083 110115469 110130918 110143697 110146129 110140967 110138535
2129.3A10138535J288K515K158J2l6k384p117n543j276k348m351K74L147J323L219
$$ 110138535 110139823 110142338 110144496 110144508 110144472 110142088 110134971 110129428 110128152 110125804 110121453 110121727 110124874 110126197 110129416
2159.9A10129416J1420J5855R191J192J288R191J2147L398J442J2183J5152J3411J5676
$$ 110129416 110140836 110156691 110165882 110167074 110168362 110177553 110189700 110193098 110194540 110206723 110221875 110235286 110250962
2186.4A10250962J1933M887M864J0943J1754M006O55R060J8442J5724M709j824l219
$$ 110250962 110262895 110267782 110272646 110283589 110295343 110299349 110300004 110309064 110327506 110343230 110347939 110346115 110342896
2212.9A10342896l135m8Q774J5831Q893R54J907j669l576N865Q261K193j78l994p808
$$ 110342896 110339761 110339713 110348487 110364318 110373211 110374165 110376072 110374403 110370827 110376692 110384953 110387146 110386968 110382974 110375166
2243.5A10375166k527L659l707j5807j0276Q392J2339O103N460L278K62J2N96N937
$$ 110375166 110372639 110376298 110372591 110356784 110346508 110354900 110367239 110373342 110378802 110382080 110382342 110382354 110382950 110388887
2272.1A10388887J3339J0646J216m351p785j0586m088O842N865k932n269N459J0634
$$ 110388887 110402226 110412872 110414088 110409737 110401952 110391366 110387278 110394120 110399985 110397053 110391784 110397243 110407877
2298.6A10407877J121k909M875J2517P499P796K1076K2030J6248K0719L9923M9329
$$ 110407877 110408998 110406089 110410964 110423481 110430980 110438776 110459852 110481882 110498130 110518849 110558772 110608101
2323.1A10608101K9421K0158K9814L2592L1567K8562J6654q82q464m518k4057m6348
$$ 110608101 110637522 110657680 110687494 110720086 110751653 110780215 110796869 110795987 110787523 110783005 110758948 110712600
2347.5A10712600j4436N7995J11139Q7559L3820J8417N544l6633n3788m7218o1429
$$ 110712600 110698164 110756159 110867298 110954857 110988677 111007094 111012638 110976005 110922217 110874999 110813570
2370A10813570p2563o0749m2677k5534j0705j383k360p761k968K4j300O533J1492P021
$$ 110813570 110741007 110680258 110637581 110612047 110601342 110599959 110597599 110589838 110586870 110586894 110585594 110592127 110603619 110610640
2398.5A10610640l731j4293j2923j192P248N317R024K0146J8061P796J657l481r048
$$ 110610640 110606909 110592616 110579693 110578501 110585749 110591066 110600090 110620236 110638297 110646093 110647750 110644269 110635221
2425A10635221m101J2708J6224K468j1003j4496o509M77J025M661R060O640K611k158
$$ 110635221 110631120 110643828 110660052 110662520 110651517 110637021 110630512 110630989 110632014 110636675 110645735 110652375 110654986 110652828
2453.6A10652828m613r30J55M17K551J371l6P40J549p248j6808l946N841l147r107
$$ 110652828 110648215 110647285 110647440 110647857 110650408 110651779 110651743 110652483 110654032 110646784 110629976 110626030 110631871 110628724 110619617
2484.2A10619617j3114j4078o724N25r30p462q905j2315j3172j645k790j9646k6702
$$ 110619617 110606503 110592425 110585701 110586226 110585296 110577834 110568929 110556614 110543442 110541797 110539007 110519361 110492659
2510.7A10492659k2495j4115q392j3852j7488j0359p475j0061j3411j3483q320k790
$$ 110492659 110470164 110456049 110447657 110433805 110416317 110405958 110398483 110388422 110375011 110361528 110353208 110350418
2535.2A10350418K480J108n960q631m566l993n996k337k301m184n019j0359j6916j8119
$$ 110350418 110352898 110354006 110348046 110339415 110334849 110330856 110324860 110322523 110320222 110316038 110311019 110300660 110283744 110265625
2563.7A10265625j3066j2243k0122k7096k6966k0742j6046k0206k0694j4150j8168
$$ 110265625 110252559 110240316 110220194 110193098 110166132 110145390 110129344 110109138 110088444 110074294 110056126
2586.2A10056126k5546k3115j4174m935m948j2588j6868k3294l2556k5487j0502j1349
$$ 110056126 110030580 110007465 109993291 109988356 109983408 109970820 109953952 109930658 109898102 109872615 109862113 109850764
2610.6A09850764k0539j8085j5890k6965l1197l0935l6299l3653k2531j7655k3722
$$ 109850764 109830225 109812140 109796250 109769285 109738088 109707153 109670854 109637201 109614670 109597015 109573293
2633.1A09573293k9493k2125p677m756j1242j5497j7285k3807l1292l1054l3843m0663
$$ 109573293 109543800 109521675 109513998 109509242 109498000 109482503 109465218 109441411 109410119 109379065 109345222 109304559
2657.5A09304559m6801n6792o2692o0057m8268k6548p618l791p283m757O497K3592
$$ 109304559 109257758 109200966 109138274 109078217 109029949 109003401 108995783 108991992 108984709 108979952 108986449 109010041
2682A09010041L7086M1604L7777L4285M0066M4632L5179K0790K2220K8134J3542o974
$$ 109010041 109047127 109088731 109126508 109160793 109200859 109245491 109280670 109301460 109323680 109351814 109365356 109358382
2706.5A09358382j3256j3018j0955j0359k0278l3521m1330m9567n6780l3784L648J2493
$$ 109358382 109345126 109332108 109321153 109310794 109290516 109256995 109215665 109166098 109109318 109075534 109079182 109091675
2731A09091675J5271K0337K4724L8159L6216J6153p034j9240L69K8587K2447j1098
$$ 109091675 109106946 109127283 109152007 109190166 109226382 109242535 109235501 109216261 109216630 109245217 109267664 109256566
2755.4A09256566l6455m0257l0374k8122l8647m5741o1023r0015j00875q5545r3472
$$ 109256566 109220111 109179854 109149480 109121358 109082711 109036970 108975947 108885932 108785057 108699512 108606040
2777.9A08606040j34325j50001j47378j62315j75488j68968j63662j80388k06065k19691
$$ 108606040 108471715 108321714 108174336 108012021 107836533 107667565 107503903 107323515 107117450 106897759
2798.3A06897759k18999k28393k58482k95376l31104l52943l69728m22406n08487n86236
$$ 106897759 106678760 106450367 106191885 105896509 105565405 105212462 104842734 104420328 103911841 103325605
2818.7A03325605o57069p48766q63194r92525j154321j367963j641225k033043k648259
$$ 103325605 102668536 101919770 101056576 100064051 98909730 97541767 95900542 93867499 91219240
2837I1219240l553181m734350n989855o888008p059342o353992m715091k282560M31794
$$ 91219240 87666059 82931709 76941854 70053846 62994504 56640512 51925421 49642861 50074655
2855.4E0074655K789730M342931M934174M645628L704828K504229J599592J413858
$$ 50074655 52864385 57207316 62141490 66787118 70491946 72996175 74595767 76009625
2871.7G6009625J756048J944447J578331Q24088J3691o68603j193452j582801j837737
$$ 76009625 77765673 79710120 81288451 82112539 82126230 81457627 80264175 78681374 76843637
2890.1G6843637j976156k035713k055240k089620k176547k308946k478302k701926
$$ 76843637 74867481 72831768 70776528 68686908 66510361 64201415 61723113 59021187
2906.4E9021187k985013l309899l628466l844985l836388l491172k781057j792008
$$ 59021187 56036174 52726275 49097809 45252824 41416436 37925264 35144207 33352199
2922.7C3352199p16129K88159J156926J863244K500823L130138L639630L917265L924802
$$ 33352199 32636070 32924229 34081155 35944399 38445222 41575360 45214990 49132255 53057057
2941E3057057L619951K988422K110767J190126N10883K67554M93377J070231J774144
$$ 53057057 56677008 59665430 61776197 62966323 63477206 63744760 64238137 65308368 67082512
2959.4F7082512K438283K996725L388733L526950L397971L088749K692687K291131
$$ 67082512 69520795 72517520 75906253 79433203 82831174 85919923 88612610 90903741
2975.7I0903741J936293J630270J375103J169348R78041P79658N56922K98673J5575
$$ 90903741 92840034 94470304 95845407 97014755 97992796 98772454 99329376 99628049 99643624
2994.1I9643624l19982p14046j101291j375413j402056j099527n05501K58446J037770
$$ 99643624 99323642 98609596 97508305 96132892 94730836 93631309 93125808 93384254 94422024
3012.4I4422024J652986J966662J969081J758635J455164J153600Q88085O48725M65882
$$ 94422024 96075010 98041672 100010753 101769388 103224552 104378152 105266237 105914962 106380844
3030.8A06380844L58129L00455K58910J94228J28090J03379J12426J23274J05787Q8751
$$ 106380844 106738973 107039428 107298338 107492566 107620656 107724035 107836461 107959735 108065522 108154273
3051.2A08154273R9063J01805R5021P9287M4572K6953L4332N8043J01006J23549R9289
$$ 108154273 108253336 108355141 108450162 108529449 108574021 108600974 108635306 108693349 108794355 108917904 109017193
3073.6A09017193N9247M3440N4610O0356N6672O3312O0653M5920M7350M9555L0482
$$ 109017193 109076440 109119880 109174490 109234846 109291518 109354830 109415483 109461403 109508753 109558308 109588790
3096A09588790J07q261J8632K4534j8966l7885P772L8100J2087o508J2493M9901P5984
$$ 109588790 109588897 109580636 109599268 109623802 109604836 109566951 109574723 109612823 109624910 109618402 109630895 109680796 109756780
3122.6A09756780O4981L2341J0681K0945L6943J3268k6750k7180J0049K9564J9336
$$ 109756780 109821761 109854102 109864783 109885728 109922671 109935939 109909189 109882009 109892058 109921622 109940958
3145A09940958N007j7953k5857J5891N4562M5121K5117J4270Q857Q809P797R358Q726
$$ 109940958 109945965 109928012 109902155 109918046 109972608 110017729 110042846 110057116 110065973 110074782 110082579 110091937 110100663
3171.5A10100663r6p689m458O437P177m590l052J0026J3268J2433O664K003J2326J4186
$$ 110100663 110100567 110092878 110088420 110094857 110102034 110097444 110094392 110104418 110117686 110130119 110136783 110138786 110151112 110165298
3200.1A10165298M566K908J252N114J7023J5247O294J514m387L481J8025J7154P260
$$ 110165298 110169864 110172772 110174024 110179138 110196161 110211408 110217702 110219216 110214829 110218310 110236335 110253489 110260749
3226.6A10260749j4246m3630m1068J4496O0499M7743J4663j4031l3987k3341J4413
$$ 110260749 110246503 110202873 110161805 110176301 110236800 110284543 110299206 110285175 110251188 110227847 110242260
3249A10242260L6180J6343j0157k610R036l159m816K02k6977o0880l6979K2054M6516
$$ 110242260 110278440 110294783 110284626 110282016 110291052 110287893 110283077 110283279 110256302 110195422 110158443 110180497 110227013
3275.5A10227013L1852P439k313J324J0883J920m2141m8292j299K4819L2259K9659
$$ 110227013 110258865 110266304 110263991 110265315 110276198 110278118 110235977 110187685 110186386 110211205 110243464 110273123
3300A10273123j3793o7198o6304l064O0892O2919K4855J5211K2912m363m2903l7563
$$ 110273123 110259330 110192132 110125828 110122764 110183656 110246575 110271430 110286641 110309553 110305190 110262287 110224724
3324.5A10224724M732K6620J4984O462j3340n3680m2140J4138M0257L3522p082n3989
$$ 110224724 110229456 110256076 110271060 110277522 110264182 110210502 110168362 110182500 110222757 110256279 110249197 110195208
3348.9A10195208l0363L6144M7267K336l4094l0410j7345m7386p1549j7703N8282O6161
$$ 110195208 110164845 110200989 110248256 110250592 110216498 110186088 110168743 110121357 110049808 110032105 110090387 110156548
3373.4A10156548K0874q738r108O437J7250k39l6835o9022m5956K7192L1972l8183
$$ 110156548 110177422 110168684 110159576 110166013 110183263 110183024 110146189 110077167 110031211 110058403 110090375 110052192
3397.9A10052192o0928K158O4337M5646j1528m0662k3878K7299N7292K6858j3745k2840
$$ 110052192 109991264 109993422 110057759 110103405 110091877 110051215 110027337 110054636 110111928 110138786 110125041 110102201
3422.4A10102201k6572m6075o5589m5573l0232n5027k9230M9269P2730K2066l9804
$$ 110102201 110075629 110029554 109963965 109918392 109888160 109833133 109803903 109853172 109925902 109947968 109908164
3444.8A09908164n4801l0267k4092k8432k7776n5611r5558p9834m8423j00291j42026
$$ 109908164 109853363 109823096 109799004 109770572 109742796 109687185 109591627 109511793 109463370 109363079 109221053
3467.2A09221053k0456J52266J57630L6204n8591l1281J08874J42312L8135K2483P2289
$$ 109221053 109200597 109352863 109510493 109546697 109488106 109456825 109565699 109708011 109746146 109768629 109840918
3489.7A09840918L1662m7112o9869l9362l6109o0391K9897J18721M6897n7602j05131
$$ 109840918 109872580 109825468 109755599 109716237 109680128 109619737 109649634 109768355 109815252 109757650 109652519
3512.1A09652519p3182p022k563m8864r4926o9439K4247N8627K2471j4901l9173j2540
$$ 109652519 109579337 109572315 109569752 109520888 109425962 109356523 109380770 109439397 109461868 109446967 109407794 109395254
3536.6A09395254M2033L1781j5044r585N8341J04177R0266Q0764Q7023P4017L7932
$$ 109395254 109437287 109469068 109454024 109444439 109502780 109606957 109697223 109777987 109865010 109939027 109976959
3559A09976959K2745L9721M2248O6304J12903J14465R4533O7651M1246K4879P04l5429
$$ 109976959 109999704 110039425 110081673 110147977 110260880 110375345 110469878 110537529 110578775 110603654 110604358 110568929
3583.5A10568929k6667N8496P4720n639k8646k74J1671L6669P8415P4602M5764N3060
$$ 110568929 110542262 110600758 110675478 110669839 110641193 110640919 110652590 110689259 110767674 110842276 110888040 110941100
3608A10941100O1095L2616J6522K4009M3070N8055L7920o973m1545R144Q5270N5182
$$ 110941100 111002195 111034811 111051333 111075342 111118412 111176467 111214387 111207414 111165869 111175013 111260283 111315465
3632.4A11315465K4462K2399J5962J3387M65n1486q8525k7931P5496P0941K0838J6725
$$ 111315465 111339927 111362326 111378288 111391675 111392140 111340654 111252129 111224198 111299694 111370635 111391473 111408198
3656.9A11408198L0255M4465M7231j216m8125j9967P450k2483J3233N6708L6978K8718
$$ 111408198 111438453 111482918 111530149 111528933 111480808 111460841 111468291 111445808 111459041 111515749 111552727 111581445
3681.4A11581445J061n6517p8655M888Q6748O0535K5272J0884J991K1171J7214l4451
$$ 111581445 111582506 111525989 111447334 111452222 111538970 111599505 111624777 111635661 111637652 111658823 111676037 111641586
3705.9A11641586p0477n0056M3154Q0419K3126k2638k9671r084J3459Q142k1362m3810
$$ 111641586 111571109 111521053 111564207 111644626 111667752 111645114 111615443 111606359 111619818 111627960 111606598 111562788
3730.3A11562788n7089l4284L0851L4130k1828k7966K7561J1814k1184K5511M1616
$$ 111562788 111505699 111471415 111502266 111536396 111514568 111486602 111514163 111525977 111504793 111530304 111571920
3752.8A11571920j0479k7668K7037O0689J5032k1147l2342o556M3690L4833j0014m3189
$$ 111571920 111561441 111533773 111560810 111621499 111636531 111615384 111583042 111576486 111620176 111655009 111644995 111601806
3777.3A11601806k1267K4044J7119J2207K3639J0824r107k2126k2411k5880k5297J9265
$$ 111601806 111580539 111604583 111621702 111633909 111657548 111668372 111659265 111637139 111614728 111588848 111563551 111582816
3801.7A11582816K0539o723J7548K7072r763l7921j5485k2185k7466K5106J0002j6821
$$ 111582816 111603355 111596632 111614180 111641252 111631489 111593568 111578083 111555898 111528432 111553538 111563540 111546719
3826.2A11546719K146J6081q94m7099m7744K6429N9914L6788K1339Q154k4736o1631
$$ 111546719 111548865 111564946 111564052 111516953 111469209 111495638 111555552 111592340 111613679 111621833 111597097 111535466
3850.7A11535466l10J03020M1271k7931l9315p725K1243j1885j5593J4079J2731K7335
$$ 111535466 111535156 111638176 111679447 111651516 111612201 111604476 111625719 111613834 111598241 111612320 111625051 111652386
3875.2A11652386R680j7750o283j8227q571K1863J3387J6654J8203j4388l5823l0422
$$ 111652386 111662066 111644316 111638033 111619806 111611235 111633098 111646485 111663139 111681342 111666954 111631131 111600709
3899.6A11600709q917L4165O4040M0459L684j8430k5832m399J3268o283j2302R966
$$ 111600709 111591792 111625957 111689997 111730456 111734140 111715710 111689878 111685479 111698747 111692464 111680162 111690128
3924.1A11690128J5664n031k2173j7547m506Q666K4235J8371k659r906j1301l922J1098
$$ 111690128 111705792 111700761 111678588 111661041 111656535 111665201 111689436 111707807 111705148 111695242 111683941 111680019 111691117
3950.6A11691117Q869j084K610L589q071q488M089R251m554k0742j4115r5O91J467
$$ 111691117 111699986 111698902 111701512 111705101 111697030 111688542 111692631 111701882 111697328 111676586 111662471 111662376 111663067 111664534
3979.2A11664534R894L374j1242q678p117o473O616Q118j67
$$ 111664534 111674428 111677802 111666560 111657882 111650765 111644292 111650908 111659026 111658859
3997.5A11658859
$$ 111658859
##END=$$ End of the data block
