##TITLE=$$ Begin of the data block
##JCAMP-DX=5.00 $$ ACD/SpecManager v 10.08
##SPECTROMETER/DATA SYSTEM=Alpha
##DATE=27 Jun 2014 15:13:00
##DATA TYPE=INFRARED SPECTRUM
##DATA CLASS=XYDATA
##ORIGIN=
##OWNER=
##NPOINTS=1667
##FIRSTX=599.63549805
##LASTX=3997.56909180
##MAXX=3997.56909180
##MINX=599.63549805
##MAXY=1.11730087
##MINY=0.33250251
##XFACTOR=1.0000000000
##YFACTOR=0.000000010000000
##FIRSTY=1.04365015
##DELTAX=2.03957605
##XUNITS=1/CM
##YUNITS=ARBITRARY UNITS
##XYDATA=(X++(Y..Y))
$$ plain form
599.6 104365015 104356492 104468191 104606402 104770017 104917562 105015981 105131078 105310631 105458617 105516243
620 105516243 105557132 105604565 105657721 105723393 105749714 105728674 105714107 105698168 105634093 105546236 105486643 105457103
644.5 105457103 105432820 105387294 105325973 105276501 105226982 105138743 104989195 104810846 104658723 104538691 104380393
666.9 104380393 104144335 103949094 103766096 103528202 103244901 102959704 102687657 102438450 102238321 102053761
687.3 102053761 101846921 101639211 101439095 101209176 100925851 100565696 100082934 99404681 98444057 97226852
707.7 97226852 95973039 94935721 94127125 93398690 92724818 92281246 92334360 92960572 93947417 95032334
728.1 95032334 96062189 97009540 97913218 98783213 99594992 100326359 100980496 101578403 102126813 102599442
748.5 102599442 103004324 103374135 103675723 103875947 104010844 104147363 104334998 104552829 104729450 104857981
$$ packed form
599.6A04365015q523J11699J38211J63615J47545R8419J15097J79553J47986N7626
620A05516243M0889M7433N3156O5672K6321k1040j4567j5939o4075q7857n9593k9540
644.5A05457103k4283m5526o1321m9472m9519q8239j49548j78349j52123j20032j58298
666.9A04380393k36058j95241j82998k37894k83301k85197k72047k49207k00129j84560
687.3A02053761k06840k07710k00116k29919k83325l60155m82762o78253r60624j217205
707.7I7226852j253813j037318q08596p28435o73872m43572N3114O26212R86845J084917
728.1I5032334J029855R47351R03678Q69995Q11779P31367O54137N97907N48410M72629
748.5A02599442M04882L69811L01588K00224J34897J36519J87635K17831J76621J28531
$$ plain form
768.9 104857981 104991305 105140042 105277622 105413532 105564904 105704224 105826032 105951464 106087923 106220675
789.3 106220675 106326258 106404626 106441879 106422865 106379449 106333125 106258929 106155181 106054854 105968785 105880749
811.7 105880749 105786347 105703437 105632031 105558932 105507517 105508196 105523729 105484927 105366051 105193555 105026174
834.2 105026174 104914069 104848897 104787946 104725981 104680979 104660797 104687190 104772627 104869270 104923332 104933476
856.6 104933476 104906654 104840589 104749703 104654264 104552877 104424036 104261398 104099202 104001641 104006445 104073572
879.1 104073572 104125702 104147077 104191649 104276216 104359388 104392946 104307842 104044199 103704774 103511775 103486300
901.5 103486300 103500175 103510416 103476298 103372753 103261852 103202391 103190947 103183019 103123450 102973664 102769327
923.9 102769327 102618194 102614057 102766359 102970755 103083432 103064120 102997518 102974474 102994287 102999306 102956128
$$ packed form
768.9A04857981J33324J48737J37580J35910J51372J39320J21808J25432J36459J32752
789.3A06220675J05583P8368L7253j9014m3416m6324p4196j03748j00327q6069q8036
811.7A05880749r4402q2910p1406p3099n1415O79J5533l8802j18876j72496j67381
834.2A05026174j12105o5172o0951o1965m5002k0182K6393Q5437R6643N4062J0144
856.6A04933476k6822o6065r0886r5439j01387j28841j62638j62196r7561M804O7127
879.1A04073572N2130K1375M4572Q4567Q3172L3558q5104k63643l39425j92999k5475
901.5A03486300J3875J0241l4118j03545j10901n9461j1444p928n9569j49786k04337
923.9A02769327j51133m137J52302K04396J12677j9312o6602k3044J9813N019m3178
$$ plain form
946.4 102956128 102857125 102699244 102505112 102317703 102161098 102045834 101979339 101952660 101944566 101928771 101887596
968.8 101887596 101814318 101700687 101553607 101423538 101373041 101393998 101432383 101492500 101599610 101721346 101806498
991.2 101806498 101830995 101804042 101745772 101656783 101527882 101358330 101151431 100908911 100687361 100596106 100612521
1013.7 100612521 100564802 100373733 100130236 99946272 99836314 99754137 99684852 99663502 99701124 99722368 99607199
1036.1 99607199 99240285 98602003 97921193 97568685 97638607 97886205 98121524 98311436 98444283 98514438
1056.5 98514438 98528516 98531437 98588145 98682994 98723948 98665655 98532033 98321468 97983366 97479355 96799761
1078.9 96799761 95963442 95040083 94100064 93161726 92232150 91335738 90504676 89788014 89258355 88982779
1099.3 88982779 88970888 89164376 89463019 89731300 89820486 89660168 89316803 88960487 88799614 88979143
$$ packed form
946.4A02956128r9003j57881j94132j87409j56605j15264o6495k6679q094j5795m1175
968.8A01887596p3278j13631j47080j30069n0497K0957L8385O0117J07110J21736Q5152
991.2A01806498K4497k6953n8270q8989j28901j69552k06899k42520k21550r1255J6415
1013.7A00612521m7719j91069k43497j83964j09958q2177o9285k1350L7622K1244j15169
1036.1I9607199l66914o38282o80810l52508O9922K47598K35319J89912J32847P0155
1056.5I8514438J4078K921N6708R4849M0954n8293j33622k10565l38102n04011o79594
1078.9I6799761q36319r23359r40019r38338r29576q96412q31062p16662n29659k75576
1099.3H8982779j1891J93488K98643K68281Q9186j60318l43365l56316j60873J79529
$$ plain form
1119.7 88979143 89486313 90129387 90598553 90623242 90158355 89292908 88009214 86302823 84382379
1138.1 84382379 82550174 80998760 79744071 78678000 77669150 76643789 75592577 74546248
1154.4 74546248 73576742 72776026 72205740 71878046 71769232 71846682 72083831 72476256 73065734 73890054
1174.8 73890054 74910617 76067877 77328765 78628558 79881102 81034386 82069820 82987821 83805776
1193.1 83805776 84560490 85298586 86034715 86732072 87334055 87805587 88149875 88387942 88551646 88676828
1213.5 88676828 88783151 88863796 88875663 88775128 88564891 88283378 87977958 87692434 87439609 87203515
1233.9 87203515 86999166 86890334 86936289 87153119 87529063 88032436 88596570 89133984 89584947 89938247
1254.3 89938247 90223056 90485370 90742481 90974343 91164929 91338503 91540051 91772801 91995353 92185682
$$ packed form
1119.7H8979143N07170O43074M69166K4689m64887q65447j283694j706391j920444
1138.1H4382379j832205j551414j254689j066071j008850j025361j051212j046329
1154.4G4546248r69506q00716n70286l27694j08814P7450K37149L92425N89478Q24320
1174.8G3890054J020563J157260J260888J299793J252544J153284J035434R18001Q17955
1193.1H3805776P54714P38096P36129O97357O01983M71532L44288K38067J63704J25182
1213.5H8676828J06323Q0645J1867j00535k10237k81513l05420k85524k52825k36094
1233.9H7203515k04349j08832M5955K16830L75944N03373N64134N37414M50963L53300
1254.3H9938247K84809K62314K57111K31862J90586J73574K01548K32750K22552J90329
$$ plain form
1274.7 92185682 92352146 92517489 92738056 93086988 93565047 94074482 94507909 94818890 95034444 95199555
1295.1 95199555 95318967 95392853 95478189 95649815 95898515 96148121 96364701 96561110 96734923 96865374
1315.5 96865374 96948475 97034425 97187322 97411114 97664714 97897303 98056823 98099077 98006475 97792935
1335.9 97792935 97494411 97194481 96989202 96849459 96695054 96513140 96327078 96156996 96006161 95882392
1356.3 95882392 95797729 95736337 95670855 95609981 95548248 95469952 95335132 94935483 94144344 93423718 93427765
1378.7 93427765 94269401 95499426 96669298 97678322 98485982 99008751 99259490 99347931 99484324
1397.1 99484324 99813849 100320101 100871921 101326537 101487970 101194286 100437021 99455422 98608130 98141277
1417.5 98141277 98225248 98660791 98995590 98994875 98570311 97727233 96715641 95759565 94697750 93655092
$$ packed form
1274.7I2185682J66464J65343K20567L48932M78059N09435M33427L10981K15554J65111
1295.1I5199555J19412P3886Q5336J71626K48700K49606K16580J96409J73813J30451
1315.5I6865374Q3101Q5950J52897K23792K53600K32589J59520M2254r2602k13540
1335.9I7792935k98524k99930k05279j39743j54405j81914j86062j70082j50835j23769
1356.3I5882392q4663o1392o5482o0874o1733p8296j34820l99649p91139p20626M047
1378.7I3427765Q41636J230025J169872J009024Q07660N22769K50739Q8441J36393
1397.1I9484324L29525N06252N51820M54616J61433k93684p57265r81599q47292m66853
1417.5I8141277Q3971M35543L34799p15m24564q43078j011592r56076j061815j042658
$$ plain form
1437.9 93655092 92939973 92313308 91640216 90917307 90034717 88942015 87598336 86056936 84367985
1456.2 84367985 83140302 82768953 82419622 81764662 81981701 84415942 88989604 94719428 99093515
1474.6 99093515 101397812 102768362 103766322 104551184 105129695 105531394 105841672 106124949 106328034
1493 106328034 106378794 106289411 106211793 106314766 106534457 106736326 106943929 107172966 107331216 107404089 107413590
1515.4 107413590 107422757 107462299 107531857 107634902 107724214 107802689 107859373 107859397 107847738 107855248 107796156 107671404
1539.9 107671404 107630873 107650065 107663274 107655418 107635963 107634306 107642210 107617426 107598233 107749426 107905138 107956314
1564.3 107956314 107968438 107985997 108041930 108103538 108118176 108148193 108218944 108258390 108262253 108258665 108251572 108241320
1588.8 108241320 108229148 108209074 108179057 108138013 108076787 107994795 107924128 107886124 107881200 107904053 107937372 107933319
$$ packed form
1437.9I3655092p15119o26665o73092p22909q82590j092702j343679j541400j688951
1456.2H4367985j227683l71349l49331o54960K17039K434241M573662N729824M374087
1474.6I9093515K304297J370550R97960P84862N78511M01699L10278K83277K03085
1493A06328034N0760q9383p7618J02973K19691K01869K07603K29037J58250P2873R501
1515.4A07413590R167L9542O9558J03045Q9312P8475N6684K4j1659P510n9092j24752
1539.9A07671404m0531J9192J3209p856j9455j657P904k4784j9193J51193J55712N1176
1564.3A07956314J2124J7559N5933O1608J4638L0017P0751L9446L863l588p093j0252
1588.8A08241320j2172k0074l0017m1044o1226q1992p0667l8004m924K2853L3319m053
$$ plain form
1613.3 107933319 107874143 107832074 107827818 107774985 107678270 107606757 107557118 107538021 107514513 107411480 107241094
1635.7 107241094 107109928 106975806 106769407 106492138 106161368 105947590 105859613 105662310 105420351 105396223
1656.1 105396223 105395937 105329263 105220377 105120230 105021322 104888129 104866064 105029774 105289137 105555165 105719960
1678.6 105719960 105742061 105605519 105365062 105193925 105007041 104715669 104358613 103801775 103087437 102284944
1699 102284944 101297736 100455749 99612904 98643011 97827595 97164851 96513689 95661914 94299060 92731529
1719.3 92731529 91195351 89250779 86765862 83847100 80417025 76381886 70619476 64356291
1735.7 64356291 59621382 55022377 50941116 48546770 47867033 49049643 52523172 58177072 64754808
1754 64754808 71972519 79379666 85816139 91278815 95347887 98080927 100084734 101560020 102726912
$$ packed form
1613.3A07933319n9176m2069m256n2833r6715p1513m9639j9097k3508j03033j70386
1635.7A07241094j31166j34122k06399k77269l30770k13778q7977j97303k41959k4128
1656.1A05396223k86o6674j08886j00147r8908j33193k2065J63710K59363K66028J64795
1678.6A05719960K2101j36542k40457j71137j86884k91372l57056n56838p14338q02493
1699A02284944r87208q41987q42845r69893q15416o62744o51162q51775j362854j567531
1719.3I2731529j536178j944572k484917k918762l430075m035139n762410o263185
1735.7F4356291m734909m599005m081261k394346o79737J182610L473529N653900O577736
1754F4754808P217711P407147O436473N462676M069072K733040K003807J475286J166892
$$ plain form
1772.4 102726912 103654957 104322195 104833567 105276763 105659604 105998528 106281829 106502879 106680703 106893742
1792.8 106893742 107121587 107298863 107432151 107563448 107717168 107857549 107972336 108060658 108158791 108269274
1813.2 108269274 108372509 108460069 108540940 108613110 108670855 108725083 108767736 108817923 108897507 108979797 109030116
1835.6 109030116 109070981 109109080 109125412 109134269 109181738 109253490 109305167 109338975 109362316 109386182 109407783 109426212
1860.1 109426212 109442377 109450805 109438503 109427691 109456170 109500098 109530246 109542966 109556413 109575701 109595132 109609854
1884.6 109609854 109618461 109624767 109645903 109674704 109693670 109712911 109731960 109746933 109755611 109759569 109757209 109758294 109769344
1911.1 109769344 109775198 109764612 109756601 109772646 109787476 109792316 109797728 109802270 109804356 109807515 109811175 109812403 109813488
1937.6 109813488 109804738 109787357 109798741 109836781 109859025 109864497 109870470 109880924 109886408 109883630 109884667 109892786 109895527
$$ packed form
1772.4A02726912R28045O67238N11372M43196L82841L38924K83301K21050J77824K13039
1792.8A06893742K27845J77276J33288J31297J53720J40381J14787Q8322R8133J10483
1813.2A08269274J03235Q7560Q0871P2170N7745N4228M2653N0187P9584Q2290N0319
1835.6A09030116M0865L8099J6332Q857M7469P1752N1677L3808K3341K3866K1601J8429
1860.1A09426212J6165Q428j2302j0812K8479M3928L0148J2720J3447J9288J9431J4722
1884.6A09609854Q607O306K1136K8801J8966J9241J9049J4973Q678L958k360J085J1050
1911.1A09769344N854j0586q011J6045J4830M840N412M542K086L159L660J228J085
1937.6A09813488q750j7381J1384L8040K2244N472N973J0454N484k778J037Q119K741
$$ plain form
1964.1 109895527 109891033 109892857 109899580 109904349 109907234 109910429 109916627 109921765 109915459 109903467 109897029 109892762 109887660 109888065
1992.6 109888065 109892011 109886277 109876275 109871614 109871435 109872854 109873569 109875393 109873724 109861040 109837210 109809220 109786153
2019.2 109786153 109774888 109777236 109783995 109781229 109772944 109772134 109774554 109776556 109782386 109787989 109793186 109801972 109811199 109815693
2047.7 109815693 109819126 109830630 109843934 109846795 109844780 109844184 109843791 109852624 109868240 109870410 109860086 109857666 109867525 109878135
2076.3 109878135 109881425 109880424 109889495 109913588 109940994 109961247 109972119 109976685 109978318 109979689 109984767 109990096 109989905
2102.8 109989905 109989834 109998786 110014498 110025299 110032129 110042632 110055292 110065103 110065866 110059321 110056436 110060585 110063493 110059631
2131.3 110059631 110055447 110057080 110059166 110056555 110051107 110046506 110042691 110039461 110032618 110022008 110022712 110031474 110031486 110027015 110033464
2161.9 110033464 110051262 110063982 110064244 110062528 110066247 110078311 110093284 110099983 110106707 110118115 110128653 110141265 110154319
$$ packed form
1964.1A09895527m494J824O723M769K885L195O198N138o306j1992o438m267n102M05
1992.6A09888065L946n734j0002m661j79J419P15J824j669j2684k3830k7990k3067
2019.2A09786153j1265K348O759k766q285q10K420K002N830N603N197Q786R227M494
2047.7A09815693L433J1504J3304K861k015n96l93Q833J5616K170j0324k420R859J0610
2076.3A09878135L290j001R071K4093K7406K0253J0872M566J633J371N078N329j91
2102.8A09989905p1Q952J5712J0801O830J0503J2660R811P63o545k885M149K908l862
2131.3A10059631m184J633K086k611n448m601l815l230o843j0610P04Q762J2m471O449
2161.9A10033464J7798J2720K62j716L719J2064J4973O699O724J1408J0538J2612J3054
$$ plain form
2188.4 110154319 110158789 110157514 110163832 110177088 110184801 110186291 110194516 110212660 110227942 110231221 110228992 110228634 110231626 110240102
2217 110240102 110254276 110268748 110273504 110271931 110276902 110283363 110284328 110287094 110291219 110294497 110299802 110303342 110302973 110304856 110312045
2247.6 110312045 110314620 110308278 110305285 110315931 110329926 110333920 110332417 110335279 110343993 110350943 110352671 110354257 110361767 110373569
2276.1 110373569 110383403 110389686 110396743 110402095 110399437 110395968 110396862 110397279 110397887 110407722 110418463 110416961 110417271 110426664 110441196
2306.7 110441196 110456467 110463762 110476339 110510695 110548925 110574818 110606205 110644531 110672832 110702670 110742259 110776377
2331.2 110776377 110794413 110807061 110825074 110843432 110856712 110853326 110820162 110780025 110777295 110845196 110965407 111053896
2355.7 111053896 111092949 111125183 111128581 111076593 111009967 110961068 110915565 110866988 110820854 110776615 110744286 110733068
2380.2 110733068 110736012 110741377 110744119 110747850 110748041 110742843 110744798 110753906 110760927 110763454 110760391 110755515 110758626 110767674
$$ packed form
2188.4A10154319M470j275O318J3256P713J490Q225J8144J5282L279k229l58K992Q476
2217A10240102J4174J4472M756j573M971O461R65K766M125L278N305L540l69J883P189
2247.6A10312045K575o342k993J0646J3995L994j503K862Q714O950J728J586P510J1802
2276.1A10373569R834O283P057N352k658l469Q94M17O08R835J0741j502L10R393J4532
2306.7A10441196J5271P295J2577L4356L8230K5893L1387L8326K8301K9838L9589L4118
2331.2A10776377J8036J2648J8013J8358J3280l386l3164m0137k730O7901J20211Q8489
2355.7A11053896L9053L2234L398n1988o6626m8899m5503m8577m6134m4239l2329j1218
2380.2A10733068K944N365K742L731J91n198J955R108P021K527l063m876L111R048
$$ plain form
2408.7 110767674 110779965 110798430 110812581 110818028 110823226 110828972 110831368 110829687 110832047 110846865 110863340 110868335 110864258
2435.2 110864258 110858643 110852873 110846996 110848606 110862720 110880756 110890615 110893083 110890675 110883510 110879421 110878038 110878098 110886467
2463.8 110886467 110895538 110897493 110899127 110898924 110889673 110877585 110876107 110880065 110875070 110864222 110851943 110839367 110833740
2490.3 110833740 110833776 110830581 110824358 110816813 110803461 110790539 110787547 110787261 110777867 110755193 110725796 110700679 110684502
2516.8 110684502 110673821 110662079 110643852 110621548 110606563 110597408 110590231 110588932 110588074 110583460 110579431 110577178 110569227
2543.3 110569227 110558248 110553837 110550416 110543907 110537910 110530293 110516572 110502481 110492325 110480976 110466325 110444915
2567.8 110444915 110415924 110387290 110360897 110336614 110318065 110297537 110274231 110262537 110253203 110229266 110197234 110172141
2592.3 110172141 110161066 110148990 110125232 110103381 110080421 110047948 110023797 110013711 110002744 109984255 109960282
$$ packed form
2408.7A10767674J2291J8465J4151N447N198N746K396j681K360J4818J6475M995m077
2435.2A10864258n615n770n877J610J4114J8036R859K468k408p165m089j383O0Q369
2463.8A10886467R071J955J634k03r251j2088j478L958m995j0848j2279j2576n627
2490.3A10833740L6l195o223p545j3352j2922k992k86r394k2674k9397k5117j6177
2516.8A10684502j0681j1742j8227k2304j4985r155p177j299q58m614m029k253p951
2543.3A10569227j0979m411l421o509n997p617j3721j4091j0156j1349j4651k1410
2567.8A10444915k8991k8634k6393k4283j8549k0528k3306j1694r334k3937l2032k5093
2592.3A10172141j1075j2076k3758k1851k2960l2473k4151j0086j0967j8489k3973
$$ plain form
2614.7 109960282 109929991 109894216 109861827 109830594 109791529 109753430 109730589 109717059 109693730 109659231 109630835
2637.1 109630835 109612262 109593296 109576964 109567070 109553826 109526944 109487724 109450281 109415138 109370732 109316516 109253454
2661.6 109253454 109187782 109131861 109091961 109069490 109056723 109041357 109021282 109002841 108996010 109009993 109043705 109084177
2686.1 109084177 109116077 109143817 109182966 109230709 109268737 109287393 109303033 109329939 109353364 109353578 109332383 109306848
2710.6 109306848 109288287 109270155 109242380 109208083 109169257 109121633 109066188 109024894 109014177 109024322 109049499
2733 109049499 109077239 109100497 109129322 109156346 109169114 109162176 109146142 109148872 109168017 109176505 109163618 109136105
2757.5 109136105 109104645 109072900 109037197 108998656 108959150 108902657 108814132 108711267 108624911 108540344 108418787
2779.9 108418787 108271837 108117962 107948112 107771659 107605696 107441545 107260287 107058179 106848562 106640589
$$ packed form
2614.7A09960282l0291l5775l2389l1233l9065l8099k2841j3530k3329l4499k8396
2637.1A09630835j8573j8966j6332r894j3244k6882l9220l7443l5143m4406n4216o3062
2661.6A09253454o5672n5921l9900k2471j2767j5366k0075j8441o831J3983L3712M0472
2686.1A09084177L1900K7740L9149M7743L8028J8656J5640K6906K3425K14k1195k5535
2710.6A09306848j8561j8132k7775l4297l8826m7624n5445m1294j0717J0145K5177
2733A09049499K7740K3258K8825K7024J2768o938j6034K730J9145Q488j2887k7513
2757.5A09136105l1460l1745l5703l8541l9506n6493q8525j02865q6356q4567j21557
2779.9A08418787j46950j53875j69850j76453j65963j64151j81258k02108k09617k07973
$$ plain form
2800.3 106640589 106419623 106168568 105879521 105548298 105191255 104820430 104401040 103896654 103317821 102672601
2820.7 102672601 101935399 101080799 100095057 98952168 97603643 95980346 93961531 91335642 87822038
2839.1 87822038 83144867 77222741 70406526 63421118 57134020 52462983 50197506 50626564 53396928
2857.4 53396928 57701367 62582392 67183065 70865875 73354614 74933773 76323539 78045350
2873.7 78045350 79958326 81526387 82350022 82365030 81700850 80516416 78954208 77141684 75193191
2892.1 75193191 73186266 71147722 69068098 66906285 64616978 62157738 59478158 56527257
2908.4 56527257 53257358 49669284 45857251 42035520 38546383 35764530 33968696 33250251 33545077
2926.8 33545077 34711495 36576536 39066893 42177951 45797342 49691397 53585708 57174528
$$ packed form
2800.3A06640589k20966k51055k89047l31223l57043l70825m19390n04386n78833o45220
2820.7A02672601p37202q54600r85742j142889j348525j623297k018815k625889l513604
2839.1H7822038m677171n922126o816215o985408o287098m671037k265477M29058K770364
2857.4E3396928M304439M881025M600673L682810K488739J579159J389766J721811
2873.7G8045350J912976J568061Q23635J5008o64180j184434j562208j812524j948493
2892.1G5193191k006925k038544k079624k161813k289307k459240k679580k950901
2908.4E6527257l269899l588074l812033l821731l489137k781853j795834p18445K94826
2926.8C3545077J166418J865041K490357L111058L619391L894055L894311L588820
$$ plain form
2943.1 57174528 60138726 62230164 63406104 63908368 64169508 64659625 65722722 67471647 69870341
2961.4 69870341 72831303 76191694 79689664 83055747 86110944 88774502 91045064 92961413
2977.8 92961413 94568419 95927811 97090292 98061055 98831064 99376255 99667209 99687642 99380082
2996.1 99380082 98679131 97593248 96230698 94833171 93735659 93232644 93492156 94524616 96161765
3014.5 96161765 98113018 100077724 101837039 103284454 104417908 105289257 105938327 106411350 106768334
3032.8 106768334 107065785 107326066 107516754 107637393 107737482 107850182 107974684 108086717 108183634 108285499
3053.2 108285499 108390057 108487689 108566439 108609438 108628309 108651686 108714187 108827972 108955133 109052765 109104133
3075.7 109104133 109137237 109194112 109263992 109323120 109381247 109440482 109494150 109545863 109589076 109609437 109601068 109592414
$$ packed form
2943.1E7174528K964198K091438J175940N02264K61140M90117J063097J748925K398694
2961.4F9870341K960962L360391L497970L366083L055197K663558K270562J916349
2977.8I2961413J607006J359392J162481R70763P70009N45191K90954K0433l07560
2996.1I9380082p00951j085883j362550j397527j097512n03015K59512J032460J637149
3014.5I6161765J951253J964706J759315J447415J133454Q71349O49070M73023L56984
3032.8A06768334K97451K60281J90688J20639J00089J12700J24502J12033R6917J01865
3053.2A08285499J04558R7632P8750M2999J8871K3377O2501J13785J27161R7632N1368
3075.7A09104133L3104N6875O9880N9128N8127N9235N3668N1713M3213K0361q369q654
$$ plain form
3100.1 109592414 109620357 109657252 109648883 109608448 109599507 109626734 109632576 109618866 109637022 109696484 109768164 109823895
3124.6 109823895 109855664 109871602 109891891 109918153 109922099 109896195 109876394 109896457 109934199 109961450 109976518 109958005
3149.1 109958005 109918141 109922969 109975803 110023379 110048187 110060084 110071325 110087562 110102642 110109830 110110462 110113430
3173.5 110113430 110122228 110126734 110124218 110125172 110123551 110118353 110123003 110137320 110154140 110161889 110163426 110172236 110179615 110184002
3202.1 110184002 110186756 110183477 110193336 110215056 110222185 110216367 110216880 110228181 110244703 110263026 110280621 110292852 110283756
3228.6 110283756 110243130 110198414 110204208 110261214 110308897 110324216 110318255 110292232 110267997 110284591 110327566 110340989
3253.1 110340989 110325408 110323966 110337090 110341692 110339260 110333681 110302973 110239553 110204089 110235488 110287547 110314858
3277.6 110314858 110313654 110305107 110305095 110314894 110314918 110272801 110216081 110196733 110216188 110257435 110293424 110276079 110196674
$$ packed form
3100.1A09592414K7943L6895q369m0435q941K7227N842j3710J8156N9462P1680N5731
3124.6A09823895L1769J5938K0289K6262L946k5904j9801K0063L7742K7251J5068j8513
3149.1A09958005l9864M828N2834M7576K4808J1897J1241J6237J5080P188O32K968
3173.5A10113430Q798M506k516R54j621n198M650J4317J6820P749J537Q810P379M387
3202.1A10184002K754l279R859K1720P129n818N13J1301J6522J8323J7595J2231r096
3228.6A10283756m0626m4716N794N7006M7683J5319n961k6023k4235J6594M2975J3423
3253.1A10340989j5581j442J3124M602k432n579l0708o3420l5464L1399N2059K7311
3277.6A10314858j204q547j2R799K4m2117n6720j9348J9455M1247L5989j7345p9405
$$ plain form
3304.1 110196674 110128760 110138154 110202599 110266924 110302675 110315967 110326338 110327423 110297751 110255289 110243297 110257030
3328.6 110257030 110265470 110269916 110258377 110213256 110179985 110194063 110233188 110269082 110263693 110209596 110179603 110220218
3353 110220218 110272181 110271430 110233510 110206759 110194302 110145867 110061586 110032094 110097265 110172105 110187030 110174787
3377.5 110174787 110176003 110191357 110209608 110216177 110185683 110109317 110055041 110076499 110093200 110025907 109936035 109931040
3402 109931040 110007298 110066330 110066271 110040593 110024381 110044229 110088897 110103047 110083675 110069370 110047996 109993041
3426.5 109993041 109923553 109881330 109846175 109786093 109761441 109807813 109863973 109875858 109834325 109776831 109759259
3448.9 109759259 109759533 109731865 109684289 109613943 109519446 109456325 109426641 109335840 109194732 109168708 109302521
3471.3 109302521 109440005 109480953 109441698 109416914 109523952 109667766 109704757 109717798 109783685 109831166 109799147
$$ packed form
3304.1A10196674o7914R394O4445O4325L5751J3292J0371J085k9672m2462j1992J3733
3328.6A10257030Q440M446j1539m5121l3271J4078L9125L5894n389n4097k9993M0615
3353A10220218N1963p51l7920k6751j2457m8435q4281k9492O5171P4840J4925j2243
3377.5A10174787J216J5354J8251O569l0494p6366n4276K1458J6701o7293q9872m995
3402A09931040P6258N9032n9k5678j6212J9848M4668J4150j9372j4305k1374n4955
3426.5A09993041o9488m2223l5155o0082k4652M6372N6160J1885m1533n7494j7572
3448.9A09759259K74k7668m7576p0346r4497o3121k9684r0801j41108k6024J33813
3471.3A09302521J37484M0948l9255k4784J07038J43814L6991J3041O5887M7481l2019
$$ plain form
3493.8 109799147 109716392 109661734 109627914 109576547 109607244 109717762 109760809 109713197 109625959 109559262 109540212
3516.2 109540212 109520268 109462249 109373319 109319150 109343970 109386194 109399295 109392583 109373176 109381831 109443259 109482372
3540.7 109482372 109457409 109443653 109509814 109610593 109683704 109752405 109836864 109912026 109956062 109991395 110048532
3563.1 110048532 110105646 110172534 110277116 110384095 110470688 110535741 110582876 110616302 110621226 110585999 110557711
3585.5 110557711 110613024 110695004 110697031 110656083 110641980 110664153 110723269 110814738 110887611 110933530 110997772 111058378
3610 111058378 111086917 111109829 111127436 111151791 111198771 111238110 111241305 111214483 111238718 111335731 111394835 111409509
3634.5 111409509 111420310 111437297 111452937 111449468 111398959 111328840 111326313 111406219 111470366 111480808 111476088 111493278
3659 111493278 111544418 111598444 111599588 111561346 111549258 111547816 111508799 111509490 111565566 111608934 111644399 111649871 111592317
$$ packed form
3493.8A09799147q2755n4658l3820n1367L0697J10518M3047m7612q7238o6697j9050
3516.2A09540212j9944n8019q8930n4169K4820M2224J3101o712j9407Q655O1428L9113
3540.7A09482372k4963j3756O6161J00779P3111O8701Q4459P5162M4036L5333N7137
3563.1A10048532N7114O6888J04582J06979Q6593O5053M7135L3426M924l5227k8288
3585.5A10557711N5313Q1980K027m0948j4103K2173N9116R1469P2873M5919O4242O0606
3610A11058378K8539K2912J7607K4355M6980L9339L195k6822K4235R7013N9104J4674
3634.5A11409509J0801J6987J5640l469n0509p0119k527P9906O4147J0442m720J7190
3659A11493278N1140N4026J144l8242j2088j442l9017O91N6076M3368L5465N472n7554
$$ plain form
3685.5 111592317 111509979 111520469 111621749 111682141 111695325 111703634 111705554 111712337 111721826 111708462 111668098 111624956
3710 111624956 111650431 111715543 111730087 111706734 111691618 111692023 111692262 111696851 111697567 111668408 111606121 111559439 111573493
3736.5 111573493 111592925 111572397 111563635 111613977 111621952 111571074 111569333 111595631 111581182 111565125 111596727 111646056
3760.9 111646056 111658180 111642826 111616063 111609840 111653590 111704814 111715364 111675584 111637259 111644018 111657071 111663294
3785.4 111663294 111676431 111683297 111675787 111658812 111644399 111621130 111589348 111598206 111614609 111617064 111652517 111685669
3809.9 111685669 111673200 111640155 111619556 111573637 111523187 111544418 111571467 111564696 111565876 111586249 111589611 111539292
3834.4 111539292 111488998 111502385 111540663 111577427 111612594 111628866 111611032 111553633 111543643 111628771 111650455 111607480
3858.8 111607480 111575329 111587059 111608708 111588430 111569166 111576045 111595821 111639881 111649477 111628580 111624348 111594355
$$ packed form
3685.5A11592317q2338J0490J01280O0392J3184Q309J920O783R489j3364m0364m3142
3710A11624956K5475O5112J4544k3353j5116M05K39M589P16k9159o2287m6682J4054
3736.5A11573493J9432k0528q762N0342P975n0878j741K6298j4449j6057L1602M9329
3760.9A11646056J2124j5354k6763o223M3750N1224J0550l9780l8325O759J3053O223
3785.4A11663294J3137O866p510j6975j4413k3269l1782Q858J6403K455L5453L3152
3809.9A11685669j2469l3045k0599m5919n0450K1231K7049o771J180K0373L362n0319
3834.4A11539292n0294J3387L8278L6764L5167J6272j7834n7399r990Q5128K1684m2975
3858.8A11607480l2151J1730K1649k0278j9264O879J9776M4060R596k0897m232k9993
$$ plain form
3883.3 111594355 111574221 111592793 111594296 111607707 111635149 111620569 111594915 111597586 111606860 111617386 111639583 111657786
3907.8 111657786 111672282 111681485 111669481 111661088 111669612 111667585 111666453 111674392 111664379 111634624 111614740 111625504 111650705
3934.3 111650705 111655140 111642730 111634231 111630857 111632979 111626470 111618161 111635053 111650622 111640239 111633551 111642969 111646760
3960.8 111646760 111643434 111640239 111632097 111619937 111617076 111624837 111622655 111609280 111611104 111629760 111631572 111618686 111620808
3987.3 111620808 111620951 111619008 111643076 111655688 111629581
3997.5 111629581
$$ packed form
3883.3A11594355k0134J8572J503J3411K7442j4580k5654K671R274J0526K2197J8203
3907.8A11657786J4496R203j2004q393Q524k027j132P939j0013k9755j9884J0764K5201
3934.3A11650705M435j2410q499l374K122o509q309J6892J5569j0383o688R418L791
3960.8A11646760l326l195q142j2160k861P761k182j3375J824J8656J812j2886K122
3987.3A11620808J43j943K4068J2612k6107
3997.5A11629581
##END=$$ End of the data block
